{"text_format":"2","workbook":"xlsx","n_sheets":5,"sheets":["ORÇ.FINAL","CPU","BDI SERV","BDI_NOVO MODELO","CRONOGRAMA"],"not_rendered":{"charts":0,"images":3,"macros":0,"external_links":0,"defined_names":6,"comments":1,"pivot_tables":0},"unopened":[],"bounds":{"document_bytes":16777216,"sheet_cells":100000,"run_cost":"one","rows_first":2000,"rows_last":500,"rows_between":2000,"halvings":0,"cell_chars":16384,"cell_head_chars":4096},"cells_cut":0,"cells_raw":0,"read":"whole","date_system":"1900"}

{"sheet":"ORÇ.FINAL","index":0,"n_rows":25,"n_cols":10,"rows_kept":25,"cut":false,"hidden":false,"merged":[[24,1,24,2],[0,0,8,0],[0,2,0,8],[1,2,1,8],[2,2,2,8],[4,2,4,8],[5,2,5,8],[6,6,6,7],[7,1,7,2],[7,6,7,7]]}
["<---- NUMERAR SERVIÇOS PARA CPU",null,"Ministério da Integração e do Desenvolvimento Regional - MIDR"]
[null,null,"Companhia de Desenvolvimento dos Vales do São Francisco e do Parnaíba"]
[null,null,"1ª Superintendência Regional"]
[]
[null,"OBRA: ","DEMOLIÇÃO DE PASSAGENS MOLHADAS SOBRE O RIO SÃO LAMBERTO E RIBEIRÃO TRAÍRAS"]
[null,"LOCAL:","CLARO DOS POÇÕES - MG"]
[null,"DATA:","OUTUBRO / 2024",null,null,null,"BDI Serviços:",null,{"$f":"'BDI SERV'!D31/100","v":0.2419}]
[null,"PRAZO DE EXECUÇÃO:  60 DIAS"]
[null,"ITEM","DISCRIMINAÇÃO","REFER.","UNID.","QUANT.","P. UNITÁRIO","P.UNIT.C/ BDI","P. TOTAL",{"$f":"I25","v":154664.29}]
["A",1,"SERVIÇOS PRELIMINARES ",{"$nulls":5},{"$f":"SUM(I11:I15)","v":29989.079999999998},{"$f":"I10/I25","v":0.19389789330167936}]
[1,"1.1","MOBILIZAÇÃO E DESMOBILIZAÇÃO","CPU.1","GL",1,{"$f":"VLOOKUP(A11,CPU!$A$1:$N$2920,9)","v":5144.96},{"$f":"VLOOKUP(A11,CPU!$A$1:$N$2920,10)","v":6389.5258240000003},{"$f":"ROUND(F11*H11,2)","v":6389.53},{"$f":"I11/$J$9","v":4.1312251199032431E-2}]
[2,"1.2","ADMINISTRAÇÃO LOCAL E MANUTENÇÃO DO CANTEIRO DE OBRAS","CPU.2","GL",1,{"$f":"VLOOKUP(A12,CPU!$A$1:$N$2920,9)","v":13875.199999999999},{"$f":"VLOOKUP(A12,CPU!$A$1:$N$2920,10)","v":17231.61088},17231.61,{"$f":"I12/$J$9","v":0.1114129835658897}]
[3,"1.3","LIMPEZA MECANIZADA DE CAMADA VEGETAL, VEGETAÇÃO E PEQUENAS ÁRVORES (DIÂMETRO DE TRONCO MENOR QUE 0,20 M)",98525,"M2",400,{"$f":"VLOOKUP(A13,CPU!$A$1:$N$2920,9)","v":0.45},{"$f":"VLOOKUP(A13,CPU!$A$1:$N$2920,10)","v":0.55885499999999999},223.54,{"$f":"I13/$J$9","v":1.4453239335337198E-3}]
[4,"1.4","INSTALAÇÕES E CANTEIRO DE OBRAS","CPU.3","GL",2,{"$f":"VLOOKUP(A14,CPU!$A$1:$N$2920,9)","v":1989},{"$f":"VLOOKUP(A14,CPU!$A$1:$N$2920,10)","v":2470.1390999999999},4940.28,3.1941956349458553E-2]
[5,"1.5","PLACA DE OBRA EM CHAPA DE AÇO GALVANIZADO",103689,"M2",2,{"$f":"VLOOKUP(A15,CPU!$A$1:$N$2920,9)","v":484.78999999999996},{"$f":"VLOOKUP(A15,CPU!$A$1:$N$2920,10)","v":602.06070099999999},1204.1199999999999,7.785378253764976E-3]
["B",2,"SERVIÇOS DE DEMOLIÇÃO",{"$nulls":5},{"$f":"SUM(I17:I24)","v":124675.21},{"$f":"I16/I25","v":0.80610210669832061}]
[6,"2.1","EXECUÇÃO DE ENSECADEIRA COM RIP RAP PARA CONTENÇÃO PROVISÓRIA DA ÁGUA, ENCHIMENTO COM TERRA/AREIA, INCLUSIVE FORNECIMENTO DOS MATERIAIS E EXECUÇÃO","CPU.4","M3",60,{"$f":"VLOOKUP(A17,CPU!$A$1:$N$2920,9)","v":256.16999999999996},{"$f":"VLOOKUP(A17,CPU!$A$1:$N$2920,10)","v":318.13752299999993},19088.25,0.12341730595989546]
[7,"2.2","BOMBEAMENTO/ESGOTAMENTO COM BOMBA SUBMERSÍVEL",104482,"H",240,{"$f":"VLOOKUP(A18,CPU!$A$1:$N$2920,9)","v":29.71},{"$f":"VLOOKUP(A18,CPU!$A$1:$N$2920,10)","v":36.896849000000003},8855.24,5.7254586692248088E-2]
[8,"2.3","DEMOLIÇAO MECANICA DE CONCRETO ARMADO COM ESCAVADEIRA HIDRÁULICA (MARTELO ROMPEDOR)",1619003,"M3",450,{"$f":"VLOOKUP(A19,CPU!$A$1:$N$2920,9)","v":56.777376654632967},{"$f":"VLOOKUP(A19,CPU!$A$1:$N$2920,10)","v":70.511824067388687},31730.32,0.20515608354068027]
[8.5,"2.4","ARRASAMENTO MECANICO DE ESTACA DE CONCRETO ARMADO, DIAMETROS DE ATÉ 40 CM",95601,"UNID.",36,{"$f":"VLOOKUP(A20,CPU!$A$1:$N$2920,9)","v":17.23},{"$f":"VLOOKUP(A20,CPU!$A$1:$N$2920,10)","v":21.397936999999999},770.33,4.9806584312383937E-3]
[9,"2.5","CARGA, MANOBRA E DESCARGA DE ENTULHO E MATERIAL EM GERAL EM CAMINHÃO BASCULANTE",100984,"M3",800,{"$f":"VLOOKUP(A21,CPU!$A$1:$N$2920,9)","v":8.9500000000000011},{"$f":"VLOOKUP(A21,CPU!$A$1:$N$2920,10)","v":11.115005000000002},8892,5.7492262758261775E-2]
[10,"2.6","TRANSPORTE COM CAMINHÃO BASCULANTE, MATERIAL EM GERAL (AREIA, ENTULHO, ETC.), EM VIA COM REVESTIMENTO PRIMÁRIO",95426,"M3XKM",5000,{"$f":"VLOOKUP(A22,CPU!$A$1:$N$2920,9)","v":2.0300000000000002},{"$f":"VLOOKUP(A22,CPU!$A$1:$N$2920,10)","v":2.5210570000000003},12605.29,8.1500972202439237E-2]
[11,"2.7","TRANSPORTE COM CAMINHÃO BASCULANTE, MATERIAL EM GERAL (AREIA, ENTULHO, ETC.), EM VIA PAVIMENTADA",95427,"M3XKM",45000,{"$f":"VLOOKUP(A23,CPU!$A$1:$N$2920,9)","v":0.76},{"$f":"VLOOKUP(A23,CPU!$A$1:$N$2920,10)","v":0.94384400000000002},42472.98,0.2746140043057127]
[12,"2.8","REGULARIZAÇÃO DE SUPERFÍCIES COM MOTONIVELADORA",100575,"M2",1500,{"$f":"VLOOKUP(A24,CPU!$A$1:$N$2920,9)","v":0.14000000000000001},{"$f":"VLOOKUP(A24,CPU!$A$1:$N$2920,10)","v":0.17386600000000002},260.8,1.6862328078446551E-3]
[null,"TOTAL GERAL DA OBRA COM BDI ",{"$nulls":6},{"$f":"SUM(I10,I16)","v":154664.29}]

{"sheet":"CPU","index":1,"n_rows":182,"n_cols":13,"rows_kept":182,"cut":false,"hidden":false,"merged":[[70,1,70,6],[71,1,71,6],[30,0,43,0],[30,1,30,3],[30,4,30,7],[30,10,30,11],[31,2,31,5],[32,2,32,3],[33,1,33,7],[39,1,39,3],[39,5,39,6],[40,1,40,6],[41,1,41,6],[42,1,42,6],[56,1,56,3],[56,4,56,7],[56,10,56,11],[57,2,57,5],[58,2,58,3],[59,1,59,7],[68,1,68,3],[68,5,68,6],[69,1,69,6],[44,10,44,11],[45,2,45,5],[46,2,46,3],[47,1,47,7],[51,1,51,3],[51,5,51,6],[52,1,52,6],[53,1,53,6],[54,1,54,6],[12,1,12,6],[13,1,13,6],[15,1,15,3],[15,4,15,7],[15,10,15,11],[16,2,16,5],[17,2,17,3],[0,0,14,0],[15,0,29,0],[0,1,0,3],[0,4,0,7],[0,10,0,11],[1,2,1,5],[2,2,2,3],[3,1,3,7],[10,1,10,3],[10,5,10,6],[11,1,11,6],[18,1,18,7],[25,1,25,3],[25,5,25,6],[26,1,26,6],[27,1,27,6],[28,1,28,6],[44,0,55,0],[56,0,72,0],[73,0,86,0],[73,1,73,3],[73,4,73,7],[73,10,73,11],[74,2,74,5],[75,2,75,3],[76,1,76,7],[82,1,82,3],[82,5,82,6],[83,1,83,6],[84,1,84,6],[85,1,85,6],[78,11,78,13],[79,11,79,13],[80,11,80,13],[81,11,81,13],[82,11,82,13],[83,11,83,13],[84,11,84,13],[77,11,77,14],[44,1,44,3],[44,4,44,7],[87,0,100,0],[87,1,87,3],[87,4,87,7],[87,10,87,11],[88,2,88,5],[89,2,89,3],[90,1,90,7],[96,1,96,3],[96,5,96,6],[97,1,97,6],[98,1,98,6],[99,1,99,6],[101,0,114,0],[101,1,101,3],[101,4,101,7],[101,10,101,11],[102,2,102,5],[103,2,103,3],[104,1,104,7],[110,1,110,3],[110,5,110,6],[111,1,111,6],[112,1,112,6],[113,1,113,6],[128,0,142,0],[128,1,128,3],[128,4,128,7],[128,10,128,11],[129,2,129,5],[130,2,130,3],[131,1,131,7],[138,1,138,3],[138,5,138,6],[139,1,139,6],[140,1,140,6],[141,1,141,6],[143,0,155,0],[143,1,143,3],[143,4,143,7],[143,10,143,11],[144,2,144,5],[145,2,145,3],[146,1,146,7],[151,1,151,3],[151,5,151,6],[152,1,152,6],[153,1,153,6],[154,1,154,6],[156,0,168,0],[156,1,156,3],[156,4,156,7],[156,10,156,11],[157,2,157,5],[158,2,158,3],[159,1,159,7],[164,1,164,3],[164,5,164,6],[165,1,165,6],[166,1,166,6],[167,1,167,6],[169,0,182,0],[169,1,169,3],[169,4,169,7],[169,10,169,11],[170,2,170,5],[171,2,171,3],[172,1,172,7],[178,1,178,3],[178,5,178,6],[179,1,179,6],[180,1,180,6],[181,1,181,6],[125,1,125,6],[126,1,126,6],[115,1,115,3],[115,4,115,7],[116,2,116,5],[117,2,117,3],[118,1,118,7],[115,0,123,0],[123,1,123,3],[123,5,123,6],[124,1,124,6]]}
[1,"CODEVASF",null,null," COMPOSIÇÃO DE PREÇO UNITÁRIO",null,null,null,{"$f":"H12","v":5144.96},{"$f":"H14","v":6389.5258240000003},"BDI CALCULADO:",null,{"$f":"ORÇ.FINAL!I7","v":0.2419}]
[null,"OBRA:  ",{"$f":"ORÇ.FINAL!C5","v":"DEMOLIÇÃO DE PASSAGENS MOLHADAS SOBRE O RIO SÃO LAMBERTO E RIBEIRÃO TRAÍRAS"},null,null,null,"DATA: ",{"$f":"ORÇ.FINAL!C7","v":"OUTUBRO / 2024"}]
[null,"SERVIÇO:  ",{"$f":"VLOOKUP(A1,ORÇ.FINAL!A:I,3,0)","v":"MOBILIZAÇÃO E DESMOBILIZAÇÃO"},null,"Referência:",{"$f":"VLOOKUP(A1,ORÇ.FINAL!A:I,4,0)","v":"CPU.1"},"UNIDADE: ",{"$f":"VLOOKUP(A1,ORÇ.FINAL!A:I,5,0)","v":"GL"},"OK"]
[]
[null,"TIPO ITEM","CODIGO ITEM","DESCRIÇÃO ITEM","UNIDADE ITEM","COEFICIENTE","PRECO UNITARIO","CUSTO TOTAL"]
[null,"COMPOSICAO",73467,"CAMINHÃO TOCO, PBT 14.300 KG, CARGA ÚTIL MÁX. 9.710 KG, DIST. ENTRE EIXOS 3,56 M, POTÊNCIA 185 CV, INCLUSIVE CARROCERIA FIXA ABERTA DE MADEIRA P/ TRANSPORTE GERAL DE CARGA SECA, DIMEN. APROX. 2,50 X 6,50 X 0,50M","CHP DIURNO.",4,"244,20",{"$f":"ROUNDDOWN(F6*G6,2)","v":976.8}]
[null,"COMPOSICAO",91395,"CAMINHÃO TOCO, PBT 14.300 KG, CARGA ÚTIL MÁX. 9.710 KG, DIST. ENTRE EIXOS 3,56 M, POTÊNCIA 185 CV, INCLUSIVE CARROCERIA FIXA ABERTA DE MADEIRA P/ TRANSPORTE GERAL DE CARGA SECA, DIMEN. APROX. 2,50 X 6,50 X 0,50M","CHI DIURNO.",4,"59,34",{"$f":"ROUNDDOWN(F7*G7,2)","v":237.36}]
[null,"COMPOSICAO",5914640,"TRANSPORTE COM CAVALO MECÂNICO COM SEMIRREBOQUE COM CAPACIDADE DE 30 T - RODOVIA PAVIMENTADA","TON*KM",2134,0.56000000000000005,1195.04]
[null,"COMPOSIÇÃO",88316,"SERVENTE COM ENCARGOS COMPLEMENTARES","H",8,20.41,163.28]
[{"$nulls":7},0]
[null,"PRODUÇÃO DA EQUIPE",null,null,0.5,"CUSTO ",null,{"$f":"SUM(H6:H10)","v":2572.48}]
[null,"TOTAL",{"$nulls":5},{"$f":"H11/E11","v":5144.96},"OK"]
[null,"BDI                %",{"$nulls":5},{"$f":"1+$M$1","v":1.2419}]
[null,"TOTAL DO SERVIÇO - R$",{"$nulls":5},{"$f":"H12*H13","v":6389.5258240000003}]
[]
[{"$f":"A1+1","v":2},"CODEVASF",null,null," COMPOSIÇÃO DE PREÇO UNITÁRIO",null,null,null,{"$f":"H27","v":13875.199999999999},{"$f":"H29","v":17231.61088}]
[null,"OBRA:  ",{"$f":"$C$2","v":"DEMOLIÇÃO DE PASSAGENS MOLHADAS SOBRE O RIO SÃO LAMBERTO E RIBEIRÃO TRAÍRAS"},null,null,null,"DATA: ",{"$f":"$H$2","v":"OUTUBRO / 2024"}]
[null,"SERVIÇO:  ",{"$f":"VLOOKUP(A16,ORÇ.FINAL!A:I,3,0)","v":"ADMINISTRAÇÃO LOCAL E MANUTENÇÃO DO CANTEIRO DE OBRAS"},null,"SINAPI",{"$f":"VLOOKUP(A16,ORÇ.FINAL!A:I,4,0)","v":"CPU.2"},"UNIDADE: ",{"$f":"VLOOKUP(A16,ORÇ.FINAL!A:I,5,0)","v":"GL"},"OK"]
[]
[null,"TIPO ITEM","CODIGO ITEM","DESCRIÇÃO ITEM","UNIDADE ITEM","COEFICIENTE","PRECO UNITARIO","CUSTO TOTAL"]
[null,"INSUMO",3346,"LOCACAO DE GRUPO GERADOR *80 A 125* KVA, MOTOR DIESEL, REBOCAVEL","H",{"$f":"8*30","v":240},20.3,{"$f":"ROUNDDOWN(F21*G21,2)","v":4872}]
[null,"COTAÇÃO","MERC.","VEÍCULO PARA TRANSPORTE DE PESSOAL, INCLUSIVE COMBUSTÍVEL","VB",1,600,600]
[null,"COMPOSICAO",90777,"ENGENHEIRO CIVIL DE OBRA COM ENCARGOS COMPLEMENTARES","H",22,"118,01",2596.2199999999998]
[null,"COMPOSIÇÃO",100309,"TÉCNICO EM SEGURANÇA DO TRABALHO COM ENCARGOS COMPLEMENTARES","H",22,"38,34",843.48]
[null,"COMPOSICAO",90776,"ENCARREGADO GERAL COM ENCARGOS COMPLEMENTARES","H",90,"55,15",4963.5]
[null,"PRODUÇÃO DA EQUIPE",null,null,1,"CUSTO ",null,{"$f":"SUM(H21:H25)","v":13875.199999999999}]
[null,"TOTAL",{"$nulls":5},{"$f":"H26/E26","v":13875.199999999999},"OK"]
[null,"BDI                %",{"$nulls":5},{"$f":"1+$M$1","v":1.2419}]
[null,"TOTAL DO SERVIÇO - R$",{"$nulls":5},{"$f":"H27*H28","v":17231.61088}]
[]
[3,"CODEVASF",null,null," COMPOSIÇÃO DE PREÇO UNITÁRIO",null,null,null,{"$f":"H41","v":0.45},{"$f":"H43","v":0.55885499999999999}]
[null,"OBRA:  ",{"$f":"$C$2","v":"DEMOLIÇÃO DE PASSAGENS MOLHADAS SOBRE O RIO SÃO LAMBERTO E RIBEIRÃO TRAÍRAS"},null,null,null,"DATA: ",{"$f":"$H$2","v":"OUTUBRO / 2024"}]
[null,"SERVIÇO:  ",{"$f":"VLOOKUP(A31,ORÇ.FINAL!A:I,3,0)","v":"LIMPEZA MECANIZADA DE CAMADA VEGETAL, VEGETAÇÃO E PEQUENAS ÁRVORES (DIÂMETRO DE TRONCO MENOR QUE 0,20 M)"},null,"SINAPI",{"$f":"VLOOKUP(A31,ORÇ.FINAL!A:I,4,0)","v":98525},"UNIDADE: ",{"$f":"VLOOKUP(A31,ORÇ.FINAL!A:I,5,0)","v":"M2"},"OK"]
[]
[null,"TIPO ITEM","CODIGO ITEM","DESCRIÇÃO ITEM","UNIDADE ITEM","COEFICIENTE","PRECO UNITARIO","CUSTO TOTAL"]
[null,"COMPOSICAO",88316,"SERVENTE COM ENCARGOS COMPLEMENTARES","H","0,0030000","20,41",{"$f":"ROUNDDOWN(F36*G36,2)","v":0.06}]
[null,"COMPOSICAO",88441,"JARDINEIRO COM ENCARGOS COMPLEMENTARES","H","0,0030000","23,84",7.0000000000000007E-2]
[null,"COMPOSICAO",89031,"TRATOR DE ESTEIRAS, POTÊNCIA 100 HP, PESO OPERACIONAL 9,4 T, COM LÂMINA 2,19 M3","CHI","0,0024000","84,19",0.2]
[null,"COMPOSICAO",89032,"TRATOR DE ESTEIRAS, POTÊNCIA 100 HP, PESO OPERACIONAL 9,4 T, COM LÂMINA 2,19 M3","CHP","0,0006000","207,13",0.12]
[null,"PRODUÇÃO DA EQUIPE",null,null,1,"CUSTO ",null,{"$f":"SUM(H36:H39)","v":0.45}]
[null,"TOTAL",{"$nulls":5},{"$f":"H40/E40","v":0.45},"OK"]
[null,"BDI                %",{"$nulls":5},{"$f":"1+$M$1","v":1.2419}]
[null,"TOTAL DO SERVIÇO - R$",{"$nulls":5},{"$f":"H41*H42","v":0.55885499999999999}]
[]
[4,"CODEVASF",null,null," COMPOSIÇÃO DE PREÇO UNITÁRIO",null,null,null,{"$f":"H53","v":1989},{"$f":"H55","v":2470.1390999999999}]
[null,"OBRA:  ",{"$f":"$C$2","v":"DEMOLIÇÃO DE PASSAGENS MOLHADAS SOBRE O RIO SÃO LAMBERTO E RIBEIRÃO TRAÍRAS"},null,null,null,"DATA: ",{"$f":"$H$2","v":"OUTUBRO / 2024"}]
[null,"SERVIÇO:  ",{"$f":"VLOOKUP(A45,ORÇ.FINAL!A:I,3,0)","v":"INSTALAÇÕES E CANTEIRO DE OBRAS"},null,"SINAPI",{"$f":"VLOOKUP(A45,ORÇ.FINAL!A:I,4,0)","v":"CPU.3"},"UNIDADE: ",{"$f":"VLOOKUP(A45,ORÇ.FINAL!A:I,5,0)","v":"GL"}]
[]
[null,"TIPO ITEM","CODIGO ITEM","DESCRIÇÃO ITEM","UNIDADE ITEM","COEFICIENTE","PRECO UNITARIO","CUSTO TOTAL"]
[null,"INSUMO",10775,"LOCACAO DE CONTAINER 2,30 X 6,00M, ALT. 2,50 M, COM SANITARIO, PARA ESCRITORIO, COMPLETO, SEM DIVISORIAS INTERNAS","MÊS",2,930,{"$f":"ROUNDDOWN(F50*G50,2)","v":1860}]
[null,"INSUMO",37524,"TELA PLASTICA LARANJA, TIPO TAPUME PARA SINALIZACAO, MALHA RETANGULAR","M",60,2.15,129]
[null,"PRODUÇÃO DA EQUIPE",null,null,1,"CUSTO ",null,{"$f":"SUM(H50:H51)","v":1989}]
[null,"TOTAL",{"$nulls":5},{"$f":"H52/E52","v":1989},"OK"]
[null,"BDI                %",{"$nulls":5},{"$f":"1+$M$1","v":1.2419}]
[null,"TOTAL DO SERVIÇO - R$",{"$nulls":5},{"$f":"H53*H54","v":2470.1390999999999}]
[]
[{"$f":"A45+1","v":5},"CODEVASF",null,null," COMPOSIÇÃO DE PREÇO UNITÁRIO",null,null,null,{"$f":"H70","v":484.78999999999996},{"$f":"H72","v":602.06070099999999}]
[null,"OBRA:  ",{"$f":"$C$2","v":"DEMOLIÇÃO DE PASSAGENS MOLHADAS SOBRE O RIO SÃO LAMBERTO E RIBEIRÃO TRAÍRAS"},null,null,null,"DATA: ",{"$f":"$H$2","v":"OUTUBRO / 2024"}]
[null,"SERVIÇO:  ",{"$f":"VLOOKUP(A57,ORÇ.FINAL!A:I,3,0)","v":"PLACA DE OBRA EM CHAPA DE AÇO GALVANIZADO"},null,"SINAPI",{"$f":"VLOOKUP(A57,ORÇ.FINAL!A:I,4,0)","v":103689},"UNIDADE: ",{"$f":"VLOOKUP(A57,ORÇ.FINAL!A:I,5,0)","v":"M2"},"OK"]
[]
[null,"TIPO ITEM","CODIGO ITEM","DESCRIÇÃO ITEM","UNIDADE ITEM","COEFICIENTE","PRECO UNITARIO","CUSTO TOTAL"]
[null,"INSUMO",4509,"SARRAFO *2,5 X 10* CM EM PINUS, MISTA OU EQUIVALENTE DA REGIAO - BRUTA","M","3,2083000","4,02",{"$f":"ROUNDDOWN(F62*G62,2)","v":12.89}]
[null,"INSUMO",4813,"PLACA DE OBRA (PARA CONSTRUCAO CIVIL) EM CHAPA GALVANIZADA *N. 22*, ADESIVADA, DE *2,4 X 1,2* M (SEM POSTES PARA FIXACAO)","M2","1,0000000","429,50",429.5]
[null,"INSUMO",5065,"PREGO DE ACO POLIDO COM CABECA 10 X 10 (7/8 X 17)","KG","0,0113000","35,12",0.39]
[null,"INSUMO",5069,"PREGO DE ACO POLIDO COM CABECA 17 X 27 (2 1/2 X 11)","KG","0,0132000","18,82",0.24]
[null,"COMPOSICAO",88262,"CARPINTEIRO DE FORMAS COM ENCARGOS COMPLEMENTARES","H","0,3729000","27,77",10.35]
[null,"COMPOSICAO",88316,"SERVENTE COM ENCARGOS COMPLEMENTARES","H","1,1186000","20,41",22.83]
[null,"COMPOSICAO",94962,"CONCRETO MAGRO PARA LASTRO, TRAÇO 1:4,5:4,5 (CIMENTO/ AREIA MÉDIA/ BRITA 1)  - PREPARO MECÂNICO COM BETONEIRA 400 L","M3",0.02,429.71,8.59]
[null,"PRODUÇÃO DA EQUIPE",null,null,1,"CUSTO ",null,{"$f":"SUM(H62:H68)","v":484.78999999999996}]
[null,"TOTAL",{"$nulls":5},{"$f":"H69/E69","v":484.78999999999996},"OK"]
[null,"BDI                %",{"$nulls":5},{"$f":"1+$M$1","v":1.2419}]
[null,"TOTAL DO SERVIÇO - R$",{"$nulls":5},{"$f":"H70*H71","v":602.06070099999999}]
[]
[{"$f":"A57+1","v":6},"CODEVASF",null,null," COMPOSIÇÃO DE PREÇO UNITÁRIO",null,null,null,{"$f":"H84","v":256.16999999999996},{"$f":"H86","v":318.13752299999993}]
[null,"OBRA:  ",{"$f":"$C$2","v":"DEMOLIÇÃO DE PASSAGENS MOLHADAS SOBRE O RIO SÃO LAMBERTO E RIBEIRÃO TRAÍRAS"},null,null,null,"DATA: ",{"$f":"$H$2","v":"OUTUBRO / 2024"}]
[null,"SERVIÇO:  ",{"$f":"VLOOKUP(A74,ORÇ.FINAL!A:I,3,0)","v":"EXECUÇÃO DE ENSECADEIRA COM RIP RAP PARA CONTENÇÃO PROVISÓRIA DA ÁGUA, ENCHIMENTO COM TERRA/AREIA, INCLUSIVE FORNECIMENTO DOS MATERIAIS E EXECUÇÃO"},null,"SINAPI",{"$f":"VLOOKUP(A74,ORÇ.FINAL!A:I,4,0)","v":"CPU.4"},"UNIDADE: ",{"$f":"VLOOKUP(A74,ORÇ.FINAL!A:I,5,0)","v":"M3"},"OK"]
[]
[null,"TIPO ITEM","CODIGO ITEM","DESCRIÇÃO ITEM","UNIDADE ITEM","COEFICIENTE","PRECO UNITARIO","CUSTO TOTAL"]
[null,"INSUMO",37526,"SACO DE RAFIA PARA ENTULHO, NOVO, LISO (SEM CLICHE), *60 x 90* CM","UNID.",20,2.88,{"$f":"ROUNDDOWN(F79*G79,2)","v":57.6}]
[null,"INSUMO",370,"AREIA MEDIA - POSTO JAZIDA/FORNECEDOR (RETIRADO NA JAZIDA, SEM TRANSPORTE)","M3",1,130,130]
{"$rows_left_out":103}
{"sheet":"BDI SERV","index":2,"n_rows":37,"n_cols":5,"rows_kept":37,"cut":false,"hidden":false,"merged":[[36,0,36,5],[3,1,4,1],[3,2,4,2],[0,1,2,4],[32,0,34,5],[28,0,28,5],[30,1,30,2],[31,1,31,2]]}
[null,"DETALHAMENTO DO BDI - SERVIÇOS"]
[]
[]
[null,"Item","Descrição dos Serviços","%","%"]
[null,null,null,"PV","CD"]
[]
[null,1,"ADMINISTRAÇÃO CENTRAL"," ",4]
[null,"1.1","ESCRITÓRIO CENTRAL"," "," "]
[null,"1.2","VIAGENS"," "," "]
[null,"1.3","OUTROS"," "," "]
[null," "," "," "," "]
[null,2,"IMPOSTOS E TAXAS",{"$f":"SUM(D13:D16)","v":6.65},{"$f":"SUM(E13:E16)","v":8.31}]
[null,"2.1","ISS (*)",3,{"$f":"ROUND(D13*1.2515,2)","v":3.75}]
[null,"2.2","PIS",0.65,0.81]
[null,"2.3","Cofins",3,3.75]
[null,"2.4","CONTRIBUIÇÃO PREVIDENCIÁRIA SOBRE A RENDA BRUTA",0,0]
[]
[null,3,"TAXA DE RISCO"," ",{"$f":"SUM(E19:E22)","v":2.2599999999999998}]
[null,"3.1","SEGURO",null,0.4]
[null,"3.2","RISCO",null,1.46]
[null,"3.3","GARANTIA",null,0.4]
[]
[null,4,"DESPESAS FINANCEIRAS"," ",1.02]
[]
[null,5,"LUCRO",null,8]
[]
[null," ","BDI - CALCULADO"," ",{"$f":"ROUND((((1+(E7+E18)/100)*(1+E23/100)*(1+E25/100)/(1-D12/100)-1)*100),2)","v":24.19}]
[]
["BDI = ((1+((AC+S+R+G)/100))x(1+DF/100)x(1+L/100)/(1-I/100)-1)*100"]
[]
[null,"BDI (CALCULADO):",null,{"$f":"ROUND((((1+((E7+E18)/100))*(1+E23/100)*(1+E25/100))/(1-D12/100)-1)*100,2)","v":24.19},"%"]
[null," "]
["(*) ISS Conforme Lei Complementar nº 001/2001, de 18 de setembro de 2001 - Art. 47 § 6º - \nSem necessidade de comprovação dos materiais"]
[]
[]
[]
["BDI EM CONFORMIDADE COM OS ACÓRDÃOS Nº 2369/2011 e ACÓRDÃO Nº 2.622/2013 - TCU - PLENÁRIO"]

{"sheet":"BDI_NOVO MODELO","index":3,"n_rows":60,"n_cols":5,"rows_kept":60,"cut":false,"hidden":false,"merged":[[36,0,36,5],[38,1,38,4],[39,2,39,3],[0,1,2,4],[25,1,25,3],[26,1,26,2],[26,3,26,4],[27,3,27,4],[35,0,35,5]]}
[null,"DETALHAMENTO DO BDI - SERVIÇOS"]
[]
[]
[null,"Item","Descrição dos Serviços","% - PV","% - CD"]
[]
[null,1,"ADMINISTRAÇÃO CENTRAL"," ",{"$f":"SUM(E7:E9)","v":4}]
[null,"1.1","ESCRITÓRIO CENTRAL",null,4]
[null,"1.2","VIAGENS"]
[null,"1.3","OUTROS"]
[null," "," "," "," "]
[null,2,"IMPOSTOS E TAXAS",{"$f":"SUM(D12:D15)","v":6.65},{"$f":"SUM(E12:E15)","v":0}]
[null,"2.1","ISS - Proposta",3]
[null,"2.2","PIS",0.65]
[null,"2.3","Cofins",3]
[null,"2.4","Contribuição Previdenciaria (CPRB)"]
[]
[null,3,"TAXA DE RISCO",null,{"$f":"SUM(E18:E20)","v":2.2599999999999998}]
[null,"3.1","SEGURO",null,0.4]
[null,"3.2","RISCO",null,1.46]
[null,"3.3","GARANTIA",null,0.4]
[]
[null,4,"DESPESAS FINANCEIRAS",null,1.02]
[]
[null,5,"LUCRO",null,8]
[]
[null,"BDI APRESENTADO:",null,null,{"$f":"IF($D$41=$C$43,$D$43,IF($D$41=$C$44,$D$44,IF($D$41=$C$44,$D$44,IF($D$41=$C$45,$D$45,0))))","v":24.19}]
[]
[null,null,"Legislação Municipal:","Cod. Tributário - Lei nº 001/2001 - Art. 65 - Grupo A"]
[null,null,"Município:","Claro dos Poções/MG"]
[null,null,"Alíquota ISSQN:",0.03,"Município"]
[null,null,"Base de Cálculo:",1,"Art. 65, Quadro \"Grupo A\""]
[null,null,"Valor Serviço:",{"$f":"ORÇ.FINAL!I25","v":154664.29}]
[null,null,"Dedução - Material (estimado):",{"$f":"0*D32","v":0},{"$f":"D33/D32","v":0}]
[null,null,"ISSQN BDI:",{"$f":"IF(D32=\"\",0,ROUND(IF(D31=D49,((1-(D33/D32))*D30),D30*D31),4))","v":0.03},"(*)"]
[]
["Acórdão nº 2.622/2013 - TCU Plenário"]
["BDI = ARRED((((((1+(AC+TR)/100)*(1+DF/100)*(1+L/100))/(1-IMP/100))-1)*100);2)"]
[]
[null,"(*) É obrigação da licitante a verificação da Legislação Tributária vigente no município, bem como o cálculo dos valores totais de serviços e materiais estimados, para apresentação de sua proposta."]
[]
[null,null,"Forma de Cálculo do BDI:","BDI - Acórdão nº 2.622/2013 - TCU"]
[]
[null,null,"BDI - Digitado",{"$f":"ROUND(E6+E11+E17+E22+E24,2)","v":15.28}]
[null,null,"BDI - Calculado",{"$f":"ROUND((((1+(E6/100+E22/100+E17/100))/(1-(D11/100+E24/100)))-1)*100,2)","v":25.69}]
[null,null,"BDI - Acórdão nº 2.622/2013 - TCU",{"$f":"ROUND((((((1+(E6+E17)/100)*(1+E22/100)*(1+E24/100))/(1-D11/100))-1)*100),2)","v":24.19}]
[]
[]
[]
[null,null,null,"Dedução - Material","Município"]
[null,null,null,0.1,"Simples Nacional"]
[null,null,null,0.2,"Municípios Indefinidos"]
[null,null,null,0.3]
[null,null,null,0.4]
[null,null,null,0.5]
[null,null,null,0.6]
[null,null,null,0.7]
[null,null,null,0.8]
[null,null,null,0.9]
[null,null,null,1]
[null,null,null,{"$f":"E31","v":"Art. 65, Quadro \"Grupo A\""}]

{"sheet":"CRONOGRAMA","index":4,"n_rows":12,"n_cols":8,"rows_kept":12,"cut":false,"hidden":false,"merged":[[0,1,0,7],[3,1,3,5],[5,0,6,0],[5,2,6,2],[1,1,2,1],[5,1,6,1],[1,2,2,4],[1,6,1,7],[2,6,2,7],[9,1,10,2],[11,1,15,7],[7,2,8,2],[7,1,8,1],[7,0,8,0]]}
[null,"CRONOGRAMA FÍSICO-FINANCEIRO"]
[null,"OBRA: ",{"$f":"ORÇ.FINAL!C5","v":"DEMOLIÇÃO DE PASSAGENS MOLHADAS SOBRE O RIO SÃO LAMBERTO E RIBEIRÃO TRAÍRAS"},null,null,"VALOR:",{"$f":"ORÇ.FINAL!I25","v":154664.29}]
[{"$nulls":5},"PRAZO EXEC.: ","60 DIAS"]
[]
[null,"ITEM","ETAPAS/DESCRIÇAO","FISICO/  FINANCEIRO","TOTAL    ETAPAS","MÊS 1","MÊS 2","TOTAL"]
["A",{"$f":"VLOOKUP(A6,ORÇ.FINAL!A:I,2,0)","v":1},{"$f":"VLOOKUP(A6,ORÇ.FINAL!A:I,3,3)","v":"SERVIÇOS PRELIMINARES "},"FISICO ",{"$f":"ROUND(E7/G2,4)","v":0.19389999999999999},0.6,0.4,{"$f":"SUM(F6:G6)","v":1}]
[null,null,null,"FINANCEIRO",{"$f":"ORÇ.FINAL!I10","v":29989.079999999998},{"$f":"ROUND($E$7*F6,2)","v":17993.45},11995.63,29989.08]
["B",{"$f":"VLOOKUP(A8,ORÇ.FINAL!A:I,2,0)","v":2},{"$f":"VLOOKUP(A8,ORÇ.FINAL!A:I,3,3)","v":"SERVIÇOS DE DEMOLIÇÃO"},"FISICO ",{"$f":"ROUND(E9/G2,4)","v":0.80610000000000004},0.55000000000000004,0.45,1]
[null,null,null,"FINANCEIRO",{"$f":"ORÇ.FINAL!I16","v":124675.21},{"$f":"ROUND($E$9*F8,2)","v":68571.37},56103.839999999997,124675.20999999999]
[null,"TOTAL",null,"FISICO ",{"$f":"SUM(F10:F10)","v":0.55969493669159176},{"$f":"F11/E11","v":0.55969493669159176},{"$f":"G11/F11","v":0.78668759433682189},1.3463825310284137]
[null,null,null,"FINANCEIRO",{"$f":"E9+E7","v":154664.29},{"$f":"F7+F9","v":86564.819999999992},{"$f":"G7+G9","v":68099.47},154664.28999999998]
[null,"OBSERVAÇÕES:"]