{"text_format":"2","workbook":"xlsx","n_sheets":16,"sheets":["1.MONTES CLAROS","2.JANUÁRIA","3.JANAÚBA","4.PIRAPORA","5.CURVELO","6.SALINAS","7.CAPELINHA","8.JEQUITINHONHA","CRONOG","CPU","MOB","CANT","ADM.LOC.","PROJ.EXEC.","BDI","ENC.SOC."],"not_rendered":{"charts":0,"images":4,"macros":0,"external_links":203,"defined_names":31319,"comments":0,"pivot_tables":0},"unopened":[],"bounds":{"document_bytes":16777216,"sheet_cells":100000,"run_cost":"one","rows_first":2000,"rows_last":500,"rows_between":2000,"halvings":0,"cell_chars":16384,"cell_head_chars":4096},"cells_cut":0,"cells_raw":0,"read":"whole","date_system":"1900"}

{"sheet":"1.MONTES CLAROS","index":0,"n_rows":7543,"n_cols":30,"rows_kept":7543,"cut":false,"hidden":false,"merged":[[57,1,57,12],[35,4,35,7],[37,4,37,7],[44,4,44,7],[46,4,46,7],[55,4,55,7],[48,4,48,7],[49,4,49,7],[50,4,50,7],[51,4,51,7],[52,4,52,7],[53,4,53,7],[56,4,56,7],[40,4,40,7],[54,4,54,7],[41,4,41,7],[4,1,4,13],[5,1,8,1],[5,2,8,2],[5,3,8,3],[5,4,8,7],[6,9,7,9],[6,12,8,12],[6,13,8,13],[17,4,17,7],[18,4,18,7],[19,4,19,7],[42,4,42,7],[26,4,26,7],[33,4,33,7],[24,4,24,7],[36,4,36,7],[38,4,38,7],[30,4,30,7],[23,4,23,7],[34,4,34,7],[32,4,32,7],[25,4,25,7],[1,1,3,11],[9,4,9,7],[31,4,31,7],[29,4,29,7],[27,4,27,7],[28,4,28,7],[20,4,20,7],[21,4,21,7],[22,4,22,7],[15,4,15,7],[10,4,10,7],[13,4,13,7],[14,4,14,7],[12,4,12,7],[16,4,16,7],[11,4,11,7]]}
[]
[null,"LOGOTIPO DA EMPRESA"]
[]
[{"$nulls":12},"Data Base do Orçamento","2024-08-01"]
[null,"CONTRATAÇÃO DE SERVIÇOS DE PAVIMENTAÇÃO ASFÁLTICA COM CONCRETO BETUMINOSO USINADO A QUENTE (CBUQ) EM VIAS URBANAS E RURAIS INSERIDAS NA ÁREA DE ATUAÇÃO DA 1ª SUPERINTENDÊNCIA REGIONAL DA CODEVASF, NO ESTADO DE MINAS GERAIS - ITEM 1: MONTES CLAROS/MG"]
[null,"ITEM","ORIGEM\nCOMPOSIÇÃO","CÓDIGO\nCOMPOSIÇÃO","DISCRIMINAÇÃO DOS SERVIÇOS",null,null,null,"BDI % = ",{"$f":"BDI!C17","v":0},"BDI  DIFERENCIADO% =",{"$f":"BDI!C33","v":0},"R$/m²",{"$f":"N58/I8","v":0},{"$f":"N58","v":0}]
[{"$nulls":8},"Total de m²","Encargos Sociais:","Horista","Mensalista","PREÇO UNITÁRIO COM BDI","PREÇO TOTAL COM BDI "]
[{"$nulls":8},84000,null,{"$f":"'ENC.SOC.'!$E$51","v":0},{"$f":"'ENC.SOC.'!$F$51","v":0}]
[{"$nulls":8},"UND","QTDE.","BDI","PREÇO UNITÁRIO "]
[{"$nulls":4},"MOBILIZAÇÃO/DESMOBILIZAÇÃO"]
[null,1,"Codevasf","Mob","Mobilização",null,null,null,"kmxfrente",720,{"$f":"(M11/L11-1)","v":{"$error":"#DIV/0!"}},null,{"$f":"L11*(1+$J$6)","v":0},{"$f":"M11*J11","v":0},{"$f":"N11/$N$58","v":{"$error":"#DIV/0!"}}]
[null,2,"Codevasf","Mob","Desmobilização",null,null,null,"kmxfrente",720,{"$f":"(M12/L12-1)","v":{"$error":"#DIV/0!"}},null,{"$f":"L12*(1+$J$6)","v":0},{"$f":"M12*J12","v":0},{"$f":"N12/$N$58","v":{"$error":"#DIV/0!"}}]
[{"$nulls":4},"INSTALAÇÃO DE CANTEIRO"]
[null,3,"Codevasf","Canteiro","Canteiro de Obras e Almoxarifado",null,null,null,"frente",8,{"$f":"(M14/L14-1)","v":{"$error":"#DIV/0!"}},null,{"$f":"L14*(1+$J$6)","v":0},{"$f":"ROUND(ROUND(J14,2)*ROUND(M14,6),2)","v":0},{"$f":"N14/N58","v":{"$error":"#DIV/0!"}}]
[null,4,"SINAPI",103689,"FORNECIMENTO E INSTALAÇÃO DE PLACA DE OBRA COM CHAPA GALVANIZADA E ESTRUTURA DE MADEIRA",null,null,null,"m²",128,{"$f":"(M15/L15-1)","v":{"$error":"#DIV/0!"}},null,0,{"$f":"ROUND(ROUND(J15,2)*ROUND(M15,6),2)","v":0}]
[{"$nulls":4},"ADMINISTRAÇÃO LOCAL DA OBRA"]
[null,5,"Codevasf","Adm Local","Administração Local da Obra",null,null,null,"und",1,{"$f":"(M17/L17-1)","v":{"$error":"#DIV/0!"}},null,{"$f":"L17*(1+$J$6)","v":0},{"$f":"ROUND(ROUND(J17,2)*ROUND(M17,6),2)","v":0},{"$f":"N17/N58","v":{"$error":"#DIV/0!"}}]
[{"$nulls":4},"TERRAPLANAGEM"]
[null,6,"SICRO",5502114,"Escavação, carga e transporte de material de 1ª categoria - DMT de 1.000 a 1.200 m - caminho de serviço em leito natural - com escavadeira e caminhão basculante de 14 m³",null,null,null,"m³",29399.999999999996,{"$f":"M19/L19-1","v":{"$error":"#DIV/0!"}},null,{"$f":"L19*(1+$J$6)","v":0},{"$f":"ROUND(ROUND(J19,2)*ROUND(M19,6),2)","v":0}]
[null,7,"SICRO",4413942,"Espalhamento de material em bota-fora",null,null,null,"m³",29399.999999999996,{"$error":"#DIV/0!"},null,0,0,{"$nulls":15},1]
[{"$nulls":4},"PAVIMENTAÇÃO"]
[null,8,"SICRO",4011463,"Concreto asfáltico - faixa C - areia e brita comerciais",null,null,null,"t",10080,{"$f":"M22/L22-1","v":{"$error":"#DIV/0!"}},null,{"$f":"L22*(1+$J$6)","v":0},{"$f":"ROUND(ROUND(J22,2)*ROUND(M22,6),2)","v":0}]
[null,9,"SICRO",4011352,"Imprimação com emulsão asfáltica",null,null,null,"m²",84000,{"$error":"#DIV/0!"},null,0,0]
[null,10,"SICRO",4011353,"Pintura de ligação",null,null,null,"m²",84000,{"$error":"#DIV/0!"},null,0,0]
[null,11,"SICRO",4011268,"Base estabilizada granulometricamente com mistura solo brita (70% - 30%) em usina com material de jazida e brita comercial",null,null,null,"m³",12600,{"$error":"#DIV/0!"},null,0,0]
[null,12,"SICRO",4011228,"Sub-base estabilizada granulometricamente com mistura de solos na pista com material de jazida",null,null,null,"m³",12600,{"$error":"#DIV/0!"},null,0,0]
[null,13,"SICRO",4011209,"Regularização do subleito",null,null,null,"m²",84000,{"$error":"#DIV/0!"},null,0,0]
[{"$nulls":4},"AQUISIÇÃO E TRANSPORTE DO MATERIAL BETUMINOSO"]
[null,14,"CODEVASF","CPU-13","AQUISIÇÃO DE CIMENTO ASFALTICO CAP 50/70",null,null,null,"t",650.05999999999995,{"$f":"M29/L29-1","v":{"$error":"#DIV/0!"}},null,{"$f":"L29*(1+$L$6)","v":0},{"$f":"ROUND(ROUND(J29,2)*ROUND(M29,6),2)","v":0}]
[null,15,"CODEVASF","CPU-17","TRANSPORTE CAP 50/70",null,null,null,"t",650.05999999999995,{"$error":"#DIV/0!"},null,{"$f":"L30*(1+$L$6)","v":0},0]
[null,16,"CODEVASF","CPU-14","AQUISIÇÃO DE EAI",null,null,null,"t",109.2,{"$error":"#DIV/0!"},null,0,0]
[null,17,"CODEVASF","CPU-18","TRANSPORTE DE EAI",null,null,null,"t",109.2,{"$error":"#DIV/0!"},null,0,0]
[null,18,"CODEVASF","CPU-15","AQUISIÇÃO DE EMULSÃO ASFÁLTICA RR-1C",null,null,null,"t",37.799999999999997,{"$error":"#DIV/0!"},null,0,0]
[null,19,"CODEVASF","CPU-19","TRANSPORTE RR-1C",null,null,null,"t",37.799999999999997,{"$error":"#DIV/0!"},null,0,0]
[{"$nulls":4},"SINALIZAÇÃO"]
[null,20,"SICRO",5213440,"Placa de regulamentação em aço D = 0,60 m - película retrorrefletiva tipo I + SI - fornecimento e implantação",null,null,null,"und",36,{"$f":"M36/L36-1","v":{"$error":"#DIV/0!"}},null,{"$f":"L36*(1+$J$6)","v":0},{"$f":"ROUND(ROUND(J36,2)*ROUND(M36,6),2)","v":0}]
[null,21,"SICRO",5213464,"Placa de advertência em aço, lado de 0,60 m - película retrorrefletiva tipo I + SI - fornecimento e implantação",null,null,null,"und",36,{"$f":"M37/L37-1","v":{"$error":"#DIV/0!"}},null,0,{"$f":"ROUND(ROUND(J37,2)*ROUND(M37,6),2)","v":0}]
[null,22,"SICRO",5213863,"Suporte metálico galvanizado para placa de advertência ou regulamentação - lado ou diâmetro de 0,60 m - fornecimento e implantação",null,null,null,"und",72,{"$error":"#DIV/0!"},null,0,0]
[null,23,"SICRO",5213400,"Pintura de faixa com tinta acrílica - espessura de 0,4 mm",null,null,null,"m²",3360,{"$error":"#DIV/0!"},null,0,0]
[{"$nulls":4},"DRENAGEM"]
[null,24,"SINAPI",94273,"ASSENTAMENTO DE GUIA (MEIO-FIO) EM TRECHO RETO, CONFECCIONADA EM CONCRETO PRÉ-FABRICADO, DIMENSÕES 100X15X13X30 CM (COMPRIMENTO X BASE INFERIOR X BASE SUPERIOR X ALTURA)",null,null,null,"m",24000,{"$f":"M41/L41-1","v":{"$error":"#DIV/0!"}},null,{"$f":"L41*(1+$J$6)","v":0},{"$f":"ROUND(ROUND(J41,2)*ROUND(M41,6),2)","v":0}]
[null,25,"SINAPI",94287,"EXECUÇÃO DE SARJETA DE CONCRETO USINADO, MOLDADA  IN LOCO  EM TRECHO RETO, 30 CM BASE X 10 CM ALTURA",null,null,null,"m",24000,{"$f":"M42/L42-1","v":{"$error":"#DIV/0!"}},null,0,{"$f":"ROUND(ROUND(J42,2)*ROUND(M42,6),2)","v":0}]
[null,26,"SICRO",4915724,"Caiação mecanizada com fixador de cal",null,null,null,"m²",2880,{"$f":"(M43/L43-1)","v":{"$error":"#DIV/0!"}},null,0,{"$f":"ROUND(ROUND(J43,2)*ROUND(M43,6),2)","v":0},{"$nulls":10},4514640]
[{"$nulls":4},"SERVIÇOS COMPLEMENTARES"]
[null,27,"Codevasf","CPU-12","Conserto de quebra no ramal na rua sem pavimento com fornecimento de material hidráulico",null,null,null,"m",1200,{"$f":"M45/L45-1","v":{"$error":"#DIV/0!"}},null,{"$f":"L45*(1+$J$6)","v":0},{"$f":"ROUND(ROUND(J45,2)*ROUND(M45,6),2)","v":0}]
[{"$nulls":4},"PROJETO EXECUTIVO"]
[null,28,"Codevasf","Composição Própria","Projeto Executivo",null,null,null,"m²",84000,{"$f":"M47/L47-1","v":{"$error":"#DIV/0!"}},null,{"$f":"L47*(1+$J$6)","v":0},{"$f":"ROUND(ROUND(J47,2)*ROUND(M47,6),2)","v":0}]
[{"$nulls":4},"MOMENTO DE TRANSPORTE"]
[null,29,"SICRO",5914359,"Transporte com caminhão basculante de 10 m³ - rodovia em leito natural",null,null,null,"tkm",172297.96,{"$f":"M49/L49-1","v":{"$error":"#DIV/0!"}},null,{"$f":"L49*(1+$J$6)","v":0},{"$f":"ROUND(ROUND(J49,2)*ROUND(M49,6),2)","v":0}]
[null,30,"SICRO",5914374,"Transporte com caminhão basculante de 10 m³ - rodovia em revestimento primário",null,null,null,"tkm",172297.96,{"$error":"#DIV/0!"},null,0,0]
[null,31,"SICRO",5914389,"Transporte com caminhão basculante de 10 m³ - rodovia pavimentada",null,null,null,"tkm",1378384.19,{"$error":"#DIV/0!"},null,0,0]
[null,32,"SICRO",5914449,"Transporte com caminhão carroceria de 15 t - rodovia em leito natural",null,null,null,"tkm",741.64,{"$error":"#DIV/0!"},null,0,0]
[null,33,"SICRO",5914464,"Transporte com caminhão carroceria de 15 t - rodovia em revestimento primário",null,null,null,"tkm",741.64,{"$error":"#DIV/0!"},null,0,0]
[null,34,"SICRO",5914479,"Transporte com caminhão carroceria de 15 t - rodovia pavimentada",null,null,null,"tkm",5933.11,{"$error":"#DIV/0!"},null,0,0]
[null,35,"SICRO",5914364,"Transporte de cimento ou cal hidratada a granel com caminhão silo de 30 m³ - rodovia em leito natural",null,null,null,"tkm",595.97,{"$error":"#DIV/0!"},null,0,0]
[null,36,"SICRO",5914365,"Transporte de cimento ou cal hidratada a granel com caminhão silo de 30 m³ - rodovia em revestimento primário",null,null,null,"tkm",595.97,{"$error":"#DIV/0!"},null,0,0]
[null,37,"SICRO",5914366,"Transporte de cimento ou cal hidratada a granel com caminhão silo de 30 m³ - rodovia pavimentada",null,null,null,"tkm",4767.76,{"$f":"M57/L57-1","v":{"$error":"#DIV/0!"}},null,0,{"$f":"ROUND(ROUND(J57,2)*ROUND(M57,6),2)","v":0},{"$f":"SUM(N49:N57)/N58","v":{"$error":"#DIV/0!"}}]
[null,"VALOR TOTAL DO SRP",{"$nulls":11},{"$f":"SUM(N11:N57)","v":0}]
[null,"Obs.: Os valores estão apresentados com apenas 2 casas decimais, mas os valores da presente planilha foram calculados utilizando a precisão de 6 casas decimais. "]
[{"$nulls":13},{"$f":"(N58/#REF!)/2000000","v":{"$error":"#REF!"}}]
{"$rows_empty":6598}
[{"$nulls":6},87354]
[{"$nulls":6},87355]
[{"$nulls":6},87356]
[{"$nulls":6},87357]
[{"$nulls":6},87358]
[{"$nulls":6},87359]
[{"$nulls":6},87360]
[{"$nulls":6},87361]
[{"$nulls":6},87362]
[{"$nulls":6},87363]
[{"$nulls":6},87364]
[{"$nulls":6},87365]
[{"$nulls":6},87366]
[{"$nulls":6},87367]
[{"$nulls":6},87368]
[{"$nulls":6},87369]
[{"$nulls":6},87370]
[{"$nulls":6},87371]
[{"$nulls":6},87372]
[{"$nulls":6},87373]
[{"$nulls":6},87374]
[{"$nulls":6},87375]
[{"$nulls":6},87376]
[{"$nulls":6},87377]
[{"$nulls":6},87378]
[{"$nulls":6},87379]
[{"$nulls":6},87380]
[{"$nulls":6},87381]
[{"$nulls":6},87382]
[{"$nulls":6},87383]
[{"$nulls":6},87384]
[{"$nulls":6},87385]
[{"$nulls":6},87386]
[{"$nulls":6},87387]
[{"$nulls":6},87388]
[{"$nulls":6},87389]
[{"$nulls":6},87390]
[{"$nulls":6},87391]
[{"$nulls":6},87393]
[{"$nulls":6},87394]
[{"$nulls":6},87395]
[{"$nulls":6},87396]
[{"$nulls":6},87397]
[{"$nulls":6},87398]
[{"$nulls":6},87399]
[{"$nulls":6},87401]
[{"$nulls":6},87402]
[{"$nulls":6},87404]
[{"$nulls":6},87405]
[{"$nulls":6},87407]
[{"$nulls":6},87408]
[{"$nulls":6},87410]
[{"$nulls":6},88626]
[{"$nulls":6},88627]
[{"$nulls":6},88628]
[{"$nulls":6},88629]
[{"$nulls":6},88630]
[{"$nulls":6},88631]
[{"$nulls":6},88715]
[{"$nulls":6},95563]
[{"$nulls":6},100464]
[{"$nulls":6},100465]
[{"$nulls":6},100466]
[{"$nulls":6},100468]
[{"$nulls":6},100469]
[{"$nulls":6},100470]
[{"$nulls":6},100472]
[{"$nulls":6},100473]
[{"$nulls":6},100474]
[{"$nulls":6},100475]
[{"$nulls":6},100477]
[{"$nulls":6},100478]
[{"$nulls":6},100479]
[{"$nulls":6},100480]
[{"$nulls":6},100481]
[{"$nulls":6},100483]
[{"$nulls":6},100484]
[{"$nulls":6},100485]
[{"$nulls":6},100486]
[{"$nulls":6},100487]
[{"$nulls":6},100488]
[{"$nulls":6},100489]
[{"$nulls":6},100490]
[{"$nulls":6},100491]
[{"$nulls":6},100492]
[{"$nulls":6},92121]
[{"$nulls":6},92122]
[{"$nulls":6},92123]
[{"$nulls":6},100195]
[{"$nulls":6},100196]
[{"$nulls":6},100197]
[{"$nulls":6},100198]
[{"$nulls":6},100199]
[{"$nulls":6},100200]
[{"$nulls":6},100201]
[{"$nulls":6},100202]
[{"$nulls":6},100203]
[{"$nulls":6},100204]
[{"$nulls":6},100205]
[{"$nulls":6},100206]
[{"$nulls":6},100207]
[{"$nulls":6},100208]
[{"$nulls":6},100209]
[{"$nulls":6},100210]
[{"$nulls":6},100211]
[{"$nulls":6},100212]
[{"$nulls":6},100213]
[{"$nulls":6},100214]
[{"$nulls":6},100215]
[{"$nulls":6},100216]
[{"$nulls":6},100217]
[{"$nulls":6},100218]
[{"$nulls":6},100219]
[{"$nulls":6},100220]
[{"$nulls":6},100221]
[{"$nulls":6},100222]
[{"$nulls":6},100223]
[{"$nulls":6},100224]
[{"$nulls":6},100225]
[{"$nulls":6},100226]
[{"$nulls":6},100227]
[{"$nulls":6},100228]
[{"$nulls":6},100229]
[{"$nulls":6},100230]
[{"$nulls":6},100231]
[{"$nulls":6},100232]
[{"$nulls":6},100233]
[{"$nulls":6},100234]
[{"$nulls":6},100235]
[{"$nulls":6},100236]
[{"$nulls":6},100237]
[{"$nulls":6},100238]
[{"$nulls":6},100239]
[{"$nulls":6},100240]
[{"$nulls":6},100241]
[{"$nulls":6},100242]
[{"$nulls":6},100243]
[{"$nulls":6},100244]
[{"$nulls":6},100245]
[{"$nulls":6},100246]
[{"$nulls":6},100247]
[{"$nulls":6},100248]
[{"$nulls":6},100249]
[{"$nulls":6},100250]
[{"$nulls":6},100251]
[{"$nulls":6},100252]
[{"$nulls":6},100253]
[{"$nulls":6},100254]
[{"$nulls":6},100255]
[{"$nulls":6},100256]
[{"$nulls":6},100257]
[{"$nulls":6},100258]
[{"$nulls":6},100259]
[{"$nulls":6},100260]
[{"$nulls":6},100261]
[{"$nulls":6},100262]
[{"$nulls":6},100263]
[{"$nulls":6},100264]
[{"$nulls":6},100265]
[{"$nulls":6},100266]
[{"$nulls":6},100267]
[{"$nulls":6},100268]
[{"$nulls":6},100269]
[{"$nulls":6},100270]
[{"$nulls":6},100271]
[{"$nulls":6},100272]
[{"$nulls":6},100273]
[{"$nulls":6},100274]
[{"$nulls":6},100275]
[{"$nulls":6},100276]
[{"$nulls":6},100277]
[{"$nulls":6},100278]
[{"$nulls":6},100279]
[{"$nulls":6},100280]
[{"$nulls":6},100281]
[{"$nulls":6},100282]
[{"$nulls":6},100283]
[{"$nulls":6},100284]
[{"$nulls":6},100285]
[{"$nulls":6},100286]
[{"$nulls":6},100287]
[{"$nulls":6},99802]
[{"$nulls":6},99803]
[{"$nulls":6},99804]
[{"$nulls":6},99805]
[{"$nulls":6},99806]
[{"$nulls":6},99807]
[{"$nulls":6},99808]
[{"$nulls":6},99809]
[{"$nulls":6},99810]
[{"$nulls":6},99811]
[{"$nulls":6},99812]
[{"$nulls":6},99813]
[{"$nulls":6},99814]
[{"$nulls":6},99815]
[{"$nulls":6},99816]
[{"$nulls":6},99817]
[{"$nulls":6},99818]
[{"$nulls":6},99819]
[{"$nulls":6},99820]
[{"$nulls":6},99821]
[{"$nulls":6},99822]
[{"$nulls":6},99823]
[{"$nulls":6},99824]
[{"$nulls":6},99825]
[{"$nulls":6},99826]
[{"$nulls":6},97013]
[{"$nulls":6},97014]
[{"$nulls":6},97015]
[{"$nulls":6},97016]
[{"$nulls":6},97017]
[{"$nulls":6},97018]
[{"$nulls":6},97031]
[{"$nulls":6},97032]
[{"$nulls":6},97033]
[{"$nulls":6},97034]
[{"$nulls":6},97039]
[{"$nulls":6},97040]
[{"$nulls":6},97041]
[{"$nulls":6},97046]
[{"$nulls":6},97047]
[{"$nulls":6},97048]
[{"$nulls":6},97054]
[{"$nulls":6},97062]
[{"$nulls":6},97063]
[{"$nulls":6},97064]
[{"$nulls":6},97065]
[{"$nulls":6},97066]
[{"$nulls":6},97067]
[{"$nulls":6},105103]
[{"$nulls":6},105104]
[{"$nulls":6},105105]
[{"$nulls":6},105106]
[{"$nulls":6},105107]
[{"$nulls":6},105110]
[{"$nulls":6},105111]
[{"$nulls":6},105112]
[{"$nulls":6},97621]
[{"$nulls":6},97622]
[{"$nulls":6},97623]
[{"$nulls":6},97624]
[{"$nulls":6},97625]
[{"$nulls":6},97626]
[{"$nulls":6},97627]
[{"$nulls":6},97628]
[{"$nulls":6},97629]
[{"$nulls":6},97631]
[{"$nulls":6},97632]
[{"$nulls":6},97633]
[{"$nulls":6},97634]
[{"$nulls":6},97635]
[{"$nulls":6},97636]
[{"$nulls":6},97637]
[{"$nulls":6},97638]
[{"$nulls":6},97639]
[{"$nulls":6},97640]
[{"$nulls":6},97641]
[{"$nulls":6},97642]
[{"$nulls":6},97643]
[{"$nulls":6},97644]
[{"$nulls":6},97645]
[{"$nulls":6},97647]
[{"$nulls":6},97648]
[{"$nulls":6},97649]
[{"$nulls":6},97650]
[{"$nulls":6},97651]
[{"$nulls":6},97652]
[{"$nulls":6},97653]
[{"$nulls":6},97654]
[{"$nulls":6},97655]
[{"$nulls":6},97656]
[{"$nulls":6},97657]
[{"$nulls":6},97658]
[{"$nulls":6},97659]
[{"$nulls":6},97660]
[{"$nulls":6},97661]
[{"$nulls":6},97662]
[{"$nulls":6},97663]
[{"$nulls":6},97664]
[{"$nulls":6},97665]
[{"$nulls":6},97666]
[{"$nulls":6},104789]
[{"$nulls":6},104790]
[{"$nulls":6},104791]
[{"$nulls":6},104792]
[{"$nulls":6},104793]
[{"$nulls":6},104794]
[{"$nulls":6},104795]
[{"$nulls":6},104796]
[{"$nulls":6},104797]
[{"$nulls":6},104798]
[{"$nulls":6},104799]
[{"$nulls":6},104800]
[{"$nulls":6},104801]
[{"$nulls":6},104802]
[{"$nulls":6},104803]
[{"$nulls":6},95967]
[{"$nulls":6},99059]
[{"$nulls":6},99060]
[{"$nulls":6},99061]
[{"$nulls":6},99062]
[{"$nulls":6},99063]
[{"$nulls":6},105007]
[{"$nulls":6},105009]
[{"$nulls":6},105011]
[{"$nulls":6},93588]
[{"$nulls":6},93589]
[{"$nulls":6},93590]
[{"$nulls":6},93591]
[{"$nulls":6},93592]
[{"$nulls":6},93593]
[{"$nulls":6},93594]
[{"$nulls":6},93595]
[{"$nulls":6},93596]
[{"$nulls":6},93597]
[{"$nulls":6},93598]
[{"$nulls":6},93599]
[{"$nulls":6},95425]
[{"$nulls":6},95426]
[{"$nulls":6},95427]
[{"$nulls":6},95428]
[{"$nulls":6},95429]
[{"$nulls":6},95430]
[{"$nulls":6},95875]
[{"$nulls":6},95876]
[{"$nulls":6},95877]
[{"$nulls":6},95878]
[{"$nulls":6},95879]
[{"$nulls":6},95880]
[{"$nulls":6},97912]
[{"$nulls":6},97913]
[{"$nulls":6},97914]
[{"$nulls":6},97915]
[{"$nulls":6},100937]
[{"$nulls":6},100938]
[{"$nulls":6},100939]
[{"$nulls":6},100940]
[{"$nulls":6},100941]
[{"$nulls":6},100942]
[{"$nulls":6},100943]
[{"$nulls":6},100944]
[{"$nulls":6},100945]
[{"$nulls":6},100946]
[{"$nulls":6},100947]
[{"$nulls":6},100948]
[{"$nulls":6},100949]
[{"$nulls":6},100950]
[{"$nulls":6},100951]
[{"$nulls":6},100952]
[{"$nulls":6},100953]
[{"$nulls":6},100954]
[{"$nulls":6},100955]
[{"$nulls":6},100956]
[{"$nulls":6},100957]
[{"$nulls":6},100958]
[{"$nulls":6},100959]
[{"$nulls":6},100960]
[{"$nulls":6},100961]
[{"$nulls":6},100962]
[{"$nulls":6},100963]
[{"$nulls":6},100964]
[{"$nulls":6},100973]
[{"$nulls":6},100974]
[{"$nulls":6},100975]
[{"$nulls":6},100965]
[{"$nulls":6},100966]
[{"$nulls":6},100969]
[{"$nulls":6},100970]
[{"$nulls":6},102330]
[{"$nulls":6},102331]
[{"$nulls":6},102332]
[{"$nulls":6},102333]
[{"$nulls":6},101019]
[{"$nulls":6},101479]
[{"$nulls":6},102568]
[{"$nulls":6},100976]
[{"$nulls":6},100977]
[{"$nulls":6},100978]
[{"$nulls":6},100979]
[{"$nulls":6},100980]
[{"$nulls":6},100981]
[{"$nulls":6},100982]
[{"$nulls":6},100983]
[{"$nulls":6},100984]
[{"$nulls":6},100985]
[{"$nulls":6},100986]
[{"$nulls":6},100987]
[{"$nulls":6},100988]
[{"$nulls":6},100989]
[{"$nulls":6},100990]
[{"$nulls":6},100991]
[{"$nulls":6},100992]
[{"$nulls":6},100993]
[{"$nulls":6},100994]
[{"$nulls":6},100995]
[{"$nulls":6},100996]
[{"$nulls":6},100997]
[{"$nulls":6},100998]
[{"$nulls":6},100999]
[{"$nulls":6},101000]
[{"$nulls":6},101001]
[{"$nulls":6},101002]
[{"$nulls":6},101003]
[{"$nulls":6},101004]
[{"$nulls":6},101005]
[{"$nulls":6},101006]
[{"$nulls":6},101007]
[{"$nulls":6},101008]
[{"$nulls":6},101009]
[{"$nulls":6},101010]
[{"$nulls":6},101013]
[{"$nulls":6},101014]
[{"$nulls":6},101015]
[{"$nulls":6},101016]
[{"$nulls":6},101017]
[{"$nulls":6},101018]
[{"$nulls":6},101463]
[{"$nulls":6},101464]
[{"$nulls":6},101465]
[{"$nulls":6},101466]
[{"$nulls":6},101467]
[{"$nulls":6},101468]
[{"$nulls":6},101469]
[{"$nulls":6},101470]
[{"$nulls":6},101471]
[{"$nulls":6},101472]
[{"$nulls":6},101473]
[{"$nulls":6},101474]
[{"$nulls":6},101475]
[{"$nulls":6},101476]
[{"$nulls":6},101477]
[{"$nulls":6},101478]
[{"$nulls":6},101480]
[{"$nulls":6},101481]
[{"$nulls":6},101482]
[{"$nulls":6},101483]
[{"$nulls":6},101484]
[{"$nulls":6},101485]
[{"$nulls":6},101486]
[{"$nulls":6},101487]
[{"$nulls":6},101488]
[{"$nulls":6},101188]
[{"$nulls":6},101189]
[{"$nulls":6},101190]
[{"$nulls":6},101191]
[{"$nulls":6},101192]
[{"$nulls":6},101193]
[{"$nulls":6},101194]
[{"$nulls":6},101197]
[{"$nulls":6},101198]
[{"$nulls":6},101199]
[{"$nulls":6},101200]
[{"$nulls":6},101201]
[{"$nulls":6},101202]
[{"$nulls":6},101203]
[{"$nulls":6},101204]
[{"$nulls":6},101205]
[{"$nulls":6},102362]
[{"$nulls":6},102363]
[{"$nulls":6},102364]
[{"$nulls":6},98509]
[{"$nulls":6},98510]
[{"$nulls":6},98511]
[{"$nulls":6},98516]
[{"$nulls":6},98519]
[{"$nulls":6},98520]
[{"$nulls":6},98521]
[{"$nulls":6},98522]
[{"$nulls":6},98524]
[{"$nulls":6},98503]
[{"$nulls":6},98504]
[{"$nulls":6},98505]
[{"$nulls":6},103946]
[{"$nulls":6},105000]
[{"$nulls":6},105001]
[{"$nulls":6},105002]
[{"$nulls":6},105003]
[{"$nulls":6},105004]
[{"$nulls":6},105005]
[{"$nulls":6},103185]
[{"$nulls":6},103186]
[{"$nulls":6},103187]
[{"$nulls":6},103188]
[{"$nulls":6},103189]
[{"$nulls":6},103190]
[{"$nulls":6},103191]
[{"$nulls":6},103192]
[{"$nulls":6},103193]
[{"$nulls":6},103194]
[{"$nulls":6},103195]
[{"$nulls":6},103205]
[{"$nulls":6},103206]
[{"$nulls":6},103207]
[{"$nulls":6},103208]
[{"$nulls":6},103209]
[{"$nulls":6},103210]
[{"$nulls":6},103304]
[{"$nulls":6},103307]
[{"$nulls":6},103310]
[{"$nulls":6},103314]
[{"$nulls":6},103315]
[{"$nulls":6},103769]
[{"$nulls":6},98525]
[{"$nulls":6},98526]
[{"$nulls":6},98527]
[{"$nulls":6},98528]
[{"$nulls":6},98529]
[{"$nulls":6},98530]
[{"$nulls":6},98531]
[{"$nulls":6},98532]
[{"$nulls":6},98533]
[{"$nulls":6},98534]
[{"$nulls":6},98535]
[{"$nulls":6},88238]
[{"$nulls":6},88239]
[{"$nulls":6},88240]
[{"$nulls":6},88241]
[{"$nulls":6},88242]
[{"$nulls":6},88243]
[{"$nulls":6},88245]
[{"$nulls":6},88246]
[{"$nulls":6},88247]
[{"$nulls":6},88248]
[{"$nulls":6},88249]
[{"$nulls":6},88250]
[{"$nulls":6},88251]
[{"$nulls":6},88252]
[{"$nulls":6},88253]
[{"$nulls":6},88255]
[{"$nulls":6},88256]
[{"$nulls":6},88257]
[{"$nulls":6},88260]
[{"$nulls":6},88261]
[{"$nulls":6},88262]
[{"$nulls":6},88263]
[{"$nulls":6},88264]
[{"$nulls":6},88266]
[{"$nulls":6},88267]
[{"$nulls":6},88269]
[{"$nulls":6},88270]
[{"$nulls":6},88272]
[{"$nulls":6},88273]
[{"$nulls":6},88274]
[{"$nulls":6},88275]
[{"$nulls":6},88277]
[{"$nulls":6},88278]
[{"$nulls":6},88279]
[{"$nulls":6},88281]
[{"$nulls":6},88282]
[{"$nulls":6},88283]
[{"$nulls":6},88284]
[{"$nulls":6},88286]
[{"$nulls":6},88288]
[{"$nulls":6},88291]
[{"$nulls":6},88292]
[{"$nulls":6},88293]
[{"$nulls":6},88294]
[{"$nulls":6},88295]
[{"$nulls":6},88296]
[{"$nulls":6},88297]
[{"$nulls":6},88298]
[{"$nulls":6},88299]
[{"$nulls":6},88300]
[{"$nulls":6},88301]
[{"$nulls":6},88302]
[{"$nulls":6},88303]
[{"$nulls":6},88304]
[{"$nulls":6},88306]
[{"$nulls":6},88307]
[{"$nulls":6},88308]
[{"$nulls":6},88309]
[{"$nulls":6},88310]
[{"$nulls":6},88311]
[{"$nulls":6},88312]
[{"$nulls":6},88313]
[{"$nulls":6},88314]
[{"$nulls":6},88315]
[{"$nulls":6},88316]
[{"$nulls":6},88317]
[{"$nulls":6},88318]
[{"$nulls":6},88321]
[{"$nulls":6},88322]
[{"$nulls":6},88323]
[{"$nulls":6},88324]
[{"$nulls":6},88325]
[{"$nulls":6},88377]
[{"$nulls":6},88441]
[{"$nulls":6},90766]
[{"$nulls":6},90767]
[{"$nulls":6},90768]
[{"$nulls":6},90769]
[{"$nulls":6},90770]
[{"$nulls":6},90772]
[{"$nulls":6},90775]
[{"$nulls":6},90776]
[{"$nulls":6},90777]
[{"$nulls":6},90778]
[{"$nulls":6},90779]
[{"$nulls":6},90780]
[{"$nulls":6},90781]
[{"$nulls":6},93558]
[{"$nulls":6},93561]
[{"$nulls":6},93563]
[{"$nulls":6},93564]
[{"$nulls":6},93565]
[{"$nulls":6},93566]
[{"$nulls":6},93567]
[{"$nulls":6},93568]
[{"$nulls":6},93569]
[{"$nulls":6},93570]
[{"$nulls":6},93571]
[{"$nulls":6},93572]
[{"$nulls":6},94295]
[{"$nulls":6},94296]
[{"$nulls":6},95308]
[{"$nulls":6},95309]
[{"$nulls":6},95310]
[{"$nulls":6},95311]
[{"$nulls":6},95312]
[{"$nulls":6},95313]
[{"$nulls":6},95314]
[{"$nulls":6},95315]
[{"$nulls":6},95316]
[{"$nulls":6},95317]
[{"$nulls":6},95318]
[{"$nulls":6},95319]
[{"$nulls":6},95320]
[{"$nulls":6},95321]
[{"$nulls":6},95322]
[{"$nulls":6},95323]
[{"$nulls":6},95324]
[{"$nulls":6},95325]
[{"$nulls":6},95328]
[{"$nulls":6},95329]
[{"$nulls":6},95330]
[{"$nulls":6},95331]
[{"$nulls":6},95332]
[{"$nulls":6},95334]
[{"$nulls":6},95335]
[{"$nulls":6},95337]
[{"$nulls":6},95338]
[{"$nulls":6},95339]
[{"$nulls":6},95340]
[{"$nulls":6},95341]
[{"$nulls":6},95342]
[{"$nulls":6},95343]
[{"$nulls":6},95344]
[{"$nulls":6},95345]
[{"$nulls":6},95346]
[{"$nulls":6},95347]
[{"$nulls":6},95348]
[{"$nulls":6},95349]
[{"$nulls":6},95351]
[{"$nulls":6},95352]
[{"$nulls":6},95354]
[{"$nulls":6},95355]
[{"$nulls":6},95356]
[{"$nulls":6},95357]
[{"$nulls":6},95358]
[{"$nulls":6},95359]
[{"$nulls":6},95360]
[{"$nulls":6},95361]
[{"$nulls":6},95362]
[{"$nulls":6},95363]
[{"$nulls":6},95364]
[{"$nulls":6},95365]
[{"$nulls":6},95366]
[{"$nulls":6},95367]
[{"$nulls":6},95368]
[{"$nulls":6},95369]
[{"$nulls":6},95370]
[{"$nulls":6},95371]
[{"$nulls":6},95372]
[{"$nulls":6},95373]
[{"$nulls":6},95374]
[{"$nulls":6},95375]
[{"$nulls":6},95376]
[{"$nulls":6},95377]
[{"$nulls":6},95378]
[{"$nulls":6},95379]
[{"$nulls":6},95380]
[{"$nulls":6},95383]
[{"$nulls":6},95384]
[{"$nulls":6},95385]
[{"$nulls":6},95386]
[{"$nulls":6},95387]
[{"$nulls":6},95389]
[{"$nulls":6},95390]
[{"$nulls":6},95392]
[{"$nulls":6},95393]
[{"$nulls":6},95394]
[{"$nulls":6},95395]
[{"$nulls":6},95396]
[{"$nulls":6},95398]
[{"$nulls":6},95400]
[{"$nulls":6},95401]
[{"$nulls":6},95402]
[{"$nulls":6},95403]
[{"$nulls":6},95404]
[{"$nulls":6},95405]
[{"$nulls":6},95406]
[{"$nulls":6},95408]
[{"$nulls":6},95411]
[{"$nulls":6},95413]
[{"$nulls":6},95414]
[{"$nulls":6},95415]
[{"$nulls":6},95416]
[{"$nulls":6},95417]
[{"$nulls":6},95418]
[{"$nulls":6},95419]
[{"$nulls":6},95420]
[{"$nulls":6},95421]
[{"$nulls":6},95422]
[{"$nulls":6},95423]
[{"$nulls":6},95424]
[{"$nulls":6},100288]
[{"$nulls":6},100289]
[{"$nulls":6},100291]
[{"$nulls":6},100293]
[{"$nulls":6},100295]
[{"$nulls":6},100298]
[{"$nulls":6},100299]
[{"$nulls":6},100301]
[{"$nulls":6},100303]
[{"$nulls":6},100307]
[{"$nulls":6},100308]
[{"$nulls":6},100309]
[{"$nulls":6},100315]
[{"$nulls":6},100321]
[{"$nulls":6},100533]
[{"$nulls":6},100534]
[{"$nulls":6},100535]
[{"$nulls":6},100536]
[{"$nulls":6},101286]
[{"$nulls":6},101287]
[{"$nulls":6},101288]
[{"$nulls":6},101289]
[{"$nulls":6},101290]
[{"$nulls":6},101291]
[{"$nulls":6},101292]
[{"$nulls":6},101293]
[{"$nulls":6},101294]
[{"$nulls":6},101295]
[{"$nulls":6},101296]
[{"$nulls":6},101297]
[{"$nulls":6},101298]
[{"$nulls":6},101299]
[{"$nulls":6},101300]
[{"$nulls":6},101301]
[{"$nulls":6},101302]
[{"$nulls":6},101303]
[{"$nulls":6},101304]
[{"$nulls":6},101305]
[{"$nulls":6},101307]
[{"$nulls":6},101308]
[{"$nulls":6},101309]
[{"$nulls":6},101310]
[{"$nulls":6},101311]
[{"$nulls":6},101312]
[{"$nulls":6},101313]
[{"$nulls":6},101315]
[{"$nulls":6},101316]
[{"$nulls":6},101320]
[{"$nulls":6},101322]
[{"$nulls":6},101323]
[{"$nulls":6},101324]
[{"$nulls":6},101325]
[{"$nulls":6},101326]
[{"$nulls":6},101328]
[{"$nulls":6},101329]
[{"$nulls":6},101330]
[{"$nulls":6},101331]
[{"$nulls":6},101332]
[{"$nulls":6},101333]
[{"$nulls":6},101334]
[{"$nulls":6},101336]
[{"$nulls":6},101337]
[{"$nulls":6},101338]
[{"$nulls":6},101339]
[{"$nulls":6},101340]
[{"$nulls":6},101341]
[{"$nulls":6},101342]
[{"$nulls":6},101343]
[{"$nulls":6},101344]
[{"$nulls":6},101345]
[{"$nulls":6},101346]
[{"$nulls":6},101347]
[{"$nulls":6},101348]
[{"$nulls":6},101349]
[{"$nulls":6},101350]
[{"$nulls":6},101351]
[{"$nulls":6},101352]
[{"$nulls":6},101353]
[{"$nulls":6},101355]
[{"$nulls":6},101356]
[{"$nulls":6},101357]
[{"$nulls":6},101358]
[{"$nulls":6},101359]
[{"$nulls":6},101360]
[{"$nulls":6},101361]
[{"$nulls":6},101363]
[{"$nulls":6},101364]
[{"$nulls":6},101365]
[{"$nulls":6},101366]
[{"$nulls":6},101368]
[{"$nulls":6},101369]
[{"$nulls":6},101370]
[{"$nulls":6},101371]
[{"$nulls":6},101372]
[{"$nulls":6},101374]
[{"$nulls":6},101375]
[{"$nulls":6},101376]
[{"$nulls":6},101377]
[{"$nulls":6},101378]
[{"$nulls":6},101379]
[{"$nulls":6},101380]
[{"$nulls":6},101381]
[{"$nulls":6},101382]
[{"$nulls":6},101383]
[{"$nulls":6},101384]
[{"$nulls":6},101385]
[{"$nulls":6},101386]
[{"$nulls":6},101387]
[{"$nulls":6},101388]
[{"$nulls":6},101389]
[{"$nulls":6},101390]
[{"$nulls":6},101391]
[{"$nulls":6},101392]
[{"$nulls":6},101394]
[{"$nulls":6},101395]
[{"$nulls":6},101396]
[{"$nulls":6},101397]
[{"$nulls":6},101398]
[{"$nulls":6},101399]
[{"$nulls":6},101401]
[{"$nulls":6},101402]
[{"$nulls":6},101407]
[{"$nulls":6},101408]
[{"$nulls":6},101409]
[{"$nulls":6},101410]
[{"$nulls":6},101412]
[{"$nulls":6},101413]
[{"$nulls":6},101414]
[{"$nulls":6},101415]
[{"$nulls":6},101416]
[{"$nulls":6},101417]
[{"$nulls":6},101418]
[{"$nulls":6},101419]
[{"$nulls":6},101420]
[{"$nulls":6},101421]
[{"$nulls":6},101422]
[{"$nulls":6},101424]
[{"$nulls":6},101425]
[{"$nulls":6},101426]
[{"$nulls":6},101427]
[{"$nulls":6},101428]
[{"$nulls":6},101429]
[{"$nulls":6},101430]
[{"$nulls":6},101431]
[{"$nulls":6},101432]
[{"$nulls":6},101433]
[{"$nulls":6},101434]
[{"$nulls":6},101435]
[{"$nulls":6},101436]
[{"$nulls":6},101437]
[{"$nulls":6},101438]
[{"$nulls":6},101439]
[{"$nulls":6},101440]
[{"$nulls":6},101441]
[{"$nulls":6},101443]
[{"$nulls":6},101444]
[{"$nulls":6},101445]
[{"$nulls":6},101446]
[{"$nulls":6},101447]
[{"$nulls":6},101448]
[{"$nulls":6},101449]
[{"$nulls":6},101451]
[{"$nulls":6},101452]
[{"$nulls":6},101453]
[{"$nulls":6},101454]
[{"$nulls":6},101456]
[{"$nulls":6},101457]
[{"$nulls":6},101458]
[{"$nulls":6},101459]
[{"$nulls":6},101460]

{"sheet":"2.JANUÁRIA","index":1,"n_rows":7543,"n_cols":30,"rows_kept":7543,"cut":false,"hidden":false,"merged":[[1,1,3,11],[4,1,4,13],[5,1,8,1],[5,2,8,2],[5,3,8,3],[5,4,8,7],[6,9,7,9],[6,12,8,12],[6,13,8,13],[20,4,20,7],[9,4,9,7],[10,4,10,7],[11,4,11,7],[12,4,12,7],[13,4,13,7],[14,4,14,7],[15,4,15,7],[16,4,16,7],[17,4,17,7],[18,4,18,7],[19,4,19,7],[32,4,32,7],[21,4,21,7],[22,4,22,7],[23,4,23,7],[24,4,24,7],[25,4,25,7],[26,4,26,7],[27,4,27,7],[28,4,28,7],[29,4,29,7],[30,4,30,7],[31,4,31,7],[48,4,48,7],[33,4,33,7],[34,4,34,7],[35,4,35,7],[36,4,36,7],[37,4,37,7],[38,4,38,7],[40,4,40,7],[41,4,41,7],[42,4,42,7],[44,4,44,7],[46,4,46,7],[55,4,55,7],[56,4,56,7],[57,1,57,12],[49,4,49,7],[50,4,50,7],[51,4,51,7],[52,4,52,7],[53,4,53,7],[54,4,54,7]]}
[]
[null,"LOGOTIPO DA EMPRESA"]
[]
[{"$nulls":12},"Data Base do Orçamento","2024-08-01"]
[null,"CONTRATAÇÃO DE SERVIÇOS DE PAVIMENTAÇÃO ASFÁLTICA COM CONCRETO BETUMINOSO USINADO A QUENTE (CBUQ) EM VIAS URBANAS E RURAIS INSERIDAS NA ÁREA DE ATUAÇÃO DA 1ª SUPERINTENDÊNCIA REGIONAL DA CODEVASF, NO ESTADO DE MINAS GERAIS - ITEM 2: JANUÁRIA/MG"]
[null,"ITEM","ORIGEM\nCOMPOSIÇÃO","CÓDIGO\nCOMPOSIÇÃO","DISCRIMINAÇÃO DOS SERVIÇOS",null,null,null,"BDI % = ",{"$f":"BDI!C17","v":0},"BDI  DIFERENCIADO% =",{"$f":"BDI!C33","v":0},"R$/m²",{"$f":"N58/I8","v":0},{"$f":"N58","v":0}]
[{"$nulls":8},"Total de m²","Encargos Sociais:","Horista","Mensalista","PREÇO UNITÁRIO COM BDI","PREÇO TOTAL COM BDI "]
[{"$nulls":8},52500,null,{"$f":"'ENC.SOC.'!$E$51","v":0},{"$f":"'ENC.SOC.'!$F$51","v":0}]
[{"$nulls":8},"UND","QTDE.","BDI","PREÇO UNITÁRIO "]
[{"$nulls":4},"MOBILIZAÇÃO/DESMOBILIZAÇÃO"]
[null,1,"Codevasf","Mob","Mobilização",null,null,null,"kmxfrente",450,{"$f":"(M11/L11-1)","v":{"$error":"#DIV/0!"}},null,{"$f":"L11*(1+$J$6)","v":0},{"$f":"M11*J11","v":0},{"$f":"N11/$N$58","v":{"$error":"#DIV/0!"}}]
[null,2,"Codevasf","Mob","Desmobilização",null,null,null,"kmxfrente",450,{"$f":"(M12/L12-1)","v":{"$error":"#DIV/0!"}},null,{"$f":"L12*(1+$J$6)","v":0},{"$f":"M12*J12","v":0},{"$f":"N12/$N$58","v":{"$error":"#DIV/0!"}}]
[{"$nulls":4},"INSTALAÇÃO DE CANTEIRO"]
[null,3,"Codevasf","Canteiro","Canteiro de Obras e Almoxarifado",null,null,null,"frente",5,{"$f":"(M14/L14-1)","v":{"$error":"#DIV/0!"}},null,{"$f":"L14*(1+$J$6)","v":0},{"$f":"ROUND(ROUND(J14,2)*ROUND(M14,6),2)","v":0},{"$f":"N14/N58","v":{"$error":"#DIV/0!"}}]
[null,4,"SINAPI",103689,"FORNECIMENTO E INSTALAÇÃO DE PLACA DE OBRA COM CHAPA GALVANIZADA E ESTRUTURA DE MADEIRA",null,null,null,"m²",80,{"$f":"(M15/L15-1)","v":{"$error":"#DIV/0!"}},null,0,{"$f":"ROUND(ROUND(J15,2)*ROUND(M15,6),2)","v":0}]
[{"$nulls":4},"ADMINISTRAÇÃO LOCAL DA OBRA"]
[null,5,"Codevasf","Adm Local","Administração Local da Obra",null,null,null,"und",1,{"$f":"(M17/L17-1)","v":{"$error":"#DIV/0!"}},null,{"$f":"L17*(1+$J$6)","v":0},{"$f":"ROUND(ROUND(J17,2)*ROUND(M17,6),2)","v":0},{"$f":"N17/N58","v":{"$error":"#DIV/0!"}}]
[{"$nulls":4},"TERRAPLANAGEM"]
[null,6,"SICRO",5502114,"Escavação, carga e transporte de material de 1ª categoria - DMT de 1.000 a 1.200 m - caminho de serviço em leito natural - com escavadeira e caminhão basculante de 14 m³",null,null,null,"m³",18375,{"$f":"M19/L19-1","v":{"$error":"#DIV/0!"}},null,{"$f":"L19*(1+$J$6)","v":0},{"$f":"ROUND(ROUND(J19,2)*ROUND(M19,6),2)","v":0}]
[null,7,"SICRO",4413942,"Espalhamento de material em bota-fora",null,null,null,"m³",18375,{"$error":"#DIV/0!"},null,0,0,{"$nulls":15},1]
[{"$nulls":4},"PAVIMENTAÇÃO"]
[null,8,"SICRO",4011463,"Concreto asfáltico - faixa C - areia e brita comerciais",null,null,null,"t",6300,{"$f":"M22/L22-1","v":{"$error":"#DIV/0!"}},null,{"$f":"L22*(1+$J$6)","v":0},{"$f":"ROUND(ROUND(J22,2)*ROUND(M22,6),2)","v":0}]
[null,9,"SICRO",4011352,"Imprimação com emulsão asfáltica",null,null,null,"m²",52500,{"$error":"#DIV/0!"},null,0,0]
[null,10,"SICRO",4011353,"Pintura de ligação",null,null,null,"m²",52500,{"$error":"#DIV/0!"},null,0,0]
[null,11,"SICRO",4011268,"Base estabilizada granulometricamente com mistura solo brita (70% - 30%) em usina com material de jazida e brita comercial",null,null,null,"m³",7875,{"$error":"#DIV/0!"},null,0,0]
[null,12,"SICRO",4011228,"Sub-base estabilizada granulometricamente com mistura de solos na pista com material de jazida",null,null,null,"m³",7875,{"$error":"#DIV/0!"},null,0,0]
[null,13,"SICRO",4011209,"Regularização do subleito",null,null,null,"m²",52500,{"$error":"#DIV/0!"},null,0,0]
[{"$nulls":4},"AQUISIÇÃO E TRANSPORTE DO MATERIAL BETUMINOSO"]
[null,14,"CODEVASF","CPU-13","AQUISIÇÃO DE CIMENTO ASFALTICO CAP 50/70",null,null,null,"t",406.29,{"$f":"M29/L29-1","v":{"$error":"#DIV/0!"}},null,{"$f":"L29*(1+$L$6)","v":0},{"$f":"ROUND(ROUND(J29,2)*ROUND(M29,6),2)","v":0}]
[null,15,"CODEVASF","CPU-17","TRANSPORTE CAP 50/70",null,null,null,"t",406.29,{"$error":"#DIV/0!"},null,{"$f":"L30*(1+$L$6)","v":0},0]
[null,16,"CODEVASF","CPU-14","AQUISIÇÃO DE EAI",null,null,null,"t",68.25,{"$error":"#DIV/0!"},null,0,0]
[null,17,"CODEVASF","CPU-18","TRANSPORTE DE EAI",null,null,null,"t",68.25,{"$error":"#DIV/0!"},null,0,0]
[null,18,"CODEVASF","CPU-15","AQUISIÇÃO DE EMULSÃO ASFÁLTICA RR-1C",null,null,null,"t",23.63,{"$error":"#DIV/0!"},null,0,0]
[null,19,"CODEVASF","CPU-19","TRANSPORTE RR-1C",null,null,null,"t",23.63,{"$error":"#DIV/0!"},null,0,0]
[{"$nulls":4},"SINALIZAÇÃO"]
[null,20,"SICRO",5213440,"Placa de regulamentação em aço D = 0,60 m - película retrorrefletiva tipo I + SI - fornecimento e implantação",null,null,null,"und",22.5,{"$f":"M36/L36-1","v":{"$error":"#DIV/0!"}},null,{"$f":"L36*(1+$J$6)","v":0},{"$f":"ROUND(ROUND(J36,2)*ROUND(M36,6),2)","v":0}]
[null,21,"SICRO",5213464,"Placa de advertência em aço, lado de 0,60 m - película retrorrefletiva tipo I + SI - fornecimento e implantação",null,null,null,"und",22.5,{"$error":"#DIV/0!"},null,0,0]
[null,22,"SICRO",5213863,"Suporte metálico galvanizado para placa de advertência ou regulamentação - lado ou diâmetro de 0,60 m - fornecimento e implantação",null,null,null,"und",45,{"$error":"#DIV/0!"},null,0,0]
[null,23,"SICRO",5213400,"Pintura de faixa com tinta acrílica - espessura de 0,4 mm",null,null,null,"m²",2100,{"$error":"#DIV/0!"},null,0,0]
[{"$nulls":4},"DRENAGEM"]
[null,24,"SINAPI",94273,"ASSENTAMENTO DE GUIA (MEIO-FIO) EM TRECHO RETO, CONFECCIONADA EM CONCRETO PRÉ-FABRICADO, DIMENSÕES 100X15X13X30 CM (COMPRIMENTO X BASE INFERIOR X BASE SUPERIOR X ALTURA)",null,null,null,"m",15000,{"$f":"M41/L41-1","v":{"$error":"#DIV/0!"}},null,{"$f":"L41*(1+$J$6)","v":0},{"$f":"ROUND(ROUND(J41,2)*ROUND(M41,6),2)","v":0}]
[null,25,"SINAPI",94287,"EXECUÇÃO DE SARJETA DE CONCRETO USINADO, MOLDADA  IN LOCO  EM TRECHO RETO, 30 CM BASE X 10 CM ALTURA",null,null,null,"m",15000,{"$f":"M42/L42-1","v":{"$error":"#DIV/0!"}},null,0,{"$f":"ROUND(ROUND(J42,2)*ROUND(M42,6),2)","v":0}]
[null,26,"SICRO",4915724,"Caiação mecanizada com fixador de cal",null,null,null,"m²",1800,{"$f":"(M43/L43-1)","v":{"$error":"#DIV/0!"}},null,0,{"$f":"ROUND(ROUND(J43,2)*ROUND(M43,6),2)","v":0},{"$nulls":10},4514640]
[{"$nulls":4},"SERVIÇOS COMPLEMENTARES"]
[null,27,"Codevasf","CPU-12","Conserto de quebra no ramal na rua sem pavimento com fornecimento de material hidráulico",null,null,null,"m",750,{"$f":"M45/L45-1","v":{"$error":"#DIV/0!"}},null,{"$f":"L45*(1+$J$6)","v":0},{"$f":"ROUND(ROUND(J45,2)*ROUND(M45,6),2)","v":0}]
[{"$nulls":4},"PROJETO EXECUTIVO"]
[null,28,"Codevasf","Composição Própria","Projeto Executivo",null,null,null,"m²",52500,{"$f":"M47/L47-1","v":{"$error":"#DIV/0!"}},null,{"$f":"L47*(1+$J$6)","v":0},{"$f":"ROUND(ROUND(J47,2)*ROUND(M47,6),2)","v":0}]
[{"$nulls":4},"MOMENTO DE TRANSPORTE"]
[null,29,"SICRO",5914359,"Transporte com caminhão basculante de 10 m³ - rodovia em leito natural",null,null,null,"tkm",116560.75,{"$f":"M49/L49-1","v":{"$error":"#DIV/0!"}},null,{"$f":"L49*(1+$J$6)","v":0},{"$f":"ROUND(ROUND(J49,2)*ROUND(M49,6),2)","v":0}]
[null,30,"SICRO",5914374,"Transporte com caminhão basculante de 10 m³ - rodovia em revestimento primário",null,null,null,"tkm",116560.75,{"$error":"#DIV/0!"},null,0,0]
[null,31,"SICRO",5914389,"Transporte com caminhão basculante de 10 m³ - rodovia pavimentada",null,null,null,"tkm",932486.31,{"$error":"#DIV/0!"},null,0,0]
[null,32,"SICRO",5914449,"Transporte com caminhão carroceria de 15 t - rodovia em leito natural",null,null,null,"tkm",463.52,{"$error":"#DIV/0!"},null,0,0]
[null,33,"SICRO",5914464,"Transporte com caminhão carroceria de 15 t - rodovia em revestimento primário",null,null,null,"tkm",463.52,{"$error":"#DIV/0!"},null,0,0]
[null,34,"SICRO",5914479,"Transporte com caminhão carroceria de 15 t - rodovia pavimentada",null,null,null,"tkm",3708.19,{"$error":"#DIV/0!"},null,0,0]
[null,35,"SICRO",5914364,"Transporte de cimento ou cal hidratada a granel com caminhão silo de 30 m³ - rodovia em leito natural",null,null,null,"tkm",372.48,{"$error":"#DIV/0!"},null,0,0]
[null,36,"SICRO",5914365,"Transporte de cimento ou cal hidratada a granel com caminhão silo de 30 m³ - rodovia em revestimento primário",null,null,null,"tkm",372.48,{"$error":"#DIV/0!"},null,0,0]
[null,37,"SICRO",5914366,"Transporte de cimento ou cal hidratada a granel com caminhão silo de 30 m³ - rodovia pavimentada",null,null,null,"tkm",2979.85,{"$f":"M57/L57-1","v":{"$error":"#DIV/0!"}},null,0,{"$f":"ROUND(ROUND(J57,2)*ROUND(M57,6),2)","v":0},{"$f":"SUM(N49:N57)/N58","v":{"$error":"#DIV/0!"}}]
[null,"VALOR TOTAL DO SRP",{"$nulls":11},{"$f":"SUM(N11:N57)","v":0}]
[null,"Obs.: Os valores estão apresentados com apenas 2 casas decimais, mas os valores da presente planilha foram calculados utilizando a precisão de 6 casas decimais. "]
[{"$nulls":13},{"$f":"(N58/#REF!)/2000000","v":{"$error":"#REF!"}}]
{"$rows_empty":6598}
[{"$nulls":6},87354]
[{"$nulls":6},87355]
[{"$nulls":6},87356]
[{"$nulls":6},87357]
[{"$nulls":6},87358]
[{"$nulls":6},87359]
[{"$nulls":6},87360]
[{"$nulls":6},87361]
[{"$nulls":6},87362]
[{"$nulls":6},87363]
[{"$nulls":6},87364]
[{"$nulls":6},87365]
[{"$nulls":6},87366]
[{"$nulls":6},87367]
[{"$nulls":6},87368]
[{"$nulls":6},87369]
[{"$nulls":6},87370]
[{"$nulls":6},87371]
[{"$nulls":6},87372]
[{"$nulls":6},87373]
[{"$nulls":6},87374]
[{"$nulls":6},87375]
[{"$nulls":6},87376]
[{"$nulls":6},87377]
[{"$nulls":6},87378]
[{"$nulls":6},87379]
[{"$nulls":6},87380]
[{"$nulls":6},87381]
[{"$nulls":6},87382]
[{"$nulls":6},87383]
[{"$nulls":6},87384]
[{"$nulls":6},87385]
[{"$nulls":6},87386]
[{"$nulls":6},87387]
[{"$nulls":6},87388]
[{"$nulls":6},87389]
[{"$nulls":6},87390]
[{"$nulls":6},87391]
[{"$nulls":6},87393]
[{"$nulls":6},87394]
[{"$nulls":6},87395]
[{"$nulls":6},87396]
[{"$nulls":6},87397]
[{"$nulls":6},87398]
[{"$nulls":6},87399]
[{"$nulls":6},87401]
[{"$nulls":6},87402]
[{"$nulls":6},87404]
[{"$nulls":6},87405]
[{"$nulls":6},87407]
[{"$nulls":6},87408]
[{"$nulls":6},87410]
[{"$nulls":6},88626]
[{"$nulls":6},88627]
[{"$nulls":6},88628]
[{"$nulls":6},88629]
[{"$nulls":6},88630]
[{"$nulls":6},88631]
[{"$nulls":6},88715]
[{"$nulls":6},95563]
[{"$nulls":6},100464]
[{"$nulls":6},100465]
[{"$nulls":6},100466]
[{"$nulls":6},100468]
[{"$nulls":6},100469]
[{"$nulls":6},100470]
[{"$nulls":6},100472]
[{"$nulls":6},100473]
[{"$nulls":6},100474]
[{"$nulls":6},100475]
[{"$nulls":6},100477]
[{"$nulls":6},100478]
[{"$nulls":6},100479]
[{"$nulls":6},100480]
[{"$nulls":6},100481]
[{"$nulls":6},100483]
[{"$nulls":6},100484]
[{"$nulls":6},100485]
[{"$nulls":6},100486]
[{"$nulls":6},100487]
[{"$nulls":6},100488]
[{"$nulls":6},100489]
[{"$nulls":6},100490]
[{"$nulls":6},100491]
[{"$nulls":6},100492]
[{"$nulls":6},92121]
[{"$nulls":6},92122]
[{"$nulls":6},92123]
[{"$nulls":6},100195]
[{"$nulls":6},100196]
[{"$nulls":6},100197]
[{"$nulls":6},100198]
[{"$nulls":6},100199]
[{"$nulls":6},100200]
[{"$nulls":6},100201]
[{"$nulls":6},100202]
[{"$nulls":6},100203]
[{"$nulls":6},100204]
[{"$nulls":6},100205]
[{"$nulls":6},100206]
[{"$nulls":6},100207]
[{"$nulls":6},100208]
[{"$nulls":6},100209]
[{"$nulls":6},100210]
[{"$nulls":6},100211]
[{"$nulls":6},100212]
[{"$nulls":6},100213]
[{"$nulls":6},100214]
[{"$nulls":6},100215]
[{"$nulls":6},100216]
[{"$nulls":6},100217]
[{"$nulls":6},100218]
[{"$nulls":6},100219]
[{"$nulls":6},100220]
[{"$nulls":6},100221]
[{"$nulls":6},100222]
[{"$nulls":6},100223]
[{"$nulls":6},100224]
[{"$nulls":6},100225]
[{"$nulls":6},100226]
[{"$nulls":6},100227]
[{"$nulls":6},100228]
[{"$nulls":6},100229]
[{"$nulls":6},100230]
[{"$nulls":6},100231]
[{"$nulls":6},100232]
[{"$nulls":6},100233]
[{"$nulls":6},100234]
[{"$nulls":6},100235]
[{"$nulls":6},100236]
[{"$nulls":6},100237]
[{"$nulls":6},100238]
[{"$nulls":6},100239]
[{"$nulls":6},100240]
[{"$nulls":6},100241]
[{"$nulls":6},100242]
[{"$nulls":6},100243]
[{"$nulls":6},100244]
[{"$nulls":6},100245]
[{"$nulls":6},100246]
[{"$nulls":6},100247]
[{"$nulls":6},100248]
[{"$nulls":6},100249]
[{"$nulls":6},100250]
[{"$nulls":6},100251]
[{"$nulls":6},100252]
[{"$nulls":6},100253]
[{"$nulls":6},100254]
[{"$nulls":6},100255]
[{"$nulls":6},100256]
[{"$nulls":6},100257]
[{"$nulls":6},100258]
[{"$nulls":6},100259]
[{"$nulls":6},100260]
[{"$nulls":6},100261]
[{"$nulls":6},100262]
[{"$nulls":6},100263]
[{"$nulls":6},100264]
[{"$nulls":6},100265]
[{"$nulls":6},100266]
[{"$nulls":6},100267]
[{"$nulls":6},100268]
[{"$nulls":6},100269]
[{"$nulls":6},100270]
[{"$nulls":6},100271]
[{"$nulls":6},100272]
[{"$nulls":6},100273]
[{"$nulls":6},100274]
[{"$nulls":6},100275]
[{"$nulls":6},100276]
[{"$nulls":6},100277]
[{"$nulls":6},100278]
[{"$nulls":6},100279]
[{"$nulls":6},100280]
[{"$nulls":6},100281]
[{"$nulls":6},100282]
[{"$nulls":6},100283]
[{"$nulls":6},100284]
[{"$nulls":6},100285]
[{"$nulls":6},100286]
[{"$nulls":6},100287]
[{"$nulls":6},99802]
[{"$nulls":6},99803]
[{"$nulls":6},99804]
[{"$nulls":6},99805]
[{"$nulls":6},99806]
[{"$nulls":6},99807]
[{"$nulls":6},99808]
[{"$nulls":6},99809]
[{"$nulls":6},99810]
[{"$nulls":6},99811]
[{"$nulls":6},99812]
[{"$nulls":6},99813]
[{"$nulls":6},99814]
[{"$nulls":6},99815]
[{"$nulls":6},99816]
[{"$nulls":6},99817]
[{"$nulls":6},99818]
[{"$nulls":6},99819]
[{"$nulls":6},99820]
[{"$nulls":6},99821]
[{"$nulls":6},99822]
[{"$nulls":6},99823]
[{"$nulls":6},99824]
[{"$nulls":6},99825]
[{"$nulls":6},99826]
[{"$nulls":6},97013]
[{"$nulls":6},97014]
[{"$nulls":6},97015]
[{"$nulls":6},97016]
[{"$nulls":6},97017]
[{"$nulls":6},97018]
[{"$nulls":6},97031]
[{"$nulls":6},97032]
[{"$nulls":6},97033]
[{"$nulls":6},97034]
[{"$nulls":6},97039]
[{"$nulls":6},97040]
[{"$nulls":6},97041]
[{"$nulls":6},97046]
[{"$nulls":6},97047]
[{"$nulls":6},97048]
[{"$nulls":6},97054]
[{"$nulls":6},97062]
[{"$nulls":6},97063]
[{"$nulls":6},97064]
[{"$nulls":6},97065]
[{"$nulls":6},97066]
[{"$nulls":6},97067]
[{"$nulls":6},105103]
[{"$nulls":6},105104]
[{"$nulls":6},105105]
[{"$nulls":6},105106]
[{"$nulls":6},105107]
[{"$nulls":6},105110]
[{"$nulls":6},105111]
[{"$nulls":6},105112]
[{"$nulls":6},97621]
[{"$nulls":6},97622]
[{"$nulls":6},97623]
[{"$nulls":6},97624]
[{"$nulls":6},97625]
[{"$nulls":6},97626]
[{"$nulls":6},97627]
[{"$nulls":6},97628]
[{"$nulls":6},97629]
[{"$nulls":6},97631]
[{"$nulls":6},97632]
[{"$nulls":6},97633]
[{"$nulls":6},97634]
[{"$nulls":6},97635]
[{"$nulls":6},97636]
[{"$nulls":6},97637]
[{"$nulls":6},97638]
[{"$nulls":6},97639]
[{"$nulls":6},97640]
[{"$nulls":6},97641]
[{"$nulls":6},97642]
[{"$nulls":6},97643]
[{"$nulls":6},97644]
[{"$nulls":6},97645]
[{"$nulls":6},97647]
[{"$nulls":6},97648]
[{"$nulls":6},97649]
[{"$nulls":6},97650]
[{"$nulls":6},97651]
[{"$nulls":6},97652]
[{"$nulls":6},97653]
[{"$nulls":6},97654]
[{"$nulls":6},97655]
[{"$nulls":6},97656]
[{"$nulls":6},97657]
[{"$nulls":6},97658]
[{"$nulls":6},97659]
[{"$nulls":6},97660]
[{"$nulls":6},97661]
[{"$nulls":6},97662]
[{"$nulls":6},97663]
[{"$nulls":6},97664]
[{"$nulls":6},97665]
[{"$nulls":6},97666]
[{"$nulls":6},104789]
[{"$nulls":6},104790]
[{"$nulls":6},104791]
[{"$nulls":6},104792]
[{"$nulls":6},104793]
[{"$nulls":6},104794]
[{"$nulls":6},104795]
[{"$nulls":6},104796]
[{"$nulls":6},104797]
[{"$nulls":6},104798]
[{"$nulls":6},104799]
[{"$nulls":6},104800]
[{"$nulls":6},104801]
[{"$nulls":6},104802]
[{"$nulls":6},104803]
[{"$nulls":6},95967]
[{"$nulls":6},99059]
[{"$nulls":6},99060]
[{"$nulls":6},99061]
[{"$nulls":6},99062]
[{"$nulls":6},99063]
[{"$nulls":6},105007]
[{"$nulls":6},105009]
[{"$nulls":6},105011]
[{"$nulls":6},93588]
[{"$nulls":6},93589]
[{"$nulls":6},93590]
[{"$nulls":6},93591]
[{"$nulls":6},93592]
[{"$nulls":6},93593]
[{"$nulls":6},93594]
[{"$nulls":6},93595]
[{"$nulls":6},93596]
[{"$nulls":6},93597]
[{"$nulls":6},93598]
[{"$nulls":6},93599]
[{"$nulls":6},95425]
[{"$nulls":6},95426]
[{"$nulls":6},95427]
[{"$nulls":6},95428]
[{"$nulls":6},95429]
[{"$nulls":6},95430]
[{"$nulls":6},95875]
[{"$nulls":6},95876]
[{"$nulls":6},95877]
[{"$nulls":6},95878]
[{"$nulls":6},95879]
[{"$nulls":6},95880]
[{"$nulls":6},97912]
[{"$nulls":6},97913]
[{"$nulls":6},97914]
[{"$nulls":6},97915]
[{"$nulls":6},100937]
[{"$nulls":6},100938]
[{"$nulls":6},100939]
[{"$nulls":6},100940]
[{"$nulls":6},100941]
[{"$nulls":6},100942]
[{"$nulls":6},100943]
[{"$nulls":6},100944]
[{"$nulls":6},100945]
[{"$nulls":6},100946]
[{"$nulls":6},100947]
[{"$nulls":6},100948]
[{"$nulls":6},100949]
[{"$nulls":6},100950]
[{"$nulls":6},100951]
[{"$nulls":6},100952]
[{"$nulls":6},100953]
[{"$nulls":6},100954]
[{"$nulls":6},100955]
[{"$nulls":6},100956]
[{"$nulls":6},100957]
[{"$nulls":6},100958]
[{"$nulls":6},100959]
[{"$nulls":6},100960]
[{"$nulls":6},100961]
[{"$nulls":6},100962]
[{"$nulls":6},100963]
[{"$nulls":6},100964]
[{"$nulls":6},100973]
[{"$nulls":6},100974]
[{"$nulls":6},100975]
[{"$nulls":6},100965]
[{"$nulls":6},100966]
[{"$nulls":6},100969]
[{"$nulls":6},100970]
[{"$nulls":6},102330]
[{"$nulls":6},102331]
[{"$nulls":6},102332]
[{"$nulls":6},102333]
[{"$nulls":6},101019]
[{"$nulls":6},101479]
[{"$nulls":6},102568]
[{"$nulls":6},100976]
[{"$nulls":6},100977]
[{"$nulls":6},100978]
[{"$nulls":6},100979]
[{"$nulls":6},100980]
[{"$nulls":6},100981]
[{"$nulls":6},100982]
[{"$nulls":6},100983]
[{"$nulls":6},100984]
[{"$nulls":6},100985]
[{"$nulls":6},100986]
[{"$nulls":6},100987]
[{"$nulls":6},100988]
[{"$nulls":6},100989]
[{"$nulls":6},100990]
[{"$nulls":6},100991]
[{"$nulls":6},100992]
[{"$nulls":6},100993]
[{"$nulls":6},100994]
[{"$nulls":6},100995]
[{"$nulls":6},100996]
[{"$nulls":6},100997]
[{"$nulls":6},100998]
[{"$nulls":6},100999]
[{"$nulls":6},101000]
[{"$nulls":6},101001]
[{"$nulls":6},101002]
[{"$nulls":6},101003]
[{"$nulls":6},101004]
[{"$nulls":6},101005]
[{"$nulls":6},101006]
[{"$nulls":6},101007]
[{"$nulls":6},101008]
[{"$nulls":6},101009]
[{"$nulls":6},101010]
[{"$nulls":6},101013]
[{"$nulls":6},101014]
[{"$nulls":6},101015]
[{"$nulls":6},101016]
[{"$nulls":6},101017]
[{"$nulls":6},101018]
[{"$nulls":6},101463]
[{"$nulls":6},101464]
[{"$nulls":6},101465]
[{"$nulls":6},101466]
[{"$nulls":6},101467]
[{"$nulls":6},101468]
[{"$nulls":6},101469]
[{"$nulls":6},101470]
[{"$nulls":6},101471]
[{"$nulls":6},101472]
[{"$nulls":6},101473]
[{"$nulls":6},101474]
[{"$nulls":6},101475]
[{"$nulls":6},101476]
[{"$nulls":6},101477]
[{"$nulls":6},101478]
[{"$nulls":6},101480]
[{"$nulls":6},101481]
[{"$nulls":6},101482]
[{"$nulls":6},101483]
[{"$nulls":6},101484]
[{"$nulls":6},101485]
[{"$nulls":6},101486]
[{"$nulls":6},101487]
[{"$nulls":6},101488]
[{"$nulls":6},101188]
[{"$nulls":6},101189]
[{"$nulls":6},101190]
[{"$nulls":6},101191]
[{"$nulls":6},101192]
[{"$nulls":6},101193]
[{"$nulls":6},101194]
[{"$nulls":6},101197]
[{"$nulls":6},101198]
[{"$nulls":6},101199]
[{"$nulls":6},101200]
[{"$nulls":6},101201]
[{"$nulls":6},101202]
[{"$nulls":6},101203]
[{"$nulls":6},101204]
[{"$nulls":6},101205]
[{"$nulls":6},102362]
[{"$nulls":6},102363]
[{"$nulls":6},102364]
[{"$nulls":6},98509]
[{"$nulls":6},98510]
[{"$nulls":6},98511]
[{"$nulls":6},98516]
[{"$nulls":6},98519]
[{"$nulls":6},98520]
[{"$nulls":6},98521]
[{"$nulls":6},98522]
[{"$nulls":6},98524]
[{"$nulls":6},98503]
[{"$nulls":6},98504]
[{"$nulls":6},98505]
[{"$nulls":6},103946]
[{"$nulls":6},105000]
[{"$nulls":6},105001]
[{"$nulls":6},105002]
[{"$nulls":6},105003]
[{"$nulls":6},105004]
[{"$nulls":6},105005]
[{"$nulls":6},103185]
[{"$nulls":6},103186]
[{"$nulls":6},103187]
[{"$nulls":6},103188]
[{"$nulls":6},103189]
[{"$nulls":6},103190]
[{"$nulls":6},103191]
[{"$nulls":6},103192]
[{"$nulls":6},103193]
[{"$nulls":6},103194]
[{"$nulls":6},103195]
[{"$nulls":6},103205]
[{"$nulls":6},103206]
[{"$nulls":6},103207]
[{"$nulls":6},103208]
[{"$nulls":6},103209]
[{"$nulls":6},103210]
[{"$nulls":6},103304]
[{"$nulls":6},103307]
[{"$nulls":6},103310]
[{"$nulls":6},103314]
[{"$nulls":6},103315]
[{"$nulls":6},103769]
[{"$nulls":6},98525]
[{"$nulls":6},98526]
[{"$nulls":6},98527]
[{"$nulls":6},98528]
[{"$nulls":6},98529]
[{"$nulls":6},98530]
[{"$nulls":6},98531]
[{"$nulls":6},98532]
[{"$nulls":6},98533]
[{"$nulls":6},98534]
[{"$nulls":6},98535]
[{"$nulls":6},88238]
[{"$nulls":6},88239]
[{"$nulls":6},88240]
[{"$nulls":6},88241]
[{"$nulls":6},88242]
[{"$nulls":6},88243]
[{"$nulls":6},88245]
[{"$nulls":6},88246]
[{"$nulls":6},88247]
[{"$nulls":6},88248]
[{"$nulls":6},88249]
[{"$nulls":6},88250]
[{"$nulls":6},88251]
[{"$nulls":6},88252]
[{"$nulls":6},88253]
[{"$nulls":6},88255]
[{"$nulls":6},88256]
[{"$nulls":6},88257]
[{"$nulls":6},88260]
[{"$nulls":6},88261]
[{"$nulls":6},88262]
[{"$nulls":6},88263]
[{"$nulls":6},88264]
[{"$nulls":6},88266]
[{"$nulls":6},88267]
[{"$nulls":6},88269]
[{"$nulls":6},88270]
[{"$nulls":6},88272]
[{"$nulls":6},88273]
[{"$nulls":6},88274]
[{"$nulls":6},88275]
[{"$nulls":6},88277]
[{"$nulls":6},88278]
[{"$nulls":6},88279]
[{"$nulls":6},88281]
[{"$nulls":6},88282]
[{"$nulls":6},88283]
[{"$nulls":6},88284]
[{"$nulls":6},88286]
[{"$nulls":6},88288]
[{"$nulls":6},88291]
[{"$nulls":6},88292]
[{"$nulls":6},88293]
[{"$nulls":6},88294]
[{"$nulls":6},88295]
[{"$nulls":6},88296]
[{"$nulls":6},88297]
[{"$nulls":6},88298]
[{"$nulls":6},88299]
[{"$nulls":6},88300]
[{"$nulls":6},88301]
[{"$nulls":6},88302]
[{"$nulls":6},88303]
[{"$nulls":6},88304]
[{"$nulls":6},88306]
[{"$nulls":6},88307]
[{"$nulls":6},88308]
[{"$nulls":6},88309]
[{"$nulls":6},88310]
[{"$nulls":6},88311]
[{"$nulls":6},88312]
[{"$nulls":6},88313]
[{"$nulls":6},88314]
[{"$nulls":6},88315]
[{"$nulls":6},88316]
[{"$nulls":6},88317]
[{"$nulls":6},88318]
[{"$nulls":6},88321]
[{"$nulls":6},88322]
[{"$nulls":6},88323]
[{"$nulls":6},88324]
[{"$nulls":6},88325]
[{"$nulls":6},88377]
[{"$nulls":6},88441]
[{"$nulls":6},90766]
[{"$nulls":6},90767]
[{"$nulls":6},90768]
[{"$nulls":6},90769]
[{"$nulls":6},90770]
[{"$nulls":6},90772]
[{"$nulls":6},90775]
[{"$nulls":6},90776]
[{"$nulls":6},90777]
[{"$nulls":6},90778]
[{"$nulls":6},90779]
[{"$nulls":6},90780]
[{"$nulls":6},90781]
[{"$nulls":6},93558]
[{"$nulls":6},93561]
[{"$nulls":6},93563]
[{"$nulls":6},93564]
[{"$nulls":6},93565]
[{"$nulls":6},93566]
[{"$nulls":6},93567]
[{"$nulls":6},93568]
[{"$nulls":6},93569]
[{"$nulls":6},93570]
[{"$nulls":6},93571]
[{"$nulls":6},93572]
[{"$nulls":6},94295]
[{"$nulls":6},94296]
[{"$nulls":6},95308]
[{"$nulls":6},95309]
[{"$nulls":6},95310]
[{"$nulls":6},95311]
[{"$nulls":6},95312]
[{"$nulls":6},95313]
[{"$nulls":6},95314]
[{"$nulls":6},95315]
[{"$nulls":6},95316]
[{"$nulls":6},95317]
[{"$nulls":6},95318]
[{"$nulls":6},95319]
[{"$nulls":6},95320]
[{"$nulls":6},95321]
[{"$nulls":6},95322]
[{"$nulls":6},95323]
[{"$nulls":6},95324]
[{"$nulls":6},95325]
[{"$nulls":6},95328]
[{"$nulls":6},95329]
[{"$nulls":6},95330]
[{"$nulls":6},95331]
[{"$nulls":6},95332]
[{"$nulls":6},95334]
[{"$nulls":6},95335]
[{"$nulls":6},95337]
[{"$nulls":6},95338]
[{"$nulls":6},95339]
[{"$nulls":6},95340]
[{"$nulls":6},95341]
[{"$nulls":6},95342]
[{"$nulls":6},95343]
[{"$nulls":6},95344]
[{"$nulls":6},95345]
[{"$nulls":6},95346]
[{"$nulls":6},95347]
[{"$nulls":6},95348]
[{"$nulls":6},95349]
[{"$nulls":6},95351]
[{"$nulls":6},95352]
[{"$nulls":6},95354]
[{"$nulls":6},95355]
[{"$nulls":6},95356]
[{"$nulls":6},95357]
[{"$nulls":6},95358]
[{"$nulls":6},95359]
[{"$nulls":6},95360]
[{"$nulls":6},95361]
[{"$nulls":6},95362]
[{"$nulls":6},95363]
[{"$nulls":6},95364]
[{"$nulls":6},95365]
[{"$nulls":6},95366]
[{"$nulls":6},95367]
[{"$nulls":6},95368]
[{"$nulls":6},95369]
[{"$nulls":6},95370]
[{"$nulls":6},95371]
[{"$nulls":6},95372]
[{"$nulls":6},95373]
[{"$nulls":6},95374]
[{"$nulls":6},95375]
[{"$nulls":6},95376]
[{"$nulls":6},95377]
[{"$nulls":6},95378]
[{"$nulls":6},95379]
[{"$nulls":6},95380]
[{"$nulls":6},95383]
[{"$nulls":6},95384]
[{"$nulls":6},95385]
[{"$nulls":6},95386]
[{"$nulls":6},95387]
[{"$nulls":6},95389]
[{"$nulls":6},95390]
[{"$nulls":6},95392]
[{"$nulls":6},95393]
[{"$nulls":6},95394]
[{"$nulls":6},95395]
[{"$nulls":6},95396]
[{"$nulls":6},95398]
[{"$nulls":6},95400]
[{"$nulls":6},95401]
[{"$nulls":6},95402]
[{"$nulls":6},95403]
[{"$nulls":6},95404]
[{"$nulls":6},95405]
[{"$nulls":6},95406]
[{"$nulls":6},95408]
[{"$nulls":6},95411]
[{"$nulls":6},95413]
[{"$nulls":6},95414]
[{"$nulls":6},95415]
[{"$nulls":6},95416]
[{"$nulls":6},95417]
[{"$nulls":6},95418]
[{"$nulls":6},95419]
[{"$nulls":6},95420]
[{"$nulls":6},95421]
[{"$nulls":6},95422]
[{"$nulls":6},95423]
[{"$nulls":6},95424]
[{"$nulls":6},100288]
[{"$nulls":6},100289]
[{"$nulls":6},100291]
[{"$nulls":6},100293]
[{"$nulls":6},100295]
[{"$nulls":6},100298]
[{"$nulls":6},100299]
[{"$nulls":6},100301]
[{"$nulls":6},100303]
[{"$nulls":6},100307]
[{"$nulls":6},100308]
[{"$nulls":6},100309]
[{"$nulls":6},100315]
[{"$nulls":6},100321]
[{"$nulls":6},100533]
[{"$nulls":6},100534]
[{"$nulls":6},100535]
[{"$nulls":6},100536]
[{"$nulls":6},101286]
[{"$nulls":6},101287]
[{"$nulls":6},101288]
[{"$nulls":6},101289]
[{"$nulls":6},101290]
[{"$nulls":6},101291]
[{"$nulls":6},101292]
[{"$nulls":6},101293]
[{"$nulls":6},101294]
[{"$nulls":6},101295]
[{"$nulls":6},101296]
[{"$nulls":6},101297]
[{"$nulls":6},101298]
[{"$nulls":6},101299]
[{"$nulls":6},101300]
[{"$nulls":6},101301]
[{"$nulls":6},101302]
[{"$nulls":6},101303]
[{"$nulls":6},101304]
[{"$nulls":6},101305]
[{"$nulls":6},101307]
[{"$nulls":6},101308]
[{"$nulls":6},101309]
[{"$nulls":6},101310]
[{"$nulls":6},101311]
[{"$nulls":6},101312]
[{"$nulls":6},101313]
[{"$nulls":6},101315]
[{"$nulls":6},101316]
[{"$nulls":6},101320]
[{"$nulls":6},101322]
[{"$nulls":6},101323]
[{"$nulls":6},101324]
[{"$nulls":6},101325]
[{"$nulls":6},101326]
[{"$nulls":6},101328]
[{"$nulls":6},101329]
[{"$nulls":6},101330]
[{"$nulls":6},101331]
[{"$nulls":6},101332]
[{"$nulls":6},101333]
[{"$nulls":6},101334]
[{"$nulls":6},101336]
[{"$nulls":6},101337]
[{"$nulls":6},101338]
[{"$nulls":6},101339]
[{"$nulls":6},101340]
[{"$nulls":6},101341]
[{"$nulls":6},101342]
[{"$nulls":6},101343]
[{"$nulls":6},101344]
[{"$nulls":6},101345]
[{"$nulls":6},101346]
[{"$nulls":6},101347]
[{"$nulls":6},101348]
[{"$nulls":6},101349]
[{"$nulls":6},101350]
[{"$nulls":6},101351]
[{"$nulls":6},101352]
[{"$nulls":6},101353]
[{"$nulls":6},101355]
[{"$nulls":6},101356]
[{"$nulls":6},101357]
[{"$nulls":6},101358]
[{"$nulls":6},101359]
[{"$nulls":6},101360]
[{"$nulls":6},101361]
[{"$nulls":6},101363]
[{"$nulls":6},101364]
[{"$nulls":6},101365]
[{"$nulls":6},101366]
[{"$nulls":6},101368]
[{"$nulls":6},101369]
[{"$nulls":6},101370]
[{"$nulls":6},101371]
[{"$nulls":6},101372]
[{"$nulls":6},101374]
[{"$nulls":6},101375]
[{"$nulls":6},101376]
[{"$nulls":6},101377]
[{"$nulls":6},101378]
[{"$nulls":6},101379]
[{"$nulls":6},101380]
[{"$nulls":6},101381]
[{"$nulls":6},101382]
[{"$nulls":6},101383]
[{"$nulls":6},101384]
[{"$nulls":6},101385]
[{"$nulls":6},101386]
[{"$nulls":6},101387]
[{"$nulls":6},101388]
[{"$nulls":6},101389]
[{"$nulls":6},101390]
[{"$nulls":6},101391]
[{"$nulls":6},101392]
[{"$nulls":6},101394]
[{"$nulls":6},101395]
[{"$nulls":6},101396]
[{"$nulls":6},101397]
[{"$nulls":6},101398]
[{"$nulls":6},101399]
[{"$nulls":6},101401]
[{"$nulls":6},101402]
[{"$nulls":6},101407]
[{"$nulls":6},101408]
[{"$nulls":6},101409]
[{"$nulls":6},101410]
[{"$nulls":6},101412]
[{"$nulls":6},101413]
[{"$nulls":6},101414]
[{"$nulls":6},101415]
[{"$nulls":6},101416]
[{"$nulls":6},101417]
[{"$nulls":6},101418]
[{"$nulls":6},101419]
[{"$nulls":6},101420]
[{"$nulls":6},101421]
[{"$nulls":6},101422]
[{"$nulls":6},101424]
[{"$nulls":6},101425]
[{"$nulls":6},101426]
[{"$nulls":6},101427]
[{"$nulls":6},101428]
[{"$nulls":6},101429]
[{"$nulls":6},101430]
[{"$nulls":6},101431]
[{"$nulls":6},101432]
[{"$nulls":6},101433]
[{"$nulls":6},101434]
[{"$nulls":6},101435]
[{"$nulls":6},101436]
[{"$nulls":6},101437]
[{"$nulls":6},101438]
[{"$nulls":6},101439]
[{"$nulls":6},101440]
[{"$nulls":6},101441]
[{"$nulls":6},101443]
[{"$nulls":6},101444]
[{"$nulls":6},101445]
[{"$nulls":6},101446]
[{"$nulls":6},101447]
[{"$nulls":6},101448]
[{"$nulls":6},101449]
[{"$nulls":6},101451]
[{"$nulls":6},101452]
[{"$nulls":6},101453]
[{"$nulls":6},101454]
[{"$nulls":6},101456]
[{"$nulls":6},101457]
[{"$nulls":6},101458]
[{"$nulls":6},101459]
[{"$nulls":6},101460]

{"sheet":"3.JANAÚBA","index":2,"n_rows":7543,"n_cols":30,"rows_kept":7543,"cut":false,"hidden":false,"merged":[[1,1,3,11],[4,1,4,13],[5,1,8,1],[5,2,8,2],[5,3,8,3],[5,4,8,7],[6,9,7,9],[6,12,8,12],[6,13,8,13],[20,4,20,7],[9,4,9,7],[10,4,10,7],[11,4,11,7],[12,4,12,7],[13,4,13,7],[14,4,14,7],[15,4,15,7],[16,4,16,7],[17,4,17,7],[18,4,18,7],[19,4,19,7],[32,4,32,7],[21,4,21,7],[22,4,22,7],[23,4,23,7],[24,4,24,7],[25,4,25,7],[26,4,26,7],[27,4,27,7],[28,4,28,7],[29,4,29,7],[30,4,30,7],[31,4,31,7],[48,4,48,7],[33,4,33,7],[34,4,34,7],[35,4,35,7],[36,4,36,7],[37,4,37,7],[38,4,38,7],[40,4,40,7],[41,4,41,7],[42,4,42,7],[44,4,44,7],[46,4,46,7],[55,4,55,7],[56,4,56,7],[57,1,57,12],[49,4,49,7],[50,4,50,7],[51,4,51,7],[52,4,52,7],[53,4,53,7],[54,4,54,7]]}
[]
[null,"LOGOTIPO DA EMPRESA"]
[]
[{"$nulls":12},"Data Base do Orçamento","2024-08-01"]
[null,"CONTRATAÇÃO DE SERVIÇOS DE PAVIMENTAÇÃO ASFÁLTICA COM CONCRETO BETUMINOSO USINADO A QUENTE (CBUQ) EM VIAS URBANAS E RURAIS INSERIDAS NA ÁREA DE ATUAÇÃO DA 1ª SUPERINTENDÊNCIA REGIONAL DA CODEVASF, NO ESTADO DE MINAS GERAIS - ITEM 3: JANAÚBA/MG"]
[null,"ITEM","ORIGEM\nCOMPOSIÇÃO","CÓDIGO\nCOMPOSIÇÃO","DISCRIMINAÇÃO DOS SERVIÇOS",null,null,null,"BDI % = ",{"$f":"BDI!C17","v":0},"BDI  DIFERENCIADO% =",{"$f":"BDI!C33","v":0},"R$/m²",{"$f":"N58/I8","v":0},{"$f":"N58","v":0}]
[{"$nulls":8},"Total de m²","Encargos Sociais:","Horista","Mensalista","PREÇO UNITÁRIO COM BDI","PREÇO TOTAL COM BDI "]
[{"$nulls":8},63000,null,{"$f":"'ENC.SOC.'!$E$51","v":0},{"$f":"'ENC.SOC.'!$F$51","v":0}]
[{"$nulls":8},"UND","QTDE.","BDI","PREÇO UNITÁRIO "]
[{"$nulls":4},"MOBILIZAÇÃO/DESMOBILIZAÇÃO"]
[null,1,"Codevasf","Mob","Mobilização",null,null,null,"kmxfrente",540,{"$f":"(M11/L11-1)","v":{"$error":"#DIV/0!"}},null,{"$f":"L11*(1+$J$6)","v":0},{"$f":"M11*J11","v":0},{"$f":"N11/$N$58","v":{"$error":"#DIV/0!"}}]
[null,2,"Codevasf","Mob","Desmobilização",null,null,null,"kmxfrente",540,{"$f":"(M12/L12-1)","v":{"$error":"#DIV/0!"}},null,{"$f":"L12*(1+$J$6)","v":0},{"$f":"M12*J12","v":0},{"$f":"N12/$N$58","v":{"$error":"#DIV/0!"}}]
[{"$nulls":4},"INSTALAÇÃO DE CANTEIRO"]
[null,3,"Codevasf","Canteiro","Canteiro de Obras e Almoxarifado",null,null,null,"frente",6,{"$f":"(M14/L14-1)","v":{"$error":"#DIV/0!"}},null,{"$f":"L14*(1+$J$6)","v":0},{"$f":"ROUND(ROUND(J14,2)*ROUND(M14,6),2)","v":0},{"$f":"N14/N58","v":{"$error":"#DIV/0!"}}]
[null,4,"SINAPI",103689,"FORNECIMENTO E INSTALAÇÃO DE PLACA DE OBRA COM CHAPA GALVANIZADA E ESTRUTURA DE MADEIRA",null,null,null,"m²",96,{"$f":"(M15/L15-1)","v":{"$error":"#DIV/0!"}},null,0,{"$f":"ROUND(ROUND(J15,2)*ROUND(M15,6),2)","v":0}]
[{"$nulls":4},"ADMINISTRAÇÃO LOCAL DA OBRA"]
[null,5,"Codevasf","Adm Local","Administração Local da Obra",null,null,null,"und",1,{"$f":"(M17/L17-1)","v":{"$error":"#DIV/0!"}},null,{"$f":"L17*(1+$J$6)","v":0},{"$f":"ROUND(ROUND(J17,2)*ROUND(M17,6),2)","v":0},{"$f":"N17/N58","v":{"$error":"#DIV/0!"}}]
[{"$nulls":4},"TERRAPLANAGEM"]
[null,6,"SICRO",5502114,"Escavação, carga e transporte de material de 1ª categoria - DMT de 1.000 a 1.200 m - caminho de serviço em leito natural - com escavadeira e caminhão basculante de 14 m³",null,null,null,"m³",22050,{"$f":"M19/L19-1","v":{"$error":"#DIV/0!"}},null,{"$f":"L19*(1+$J$6)","v":0},{"$f":"ROUND(ROUND(J19,2)*ROUND(M19,6),2)","v":0}]
[null,7,"SICRO",4413942,"Espalhamento de material em bota-fora",null,null,null,"m³",22050,{"$error":"#DIV/0!"},null,0,0,{"$nulls":15},1]
[{"$nulls":4},"PAVIMENTAÇÃO"]
[null,8,"SICRO",4011463,"Concreto asfáltico - faixa C - areia e brita comerciais",null,null,null,"t",7560,{"$f":"M22/L22-1","v":{"$error":"#DIV/0!"}},null,{"$f":"L22*(1+$J$6)","v":0},{"$f":"ROUND(ROUND(J22,2)*ROUND(M22,6),2)","v":0}]
[null,9,"SICRO",4011352,"Imprimação com emulsão asfáltica",null,null,null,"m²",63000,{"$error":"#DIV/0!"},null,0,0]
[null,10,"SICRO",4011353,"Pintura de ligação",null,null,null,"m²",63000,{"$error":"#DIV/0!"},null,0,0]
[null,11,"SICRO",4011268,"Base estabilizada granulometricamente com mistura solo brita (70% - 30%) em usina com material de jazida e brita comercial",null,null,null,"m³",9450,{"$error":"#DIV/0!"},null,0,0]
[null,12,"SICRO",4011228,"Sub-base estabilizada granulometricamente com mistura de solos na pista com material de jazida",null,null,null,"m³",9450,{"$error":"#DIV/0!"},null,0,0]
[null,13,"SICRO",4011209,"Regularização do subleito",null,null,null,"m²",63000,{"$error":"#DIV/0!"},null,0,0]
[{"$nulls":4},"AQUISIÇÃO E TRANSPORTE DO MATERIAL BETUMINOSO"]
[null,14,"CODEVASF","CPU-13","AQUISIÇÃO DE CIMENTO ASFALTICO CAP 50/70",null,null,null,"t",487.54,{"$f":"M29/L29-1","v":{"$error":"#DIV/0!"}},null,{"$f":"L29*(1+$L$6)","v":0},{"$f":"ROUND(ROUND(J29,2)*ROUND(M29,6),2)","v":0}]
[null,15,"CODEVASF","CPU-17","TRANSPORTE CAP 50/70",null,null,null,"t",487.54,{"$error":"#DIV/0!"},null,{"$f":"L30*(1+$L$6)","v":0},0]
[null,16,"CODEVASF","CPU-14","AQUISIÇÃO DE EAI",null,null,null,"t",81.900000000000006,{"$error":"#DIV/0!"},null,0,0]
[null,17,"CODEVASF","CPU-18","TRANSPORTE DE EAI",null,null,null,"t",81.900000000000006,{"$error":"#DIV/0!"},null,0,0]
[null,18,"CODEVASF","CPU-15","AQUISIÇÃO DE EMULSÃO ASFÁLTICA RR-1C",null,null,null,"t",28.35,{"$error":"#DIV/0!"},null,0,0]
[null,19,"CODEVASF","CPU-19","TRANSPORTE RR-1C",null,null,null,"t",28.35,{"$error":"#DIV/0!"},null,0,0]
[{"$nulls":4},"SINALIZAÇÃO"]
[null,20,"SICRO",5213440,"Placa de regulamentação em aço D = 0,60 m - película retrorrefletiva tipo I + SI - fornecimento e implantação",null,null,null,"und",27,{"$f":"M36/L36-1","v":{"$error":"#DIV/0!"}},null,{"$f":"L36*(1+$J$6)","v":0},{"$f":"ROUND(ROUND(J36,2)*ROUND(M36,6),2)","v":0}]
[null,21,"SICRO",5213464,"Placa de advertência em aço, lado de 0,60 m - película retrorrefletiva tipo I + SI - fornecimento e implantação",null,null,null,"und",27,{"$error":"#DIV/0!"},null,0,0]
[null,22,"SICRO",5213863,"Suporte metálico galvanizado para placa de advertência ou regulamentação - lado ou diâmetro de 0,60 m - fornecimento e implantação",null,null,null,"und",54,{"$error":"#DIV/0!"},null,0,0]
[null,23,"SICRO",5213400,"Pintura de faixa com tinta acrílica - espessura de 0,4 mm",null,null,null,"m²",2520,{"$error":"#DIV/0!"},null,0,0]
[{"$nulls":4},"DRENAGEM"]
[null,24,"SINAPI",94273,"ASSENTAMENTO DE GUIA (MEIO-FIO) EM TRECHO RETO, CONFECCIONADA EM CONCRETO PRÉ-FABRICADO, DIMENSÕES 100X15X13X30 CM (COMPRIMENTO X BASE INFERIOR X BASE SUPERIOR X ALTURA)",null,null,null,"m",18000,{"$f":"M41/L41-1","v":{"$error":"#DIV/0!"}},null,{"$f":"L41*(1+$J$6)","v":0},{"$f":"ROUND(ROUND(J41,2)*ROUND(M41,6),2)","v":0}]
[null,25,"SINAPI",94287,"EXECUÇÃO DE SARJETA DE CONCRETO USINADO, MOLDADA  IN LOCO  EM TRECHO RETO, 30 CM BASE X 10 CM ALTURA",null,null,null,"m",18000,{"$f":"M42/L42-1","v":{"$error":"#DIV/0!"}},null,0,{"$f":"ROUND(ROUND(J42,2)*ROUND(M42,6),2)","v":0}]
[null,26,"SICRO",4915724,"Caiação mecanizada com fixador de cal",null,null,null,"m²",2160,{"$f":"(M43/L43-1)","v":{"$error":"#DIV/0!"}},null,0,{"$f":"ROUND(ROUND(J43,2)*ROUND(M43,6),2)","v":0},{"$nulls":10},4514640]
[{"$nulls":4},"SERVIÇOS COMPLEMENTARES"]
[null,27,"Codevasf","CPU-12","Conserto de quebra no ramal na rua sem pavimento com fornecimento de material hidráulico",null,null,null,"m",900,{"$f":"M45/L45-1","v":{"$error":"#DIV/0!"}},null,{"$f":"L45*(1+$J$6)","v":0},{"$f":"ROUND(ROUND(J45,2)*ROUND(M45,6),2)","v":0}]
[{"$nulls":4},"PROJETO EXECUTIVO"]
[null,28,"Codevasf","Composição Própria","Projeto Executivo",null,null,null,"m²",63000,{"$f":"M47/L47-1","v":{"$error":"#DIV/0!"}},null,{"$f":"L47*(1+$J$6)","v":0},{"$f":"ROUND(ROUND(J47,2)*ROUND(M47,6),2)","v":0}]
[{"$nulls":4},"MOMENTO DE TRANSPORTE"]
[null,29,"SICRO",5914359,"Transporte com caminhão basculante de 10 m³ - rodovia em leito natural",null,null,null,"tkm",123284.14,{"$f":"M49/L49-1","v":{"$error":"#DIV/0!"}},null,{"$f":"L49*(1+$J$6)","v":0},{"$f":"ROUND(ROUND(J49,2)*ROUND(M49,6),2)","v":0}]
[null,30,"SICRO",5914374,"Transporte com caminhão basculante de 10 m³ - rodovia em revestimento primário",null,null,null,"tkm",123284.14,{"$error":"#DIV/0!"},null,0,0]
[null,31,"SICRO",5914389,"Transporte com caminhão basculante de 10 m³ - rodovia pavimentada",null,null,null,"tkm",986273.51,{"$error":"#DIV/0!"},null,0,0]
[null,32,"SICRO",5914449,"Transporte com caminhão carroceria de 15 t - rodovia em leito natural",null,null,null,"tkm",556.23,{"$error":"#DIV/0!"},null,0,0]
[null,33,"SICRO",5914464,"Transporte com caminhão carroceria de 15 t - rodovia em revestimento primário",null,null,null,"tkm",556.23,{"$error":"#DIV/0!"},null,0,0]
[null,34,"SICRO",5914479,"Transporte com caminhão carroceria de 15 t - rodovia pavimentada",null,null,null,"tkm",4449.83,{"$error":"#DIV/0!"},null,0,0]
[null,35,"SICRO",5914364,"Transporte de cimento ou cal hidratada a granel com caminhão silo de 30 m³ - rodovia em leito natural",null,null,null,"tkm",446.98,{"$error":"#DIV/0!"},null,0,0]
[null,36,"SICRO",5914365,"Transporte de cimento ou cal hidratada a granel com caminhão silo de 30 m³ - rodovia em revestimento primário",null,null,null,"tkm",446.98,{"$error":"#DIV/0!"},null,0,0]
[null,37,"SICRO",5914366,"Transporte de cimento ou cal hidratada a granel com caminhão silo de 30 m³ - rodovia pavimentada",null,null,null,"tkm",3575.82,{"$f":"M57/L57-1","v":{"$error":"#DIV/0!"}},null,0,{"$f":"ROUND(ROUND(J57,2)*ROUND(M57,6),2)","v":0},{"$f":"SUM(N49:N57)/N58","v":{"$error":"#DIV/0!"}}]
[null,"VALOR TOTAL DO SRP",{"$nulls":11},{"$f":"SUM(N11:N57)","v":0}]
[null,"Obs.: Os valores estão apresentados com apenas 2 casas decimais, mas os valores da presente planilha foram calculados utilizando a precisão de 6 casas decimais. "]
[{"$nulls":13},{"$f":"(N58/#REF!)/2000000","v":{"$error":"#REF!"}}]
{"$rows_empty":6598}
[{"$nulls":6},87354]
[{"$nulls":6},87355]
[{"$nulls":6},87356]
[{"$nulls":6},87357]
[{"$nulls":6},87358]
[{"$nulls":6},87359]
[{"$nulls":6},87360]
[{"$nulls":6},87361]
[{"$nulls":6},87362]
[{"$nulls":6},87363]
[{"$nulls":6},87364]
[{"$nulls":6},87365]
[{"$nulls":6},87366]
[{"$nulls":6},87367]
[{"$nulls":6},87368]
[{"$nulls":6},87369]
[{"$nulls":6},87370]
[{"$nulls":6},87371]
[{"$nulls":6},87372]
[{"$nulls":6},87373]
[{"$nulls":6},87374]
[{"$nulls":6},87375]
[{"$nulls":6},87376]
[{"$nulls":6},87377]
[{"$nulls":6},87378]
[{"$nulls":6},87379]
[{"$nulls":6},87380]
[{"$nulls":6},87381]
[{"$nulls":6},87382]
[{"$nulls":6},87383]
[{"$nulls":6},87384]
[{"$nulls":6},87385]
[{"$nulls":6},87386]
[{"$nulls":6},87387]
[{"$nulls":6},87388]
[{"$nulls":6},87389]
[{"$nulls":6},87390]
[{"$nulls":6},87391]
[{"$nulls":6},87393]
[{"$nulls":6},87394]
[{"$nulls":6},87395]
[{"$nulls":6},87396]
[{"$nulls":6},87397]
[{"$nulls":6},87398]
[{"$nulls":6},87399]
[{"$nulls":6},87401]
[{"$nulls":6},87402]
[{"$nulls":6},87404]
[{"$nulls":6},87405]
[{"$nulls":6},87407]
[{"$nulls":6},87408]
[{"$nulls":6},87410]
[{"$nulls":6},88626]
[{"$nulls":6},88627]
[{"$nulls":6},88628]
[{"$nulls":6},88629]
[{"$nulls":6},88630]
[{"$nulls":6},88631]
[{"$nulls":6},88715]
[{"$nulls":6},95563]
[{"$nulls":6},100464]
[{"$nulls":6},100465]
[{"$nulls":6},100466]
[{"$nulls":6},100468]
[{"$nulls":6},100469]
[{"$nulls":6},100470]
[{"$nulls":6},100472]
[{"$nulls":6},100473]
[{"$nulls":6},100474]
[{"$nulls":6},100475]
[{"$nulls":6},100477]
[{"$nulls":6},100478]
[{"$nulls":6},100479]
[{"$nulls":6},100480]
[{"$nulls":6},100481]
[{"$nulls":6},100483]
[{"$nulls":6},100484]
[{"$nulls":6},100485]
[{"$nulls":6},100486]
[{"$nulls":6},100487]
[{"$nulls":6},100488]
[{"$nulls":6},100489]
[{"$nulls":6},100490]
[{"$nulls":6},100491]
[{"$nulls":6},100492]
[{"$nulls":6},92121]
[{"$nulls":6},92122]
[{"$nulls":6},92123]
[{"$nulls":6},100195]
[{"$nulls":6},100196]
[{"$nulls":6},100197]
[{"$nulls":6},100198]
[{"$nulls":6},100199]
[{"$nulls":6},100200]
[{"$nulls":6},100201]
[{"$nulls":6},100202]
[{"$nulls":6},100203]
[{"$nulls":6},100204]
[{"$nulls":6},100205]
[{"$nulls":6},100206]
[{"$nulls":6},100207]
[{"$nulls":6},100208]
[{"$nulls":6},100209]
[{"$nulls":6},100210]
[{"$nulls":6},100211]
[{"$nulls":6},100212]
[{"$nulls":6},100213]
[{"$nulls":6},100214]
[{"$nulls":6},100215]
[{"$nulls":6},100216]
[{"$nulls":6},100217]
[{"$nulls":6},100218]
[{"$nulls":6},100219]
[{"$nulls":6},100220]
[{"$nulls":6},100221]
[{"$nulls":6},100222]
[{"$nulls":6},100223]
[{"$nulls":6},100224]
[{"$nulls":6},100225]
[{"$nulls":6},100226]
[{"$nulls":6},100227]
[{"$nulls":6},100228]
[{"$nulls":6},100229]
[{"$nulls":6},100230]
[{"$nulls":6},100231]
[{"$nulls":6},100232]
[{"$nulls":6},100233]
[{"$nulls":6},100234]
[{"$nulls":6},100235]
[{"$nulls":6},100236]
[{"$nulls":6},100237]
[{"$nulls":6},100238]
[{"$nulls":6},100239]
[{"$nulls":6},100240]
[{"$nulls":6},100241]
[{"$nulls":6},100242]
[{"$nulls":6},100243]
[{"$nulls":6},100244]
[{"$nulls":6},100245]
[{"$nulls":6},100246]
[{"$nulls":6},100247]
[{"$nulls":6},100248]
[{"$nulls":6},100249]
[{"$nulls":6},100250]
[{"$nulls":6},100251]
[{"$nulls":6},100252]
[{"$nulls":6},100253]
[{"$nulls":6},100254]
[{"$nulls":6},100255]
[{"$nulls":6},100256]
[{"$nulls":6},100257]
[{"$nulls":6},100258]
[{"$nulls":6},100259]
[{"$nulls":6},100260]
[{"$nulls":6},100261]
[{"$nulls":6},100262]
[{"$nulls":6},100263]
[{"$nulls":6},100264]
[{"$nulls":6},100265]
[{"$nulls":6},100266]
[{"$nulls":6},100267]
[{"$nulls":6},100268]
[{"$nulls":6},100269]
[{"$nulls":6},100270]
[{"$nulls":6},100271]
[{"$nulls":6},100272]
[{"$nulls":6},100273]
[{"$nulls":6},100274]
[{"$nulls":6},100275]
[{"$nulls":6},100276]
[{"$nulls":6},100277]
[{"$nulls":6},100278]
[{"$nulls":6},100279]
[{"$nulls":6},100280]
[{"$nulls":6},100281]
[{"$nulls":6},100282]
[{"$nulls":6},100283]
[{"$nulls":6},100284]
[{"$nulls":6},100285]
[{"$nulls":6},100286]
[{"$nulls":6},100287]
[{"$nulls":6},99802]
[{"$nulls":6},99803]
[{"$nulls":6},99804]
[{"$nulls":6},99805]
[{"$nulls":6},99806]
[{"$nulls":6},99807]
[{"$nulls":6},99808]
[{"$nulls":6},99809]
[{"$nulls":6},99810]
[{"$nulls":6},99811]
[{"$nulls":6},99812]
[{"$nulls":6},99813]
[{"$nulls":6},99814]
[{"$nulls":6},99815]
[{"$nulls":6},99816]
[{"$nulls":6},99817]
[{"$nulls":6},99818]
[{"$nulls":6},99819]
[{"$nulls":6},99820]
[{"$nulls":6},99821]
[{"$nulls":6},99822]
[{"$nulls":6},99823]
[{"$nulls":6},99824]
[{"$nulls":6},99825]
[{"$nulls":6},99826]
[{"$nulls":6},97013]
[{"$nulls":6},97014]
[{"$nulls":6},97015]
[{"$nulls":6},97016]
[{"$nulls":6},97017]
[{"$nulls":6},97018]
[{"$nulls":6},97031]
[{"$nulls":6},97032]
[{"$nulls":6},97033]
[{"$nulls":6},97034]
[{"$nulls":6},97039]
[{"$nulls":6},97040]
[{"$nulls":6},97041]
[{"$nulls":6},97046]
[{"$nulls":6},97047]
[{"$nulls":6},97048]
[{"$nulls":6},97054]
[{"$nulls":6},97062]
[{"$nulls":6},97063]
[{"$nulls":6},97064]
[{"$nulls":6},97065]
[{"$nulls":6},97066]
[{"$nulls":6},97067]
[{"$nulls":6},105103]
[{"$nulls":6},105104]
[{"$nulls":6},105105]
[{"$nulls":6},105106]
[{"$nulls":6},105107]
[{"$nulls":6},105110]
[{"$nulls":6},105111]
[{"$nulls":6},105112]
[{"$nulls":6},97621]
[{"$nulls":6},97622]
[{"$nulls":6},97623]
[{"$nulls":6},97624]
[{"$nulls":6},97625]
[{"$nulls":6},97626]
[{"$nulls":6},97627]
[{"$nulls":6},97628]
[{"$nulls":6},97629]
[{"$nulls":6},97631]
[{"$nulls":6},97632]
[{"$nulls":6},97633]
[{"$nulls":6},97634]
[{"$nulls":6},97635]
[{"$nulls":6},97636]
[{"$nulls":6},97637]
[{"$nulls":6},97638]
[{"$nulls":6},97639]
[{"$nulls":6},97640]
[{"$nulls":6},97641]
[{"$nulls":6},97642]
[{"$nulls":6},97643]
[{"$nulls":6},97644]
[{"$nulls":6},97645]
[{"$nulls":6},97647]
[{"$nulls":6},97648]
[{"$nulls":6},97649]
[{"$nulls":6},97650]
[{"$nulls":6},97651]
[{"$nulls":6},97652]
[{"$nulls":6},97653]
[{"$nulls":6},97654]
[{"$nulls":6},97655]
[{"$nulls":6},97656]
[{"$nulls":6},97657]
[{"$nulls":6},97658]
[{"$nulls":6},97659]
[{"$nulls":6},97660]
[{"$nulls":6},97661]
[{"$nulls":6},97662]
[{"$nulls":6},97663]
[{"$nulls":6},97664]
[{"$nulls":6},97665]
[{"$nulls":6},97666]
[{"$nulls":6},104789]
[{"$nulls":6},104790]
[{"$nulls":6},104791]
[{"$nulls":6},104792]
[{"$nulls":6},104793]
[{"$nulls":6},104794]
[{"$nulls":6},104795]
[{"$nulls":6},104796]
[{"$nulls":6},104797]
[{"$nulls":6},104798]
[{"$nulls":6},104799]
[{"$nulls":6},104800]
[{"$nulls":6},104801]
[{"$nulls":6},104802]
[{"$nulls":6},104803]
[{"$nulls":6},95967]
[{"$nulls":6},99059]
[{"$nulls":6},99060]
[{"$nulls":6},99061]
[{"$nulls":6},99062]
[{"$nulls":6},99063]
[{"$nulls":6},105007]
[{"$nulls":6},105009]
[{"$nulls":6},105011]
[{"$nulls":6},93588]
[{"$nulls":6},93589]
[{"$nulls":6},93590]
[{"$nulls":6},93591]
[{"$nulls":6},93592]
[{"$nulls":6},93593]
[{"$nulls":6},93594]
[{"$nulls":6},93595]
[{"$nulls":6},93596]
[{"$nulls":6},93597]
[{"$nulls":6},93598]
[{"$nulls":6},93599]
[{"$nulls":6},95425]
[{"$nulls":6},95426]
[{"$nulls":6},95427]
[{"$nulls":6},95428]
[{"$nulls":6},95429]
[{"$nulls":6},95430]
[{"$nulls":6},95875]
[{"$nulls":6},95876]
[{"$nulls":6},95877]
[{"$nulls":6},95878]
[{"$nulls":6},95879]
[{"$nulls":6},95880]
[{"$nulls":6},97912]
[{"$nulls":6},97913]
[{"$nulls":6},97914]
[{"$nulls":6},97915]
[{"$nulls":6},100937]
[{"$nulls":6},100938]
[{"$nulls":6},100939]
[{"$nulls":6},100940]
[{"$nulls":6},100941]
[{"$nulls":6},100942]
[{"$nulls":6},100943]
[{"$nulls":6},100944]
[{"$nulls":6},100945]
[{"$nulls":6},100946]
[{"$nulls":6},100947]
[{"$nulls":6},100948]
[{"$nulls":6},100949]
[{"$nulls":6},100950]
[{"$nulls":6},100951]
[{"$nulls":6},100952]
[{"$nulls":6},100953]
[{"$nulls":6},100954]
[{"$nulls":6},100955]
[{"$nulls":6},100956]
[{"$nulls":6},100957]
[{"$nulls":6},100958]
[{"$nulls":6},100959]
[{"$nulls":6},100960]
[{"$nulls":6},100961]
[{"$nulls":6},100962]
[{"$nulls":6},100963]
[{"$nulls":6},100964]
[{"$nulls":6},100973]
[{"$nulls":6},100974]
[{"$nulls":6},100975]
[{"$nulls":6},100965]
[{"$nulls":6},100966]
[{"$nulls":6},100969]
[{"$nulls":6},100970]
[{"$nulls":6},102330]
[{"$nulls":6},102331]
[{"$nulls":6},102332]
[{"$nulls":6},102333]
[{"$nulls":6},101019]
[{"$nulls":6},101479]
[{"$nulls":6},102568]
[{"$nulls":6},100976]
[{"$nulls":6},100977]
[{"$nulls":6},100978]
[{"$nulls":6},100979]
[{"$nulls":6},100980]
[{"$nulls":6},100981]
[{"$nulls":6},100982]
[{"$nulls":6},100983]
[{"$nulls":6},100984]
[{"$nulls":6},100985]
[{"$nulls":6},100986]
[{"$nulls":6},100987]
[{"$nulls":6},100988]
[{"$nulls":6},100989]
[{"$nulls":6},100990]
[{"$nulls":6},100991]
[{"$nulls":6},100992]
[{"$nulls":6},100993]
[{"$nulls":6},100994]
[{"$nulls":6},100995]
[{"$nulls":6},100996]
[{"$nulls":6},100997]
[{"$nulls":6},100998]
[{"$nulls":6},100999]
[{"$nulls":6},101000]
[{"$nulls":6},101001]
[{"$nulls":6},101002]
[{"$nulls":6},101003]
[{"$nulls":6},101004]
[{"$nulls":6},101005]
[{"$nulls":6},101006]
[{"$nulls":6},101007]
[{"$nulls":6},101008]
[{"$nulls":6},101009]
[{"$nulls":6},101010]
[{"$nulls":6},101013]
[{"$nulls":6},101014]
[{"$nulls":6},101015]
[{"$nulls":6},101016]
[{"$nulls":6},101017]
[{"$nulls":6},101018]
[{"$nulls":6},101463]
[{"$nulls":6},101464]
[{"$nulls":6},101465]
[{"$nulls":6},101466]
[{"$nulls":6},101467]
[{"$nulls":6},101468]
[{"$nulls":6},101469]
[{"$nulls":6},101470]
[{"$nulls":6},101471]
[{"$nulls":6},101472]
[{"$nulls":6},101473]
[{"$nulls":6},101474]
[{"$nulls":6},101475]
[{"$nulls":6},101476]
[{"$nulls":6},101477]
[{"$nulls":6},101478]
[{"$nulls":6},101480]
[{"$nulls":6},101481]
[{"$nulls":6},101482]
[{"$nulls":6},101483]
[{"$nulls":6},101484]
[{"$nulls":6},101485]
[{"$nulls":6},101486]
[{"$nulls":6},101487]
[{"$nulls":6},101488]
[{"$nulls":6},101188]
[{"$nulls":6},101189]
[{"$nulls":6},101190]
[{"$nulls":6},101191]
[{"$nulls":6},101192]
[{"$nulls":6},101193]
[{"$nulls":6},101194]
[{"$nulls":6},101197]
[{"$nulls":6},101198]
[{"$nulls":6},101199]
[{"$nulls":6},101200]
[{"$nulls":6},101201]
[{"$nulls":6},101202]
[{"$nulls":6},101203]
[{"$nulls":6},101204]
[{"$nulls":6},101205]
[{"$nulls":6},102362]
[{"$nulls":6},102363]
[{"$nulls":6},102364]
[{"$nulls":6},98509]
[{"$nulls":6},98510]
[{"$nulls":6},98511]
[{"$nulls":6},98516]
[{"$nulls":6},98519]
[{"$nulls":6},98520]
[{"$nulls":6},98521]
[{"$nulls":6},98522]
[{"$nulls":6},98524]
[{"$nulls":6},98503]
[{"$nulls":6},98504]
[{"$nulls":6},98505]
[{"$nulls":6},103946]
[{"$nulls":6},105000]
[{"$nulls":6},105001]
[{"$nulls":6},105002]
[{"$nulls":6},105003]
[{"$nulls":6},105004]
[{"$nulls":6},105005]
[{"$nulls":6},103185]
[{"$nulls":6},103186]
[{"$nulls":6},103187]
[{"$nulls":6},103188]
[{"$nulls":6},103189]
[{"$nulls":6},103190]
[{"$nulls":6},103191]
[{"$nulls":6},103192]
[{"$nulls":6},103193]
[{"$nulls":6},103194]
[{"$nulls":6},103195]
[{"$nulls":6},103205]
[{"$nulls":6},103206]
[{"$nulls":6},103207]
[{"$nulls":6},103208]
[{"$nulls":6},103209]
[{"$nulls":6},103210]
[{"$nulls":6},103304]
[{"$nulls":6},103307]
[{"$nulls":6},103310]
[{"$nulls":6},103314]
[{"$nulls":6},103315]
[{"$nulls":6},103769]
[{"$nulls":6},98525]
[{"$nulls":6},98526]
[{"$nulls":6},98527]
[{"$nulls":6},98528]
[{"$nulls":6},98529]
[{"$nulls":6},98530]
[{"$nulls":6},98531]
[{"$nulls":6},98532]
[{"$nulls":6},98533]
[{"$nulls":6},98534]
[{"$nulls":6},98535]
[{"$nulls":6},88238]
[{"$nulls":6},88239]
[{"$nulls":6},88240]
[{"$nulls":6},88241]
[{"$nulls":6},88242]
[{"$nulls":6},88243]
[{"$nulls":6},88245]
[{"$nulls":6},88246]
[{"$nulls":6},88247]
[{"$nulls":6},88248]
[{"$nulls":6},88249]
[{"$nulls":6},88250]
[{"$nulls":6},88251]
[{"$nulls":6},88252]
[{"$nulls":6},88253]
[{"$nulls":6},88255]
[{"$nulls":6},88256]
[{"$nulls":6},88257]
[{"$nulls":6},88260]
[{"$nulls":6},88261]
[{"$nulls":6},88262]
[{"$nulls":6},88263]
[{"$nulls":6},88264]
[{"$nulls":6},88266]
[{"$nulls":6},88267]
[{"$nulls":6},88269]
[{"$nulls":6},88270]
[{"$nulls":6},88272]
[{"$nulls":6},88273]
[{"$nulls":6},88274]
[{"$nulls":6},88275]
[{"$nulls":6},88277]
[{"$nulls":6},88278]
[{"$nulls":6},88279]
[{"$nulls":6},88281]
[{"$nulls":6},88282]
[{"$nulls":6},88283]
[{"$nulls":6},88284]
[{"$nulls":6},88286]
[{"$nulls":6},88288]
[{"$nulls":6},88291]
[{"$nulls":6},88292]
[{"$nulls":6},88293]
[{"$nulls":6},88294]
[{"$nulls":6},88295]
[{"$nulls":6},88296]
[{"$nulls":6},88297]
[{"$nulls":6},88298]
[{"$nulls":6},88299]
[{"$nulls":6},88300]
[{"$nulls":6},88301]
[{"$nulls":6},88302]
[{"$nulls":6},88303]
[{"$nulls":6},88304]
[{"$nulls":6},88306]
[{"$nulls":6},88307]
[{"$nulls":6},88308]
[{"$nulls":6},88309]
[{"$nulls":6},88310]
[{"$nulls":6},88311]
[{"$nulls":6},88312]
[{"$nulls":6},88313]
[{"$nulls":6},88314]
[{"$nulls":6},88315]
[{"$nulls":6},88316]
[{"$nulls":6},88317]
[{"$nulls":6},88318]
[{"$nulls":6},88321]
[{"$nulls":6},88322]
[{"$nulls":6},88323]
[{"$nulls":6},88324]
[{"$nulls":6},88325]
[{"$nulls":6},88377]
[{"$nulls":6},88441]
[{"$nulls":6},90766]
[{"$nulls":6},90767]
[{"$nulls":6},90768]
[{"$nulls":6},90769]
[{"$nulls":6},90770]
[{"$nulls":6},90772]
[{"$nulls":6},90775]
[{"$nulls":6},90776]
[{"$nulls":6},90777]
[{"$nulls":6},90778]
[{"$nulls":6},90779]
[{"$nulls":6},90780]
[{"$nulls":6},90781]
[{"$nulls":6},93558]
[{"$nulls":6},93561]
[{"$nulls":6},93563]
[{"$nulls":6},93564]
[{"$nulls":6},93565]
[{"$nulls":6},93566]
[{"$nulls":6},93567]
[{"$nulls":6},93568]
[{"$nulls":6},93569]
[{"$nulls":6},93570]
[{"$nulls":6},93571]
[{"$nulls":6},93572]
[{"$nulls":6},94295]
[{"$nulls":6},94296]
[{"$nulls":6},95308]
[{"$nulls":6},95309]
[{"$nulls":6},95310]
[{"$nulls":6},95311]
[{"$nulls":6},95312]
[{"$nulls":6},95313]
[{"$nulls":6},95314]
[{"$nulls":6},95315]
[{"$nulls":6},95316]
[{"$nulls":6},95317]
[{"$nulls":6},95318]
[{"$nulls":6},95319]
[{"$nulls":6},95320]
[{"$nulls":6},95321]
[{"$nulls":6},95322]
[{"$nulls":6},95323]
[{"$nulls":6},95324]
[{"$nulls":6},95325]
[{"$nulls":6},95328]
[{"$nulls":6},95329]
[{"$nulls":6},95330]
[{"$nulls":6},95331]
[{"$nulls":6},95332]
[{"$nulls":6},95334]
[{"$nulls":6},95335]
[{"$nulls":6},95337]
[{"$nulls":6},95338]
[{"$nulls":6},95339]
[{"$nulls":6},95340]
[{"$nulls":6},95341]
[{"$nulls":6},95342]
[{"$nulls":6},95343]
[{"$nulls":6},95344]
[{"$nulls":6},95345]
[{"$nulls":6},95346]
[{"$nulls":6},95347]
[{"$nulls":6},95348]
[{"$nulls":6},95349]
[{"$nulls":6},95351]
[{"$nulls":6},95352]
[{"$nulls":6},95354]
[{"$nulls":6},95355]
[{"$nulls":6},95356]
[{"$nulls":6},95357]
[{"$nulls":6},95358]
[{"$nulls":6},95359]
[{"$nulls":6},95360]
[{"$nulls":6},95361]
[{"$nulls":6},95362]
[{"$nulls":6},95363]
[{"$nulls":6},95364]
[{"$nulls":6},95365]
[{"$nulls":6},95366]
[{"$nulls":6},95367]
[{"$nulls":6},95368]
[{"$nulls":6},95369]
[{"$nulls":6},95370]
[{"$nulls":6},95371]
[{"$nulls":6},95372]
[{"$nulls":6},95373]
[{"$nulls":6},95374]
[{"$nulls":6},95375]
[{"$nulls":6},95376]
[{"$nulls":6},95377]
[{"$nulls":6},95378]
[{"$nulls":6},95379]
[{"$nulls":6},95380]
[{"$nulls":6},95383]
[{"$nulls":6},95384]
[{"$nulls":6},95385]
[{"$nulls":6},95386]
[{"$nulls":6},95387]
[{"$nulls":6},95389]
[{"$nulls":6},95390]
[{"$nulls":6},95392]
[{"$nulls":6},95393]
[{"$nulls":6},95394]
[{"$nulls":6},95395]
[{"$nulls":6},95396]
[{"$nulls":6},95398]
[{"$nulls":6},95400]
[{"$nulls":6},95401]
[{"$nulls":6},95402]
[{"$nulls":6},95403]
[{"$nulls":6},95404]
[{"$nulls":6},95405]
[{"$nulls":6},95406]
[{"$nulls":6},95408]
[{"$nulls":6},95411]
[{"$nulls":6},95413]
[{"$nulls":6},95414]
[{"$nulls":6},95415]
[{"$nulls":6},95416]
[{"$nulls":6},95417]
[{"$nulls":6},95418]
[{"$nulls":6},95419]
[{"$nulls":6},95420]
[{"$nulls":6},95421]
[{"$nulls":6},95422]
[{"$nulls":6},95423]
[{"$nulls":6},95424]
[{"$nulls":6},100288]
[{"$nulls":6},100289]
[{"$nulls":6},100291]
[{"$nulls":6},100293]
[{"$nulls":6},100295]
[{"$nulls":6},100298]
[{"$nulls":6},100299]
[{"$nulls":6},100301]
[{"$nulls":6},100303]
[{"$nulls":6},100307]
[{"$nulls":6},100308]
[{"$nulls":6},100309]
[{"$nulls":6},100315]
[{"$nulls":6},100321]
[{"$nulls":6},100533]
[{"$nulls":6},100534]
[{"$nulls":6},100535]
[{"$nulls":6},100536]
[{"$nulls":6},101286]
[{"$nulls":6},101287]
[{"$nulls":6},101288]
[{"$nulls":6},101289]
[{"$nulls":6},101290]
[{"$nulls":6},101291]
[{"$nulls":6},101292]
[{"$nulls":6},101293]
[{"$nulls":6},101294]
[{"$nulls":6},101295]
[{"$nulls":6},101296]
[{"$nulls":6},101297]
[{"$nulls":6},101298]
[{"$nulls":6},101299]
[{"$nulls":6},101300]
[{"$nulls":6},101301]
[{"$nulls":6},101302]
[{"$nulls":6},101303]
[{"$nulls":6},101304]
[{"$nulls":6},101305]
[{"$nulls":6},101307]
[{"$nulls":6},101308]
[{"$nulls":6},101309]
[{"$nulls":6},101310]
[{"$nulls":6},101311]
[{"$nulls":6},101312]
[{"$nulls":6},101313]
[{"$nulls":6},101315]
[{"$nulls":6},101316]
[{"$nulls":6},101320]
[{"$nulls":6},101322]
[{"$nulls":6},101323]
[{"$nulls":6},101324]
[{"$nulls":6},101325]
[{"$nulls":6},101326]
[{"$nulls":6},101328]
[{"$nulls":6},101329]
[{"$nulls":6},101330]
[{"$nulls":6},101331]
[{"$nulls":6},101332]
[{"$nulls":6},101333]
[{"$nulls":6},101334]
[{"$nulls":6},101336]
[{"$nulls":6},101337]
[{"$nulls":6},101338]
[{"$nulls":6},101339]
[{"$nulls":6},101340]
[{"$nulls":6},101341]
[{"$nulls":6},101342]
[{"$nulls":6},101343]
[{"$nulls":6},101344]
[{"$nulls":6},101345]
[{"$nulls":6},101346]
[{"$nulls":6},101347]
[{"$nulls":6},101348]
[{"$nulls":6},101349]
[{"$nulls":6},101350]
[{"$nulls":6},101351]
[{"$nulls":6},101352]
[{"$nulls":6},101353]
[{"$nulls":6},101355]
[{"$nulls":6},101356]
[{"$nulls":6},101357]
[{"$nulls":6},101358]
[{"$nulls":6},101359]
[{"$nulls":6},101360]
[{"$nulls":6},101361]
[{"$nulls":6},101363]
[{"$nulls":6},101364]
[{"$nulls":6},101365]
[{"$nulls":6},101366]
[{"$nulls":6},101368]
[{"$nulls":6},101369]
[{"$nulls":6},101370]
[{"$nulls":6},101371]
[{"$nulls":6},101372]
[{"$nulls":6},101374]
[{"$nulls":6},101375]
[{"$nulls":6},101376]
[{"$nulls":6},101377]
[{"$nulls":6},101378]
[{"$nulls":6},101379]
[{"$nulls":6},101380]
[{"$nulls":6},101381]
[{"$nulls":6},101382]
[{"$nulls":6},101383]
[{"$nulls":6},101384]
[{"$nulls":6},101385]
[{"$nulls":6},101386]
[{"$nulls":6},101387]
[{"$nulls":6},101388]
[{"$nulls":6},101389]
[{"$nulls":6},101390]
[{"$nulls":6},101391]
[{"$nulls":6},101392]
[{"$nulls":6},101394]
[{"$nulls":6},101395]
[{"$nulls":6},101396]
[{"$nulls":6},101397]
[{"$nulls":6},101398]
[{"$nulls":6},101399]
[{"$nulls":6},101401]
[{"$nulls":6},101402]
[{"$nulls":6},101407]
[{"$nulls":6},101408]
[{"$nulls":6},101409]
[{"$nulls":6},101410]
[{"$nulls":6},101412]
[{"$nulls":6},101413]
[{"$nulls":6},101414]
[{"$nulls":6},101415]
[{"$nulls":6},101416]
[{"$nulls":6},101417]
[{"$nulls":6},101418]
[{"$nulls":6},101419]
[{"$nulls":6},101420]
[{"$nulls":6},101421]
[{"$nulls":6},101422]
[{"$nulls":6},101424]
[{"$nulls":6},101425]
[{"$nulls":6},101426]
[{"$nulls":6},101427]
[{"$nulls":6},101428]
[{"$nulls":6},101429]
[{"$nulls":6},101430]
[{"$nulls":6},101431]
[{"$nulls":6},101432]
[{"$nulls":6},101433]
[{"$nulls":6},101434]
[{"$nulls":6},101435]
[{"$nulls":6},101436]
[{"$nulls":6},101437]
[{"$nulls":6},101438]
[{"$nulls":6},101439]
[{"$nulls":6},101440]
[{"$nulls":6},101441]
[{"$nulls":6},101443]
[{"$nulls":6},101444]
[{"$nulls":6},101445]
[{"$nulls":6},101446]
[{"$nulls":6},101447]
[{"$nulls":6},101448]
[{"$nulls":6},101449]
[{"$nulls":6},101451]
[{"$nulls":6},101452]
[{"$nulls":6},101453]
[{"$nulls":6},101454]
[{"$nulls":6},101456]
[{"$nulls":6},101457]
[{"$nulls":6},101458]
[{"$nulls":6},101459]
[{"$nulls":6},101460]

{"sheet":"4.PIRAPORA","index":3,"n_rows":7543,"n_cols":30,"rows_kept":7543,"cut":false,"hidden":false,"merged":[[1,1,3,11],[4,1,4,13],[5,1,8,1],[5,2,8,2],[5,3,8,3],[5,4,8,7],[6,9,7,9],[6,12,8,12],[6,13,8,13],[20,4,20,7],[9,4,9,7],[10,4,10,7],[11,4,11,7],[12,4,12,7],[13,4,13,7],[14,4,14,7],[15,4,15,7],[16,4,16,7],[17,4,17,7],[18,4,18,7],[19,4,19,7],[32,4,32,7],[21,4,21,7],[22,4,22,7],[23,4,23,7],[24,4,24,7],[25,4,25,7],[26,4,26,7],[27,4,27,7],[28,4,28,7],[29,4,29,7],[30,4,30,7],[31,4,31,7],[48,4,48,7],[33,4,33,7],[34,4,34,7],[35,4,35,7],[36,4,36,7],[37,4,37,7],[38,4,38,7],[40,4,40,7],[41,4,41,7],[42,4,42,7],[44,4,44,7],[46,4,46,7],[55,4,55,7],[56,4,56,7],[57,1,57,12],[49,4,49,7],[50,4,50,7],[51,4,51,7],[52,4,52,7],[53,4,53,7],[54,4,54,7]]}
[]
[null,"LOGOTIPO DA EMPRESA"]
[]
[{"$nulls":12},"Data Base do Orçamento","2024-08-01"]
[null,"CONTRATAÇÃO DE SERVIÇOS DE PAVIMENTAÇÃO ASFÁLTICA COM CONCRETO BETUMINOSO USINADO A QUENTE (CBUQ) EM VIAS URBANAS E RURAIS INSERIDAS NA ÁREA DE ATUAÇÃO DA 1ª SUPERINTENDÊNCIA REGIONAL DA CODEVASF, NO ESTADO DE MINAS GERAIS - ITEM 4: PIRAPORA/MG"]
[null,"ITEM","ORIGEM\nCOMPOSIÇÃO","CÓDIGO\nCOMPOSIÇÃO","DISCRIMINAÇÃO DOS SERVIÇOS",null,null,null,"BDI % = ",{"$f":"BDI!C17","v":0},"BDI  DIFERENCIADO% =",{"$f":"BDI!C33","v":0},"R$/m²",{"$f":"N58/I8","v":0},{"$f":"N58","v":0}]
[{"$nulls":8},"Total de m²","Encargos Sociais:","Horista","Mensalista","PREÇO UNITÁRIO COM BDI","PREÇO TOTAL COM BDI "]
[{"$nulls":8},42000,null,{"$f":"'ENC.SOC.'!$E$51","v":0},{"$f":"'ENC.SOC.'!$F$51","v":0}]
[{"$nulls":8},"UND","QTDE.","BDI","PREÇO UNITÁRIO "]
[{"$nulls":4},"MOBILIZAÇÃO/DESMOBILIZAÇÃO"]
[null,1,"Codevasf","Mob","Mobilização",null,null,null,"kmxfrente",320,{"$f":"(M11/L11-1)","v":{"$error":"#DIV/0!"}},null,{"$f":"L11*(1+$J$6)","v":0},{"$f":"M11*J11","v":0},{"$f":"N11/$N$58","v":{"$error":"#DIV/0!"}}]
[null,2,"Codevasf","Mob","Desmobilização",null,null,null,"kmxfrente",320,{"$f":"(M12/L12-1)","v":{"$error":"#DIV/0!"}},null,{"$f":"L12*(1+$J$6)","v":0},{"$f":"M12*J12","v":0},{"$f":"N12/$N$58","v":{"$error":"#DIV/0!"}}]
[{"$nulls":4},"INSTALAÇÃO DE CANTEIRO"]
[null,3,"Codevasf","Canteiro","Canteiro de Obras e Almoxarifado",null,null,null,"frente",4,{"$f":"(M14/L14-1)","v":{"$error":"#DIV/0!"}},null,{"$f":"L14*(1+$J$6)","v":0},{"$f":"ROUND(ROUND(J14,2)*ROUND(M14,6),2)","v":0},{"$f":"N14/N58","v":{"$error":"#DIV/0!"}}]
[null,4,"SINAPI",103689,"FORNECIMENTO E INSTALAÇÃO DE PLACA DE OBRA COM CHAPA GALVANIZADA E ESTRUTURA DE MADEIRA",null,null,null,"m²",64,{"$f":"(M15/L15-1)","v":{"$error":"#DIV/0!"}},null,0,{"$f":"ROUND(ROUND(J15,2)*ROUND(M15,6),2)","v":0}]
[{"$nulls":4},"ADMINISTRAÇÃO LOCAL DA OBRA"]
[null,5,"Codevasf","Adm Local","Administração Local da Obra",null,null,null,"und",1,{"$f":"(M17/L17-1)","v":{"$error":"#DIV/0!"}},null,{"$f":"L17*(1+$J$6)","v":0},{"$f":"ROUND(ROUND(J17,2)*ROUND(M17,6),2)","v":0},{"$f":"N17/N58","v":{"$error":"#DIV/0!"}}]
[{"$nulls":4},"TERRAPLANAGEM"]
[null,6,"SICRO",5502114,"Escavação, carga e transporte de material de 1ª categoria - DMT de 1.000 a 1.200 m - caminho de serviço em leito natural - com escavadeira e caminhão basculante de 14 m³",null,null,null,"m³",14699.999999999998,{"$f":"M19/L19-1","v":{"$error":"#DIV/0!"}},null,{"$f":"L19*(1+$J$6)","v":0},{"$f":"ROUND(ROUND(J19,2)*ROUND(M19,6),2)","v":0}]
[null,7,"SICRO",4413942,"Espalhamento de material em bota-fora",null,null,null,"m³",14699.999999999998,{"$error":"#DIV/0!"},null,0,0,{"$nulls":15},1]
[{"$nulls":4},"PAVIMENTAÇÃO"]
[null,8,"SICRO",4011463,"Concreto asfáltico - faixa C - areia e brita comerciais",null,null,null,"t",5040,{"$f":"M22/L22-1","v":{"$error":"#DIV/0!"}},null,{"$f":"L22*(1+$J$6)","v":0},{"$f":"ROUND(ROUND(J22,2)*ROUND(M22,6),2)","v":0}]
[null,9,"SICRO",4011352,"Imprimação com emulsão asfáltica",null,null,null,"m²",42000,{"$error":"#DIV/0!"},null,0,0]
[null,10,"SICRO",4011353,"Pintura de ligação",null,null,null,"m²",42000,{"$error":"#DIV/0!"},null,0,0]
[null,11,"SICRO",4011268,"Base estabilizada granulometricamente com mistura solo brita (70% - 30%) em usina com material de jazida e brita comercial",null,null,null,"m³",6300,{"$error":"#DIV/0!"},null,0,0]
[null,12,"SICRO",4011228,"Sub-base estabilizada granulometricamente com mistura de solos na pista com material de jazida",null,null,null,"m³",6300,{"$error":"#DIV/0!"},null,0,0]
[null,13,"SICRO",4011209,"Regularização do subleito",null,null,null,"m²",42000,{"$error":"#DIV/0!"},null,0,0]
[{"$nulls":4},"AQUISIÇÃO E TRANSPORTE DO MATERIAL BETUMINOSO"]
[null,14,"CODEVASF","CPU-13","AQUISIÇÃO DE CIMENTO ASFALTICO CAP 50/70",null,null,null,"t",325.02999999999997,{"$f":"M29/L29-1","v":{"$error":"#DIV/0!"}},null,{"$f":"L29*(1+$L$6)","v":0},{"$f":"ROUND(ROUND(J29,2)*ROUND(M29,6),2)","v":0}]
[null,15,"CODEVASF","CPU-17","TRANSPORTE CAP 50/70",null,null,null,"t",325.02999999999997,{"$error":"#DIV/0!"},null,{"$f":"L30*(1+$L$6)","v":0},0]
[null,16,"CODEVASF","CPU-14","AQUISIÇÃO DE EAI",null,null,null,"t",54.6,{"$error":"#DIV/0!"},null,0,0]
[null,17,"CODEVASF","CPU-18","TRANSPORTE DE EAI",null,null,null,"t",54.6,{"$error":"#DIV/0!"},null,0,0]
[null,18,"CODEVASF","CPU-15","AQUISIÇÃO DE EMULSÃO ASFÁLTICA RR-1C",null,null,null,"t",18.899999999999999,{"$error":"#DIV/0!"},null,0,0]
[null,19,"CODEVASF","CPU-19","TRANSPORTE RR-1C",null,null,null,"t",18.899999999999999,{"$error":"#DIV/0!"},null,0,0]
[{"$nulls":4},"SINALIZAÇÃO"]
[null,20,"SICRO",5213440,"Placa de regulamentação em aço D = 0,60 m - película retrorrefletiva tipo I + SI - fornecimento e implantação",null,null,null,"und",18,{"$f":"M36/L36-1","v":{"$error":"#DIV/0!"}},null,{"$f":"L36*(1+$J$6)","v":0},{"$f":"ROUND(ROUND(J36,2)*ROUND(M36,6),2)","v":0}]
[null,21,"SICRO",5213464,"Placa de advertência em aço, lado de 0,60 m - película retrorrefletiva tipo I + SI - fornecimento e implantação",null,null,null,"und",18,{"$error":"#DIV/0!"},null,0,0]
[null,22,"SICRO",5213863,"Suporte metálico galvanizado para placa de advertência ou regulamentação - lado ou diâmetro de 0,60 m - fornecimento e implantação",null,null,null,"und",36,{"$error":"#DIV/0!"},null,0,0]
[null,23,"SICRO",5213400,"Pintura de faixa com tinta acrílica - espessura de 0,4 mm",null,null,null,"m²",1680,{"$error":"#DIV/0!"},null,0,0]
[{"$nulls":4},"DRENAGEM"]
[null,24,"SINAPI",94273,"ASSENTAMENTO DE GUIA (MEIO-FIO) EM TRECHO RETO, CONFECCIONADA EM CONCRETO PRÉ-FABRICADO, DIMENSÕES 100X15X13X30 CM (COMPRIMENTO X BASE INFERIOR X BASE SUPERIOR X ALTURA)",null,null,null,"m",12000,{"$f":"M41/L41-1","v":{"$error":"#DIV/0!"}},null,{"$f":"L41*(1+$J$6)","v":0},{"$f":"ROUND(ROUND(J41,2)*ROUND(M41,6),2)","v":0}]
[null,25,"SINAPI",94287,"EXECUÇÃO DE SARJETA DE CONCRETO USINADO, MOLDADA  IN LOCO  EM TRECHO RETO, 30 CM BASE X 10 CM ALTURA",null,null,null,"m",12000,{"$f":"M42/L42-1","v":{"$error":"#DIV/0!"}},null,0,{"$f":"ROUND(ROUND(J42,2)*ROUND(M42,6),2)","v":0}]
[null,26,"SICRO",4915724,"Caiação mecanizada com fixador de cal",null,null,null,"m²",1440,{"$f":"(M43/L43-1)","v":{"$error":"#DIV/0!"}},null,0,{"$f":"ROUND(ROUND(J43,2)*ROUND(M43,6),2)","v":0},{"$nulls":10},4514640]
[{"$nulls":4},"SERVIÇOS COMPLEMENTARES"]
[null,27,"Codevasf","CPU-12","Conserto de quebra no ramal na rua sem pavimento com fornecimento de material hidráulico",null,null,null,"m",600,{"$f":"M45/L45-1","v":{"$error":"#DIV/0!"}},null,{"$f":"L45*(1+$J$6)","v":0},{"$f":"ROUND(ROUND(J45,2)*ROUND(M45,6),2)","v":0}]
[{"$nulls":4},"PROJETO EXECUTIVO"]
[null,28,"Codevasf","Composição Própria","Projeto Executivo",null,null,null,"m²",42000,{"$f":"M47/L47-1","v":{"$error":"#DIV/0!"}},null,{"$f":"L47*(1+$J$6)","v":0},{"$f":"ROUND(ROUND(J47,2)*ROUND(M47,6),2)","v":0}]
[{"$nulls":4},"MOMENTO DE TRANSPORTE"]
[null,29,"SICRO",5914359,"Transporte com caminhão basculante de 10 m³ - rodovia em leito natural",null,null,null,"tkm",112479.14,{"$f":"M49/L49-1","v":{"$error":"#DIV/0!"}},null,{"$f":"L49*(1+$J$6)","v":0},{"$f":"ROUND(ROUND(J49,2)*ROUND(M49,6),2)","v":0}]
[null,30,"SICRO",5914374,"Transporte com caminhão basculante de 10 m³ - rodovia em revestimento primário",null,null,null,"tkm",112479.14,{"$error":"#DIV/0!"},null,0,0]
[null,31,"SICRO",5914389,"Transporte com caminhão basculante de 10 m³ - rodovia pavimentada",null,null,null,"tkm",899833.37,{"$error":"#DIV/0!"},null,0,0]
[null,32,"SICRO",5914449,"Transporte com caminhão carroceria de 15 t - rodovia em leito natural",null,null,null,"tkm",370.82,{"$error":"#DIV/0!"},null,0,0]
[null,33,"SICRO",5914464,"Transporte com caminhão carroceria de 15 t - rodovia em revestimento primário",null,null,null,"tkm",370.82,{"$error":"#DIV/0!"},null,0,0]
[null,34,"SICRO",5914479,"Transporte com caminhão carroceria de 15 t - rodovia pavimentada",null,null,null,"tkm",2966.55,{"$error":"#DIV/0!"},null,0,0]
[null,35,"SICRO",5914364,"Transporte de cimento ou cal hidratada a granel com caminhão silo de 30 m³ - rodovia em leito natural",null,null,null,"tkm",297.98,{"$error":"#DIV/0!"},null,0,0]
[null,36,"SICRO",5914365,"Transporte de cimento ou cal hidratada a granel com caminhão silo de 30 m³ - rodovia em revestimento primário",null,null,null,"tkm",297.98,{"$error":"#DIV/0!"},null,0,0]
[null,37,"SICRO",5914366,"Transporte de cimento ou cal hidratada a granel com caminhão silo de 30 m³ - rodovia pavimentada",null,null,null,"tkm",2383.88,{"$f":"M57/L57-1","v":{"$error":"#DIV/0!"}},null,0,{"$f":"ROUND(ROUND(J57,2)*ROUND(M57,6),2)","v":0},{"$f":"SUM(N49:N57)/N58","v":{"$error":"#DIV/0!"}}]
[null,"VALOR TOTAL DO SRP",{"$nulls":11},{"$f":"SUM(N11:N57)","v":0}]
[null,"Obs.: Os valores estão apresentados com apenas 2 casas decimais, mas os valores da presente planilha foram calculados utilizando a precisão de 6 casas decimais. "]
[{"$nulls":13},{"$f":"(N58/#REF!)/2000000","v":{"$error":"#REF!"}}]
{"$rows_empty":6598}
[{"$nulls":6},87354]
[{"$nulls":6},87355]
[{"$nulls":6},87356]
[{"$nulls":6},87357]
[{"$nulls":6},87358]
[{"$nulls":6},87359]
[{"$nulls":6},87360]
[{"$nulls":6},87361]
[{"$nulls":6},87362]
[{"$nulls":6},87363]
[{"$nulls":6},87364]
[{"$nulls":6},87365]
[{"$nulls":6},87366]
[{"$nulls":6},87367]
[{"$nulls":6},87368]
[{"$nulls":6},87369]
[{"$nulls":6},87370]
[{"$nulls":6},87371]
[{"$nulls":6},87372]
[{"$nulls":6},87373]
[{"$nulls":6},87374]
[{"$nulls":6},87375]
[{"$nulls":6},87376]
[{"$nulls":6},87377]
[{"$nulls":6},87378]
[{"$nulls":6},87379]
[{"$nulls":6},87380]
[{"$nulls":6},87381]
[{"$nulls":6},87382]
[{"$nulls":6},87383]
[{"$nulls":6},87384]
[{"$nulls":6},87385]
[{"$nulls":6},87386]
[{"$nulls":6},87387]
[{"$nulls":6},87388]
[{"$nulls":6},87389]
[{"$nulls":6},87390]
[{"$nulls":6},87391]
[{"$nulls":6},87393]
[{"$nulls":6},87394]
[{"$nulls":6},87395]
[{"$nulls":6},87396]
[{"$nulls":6},87397]
[{"$nulls":6},87398]
[{"$nulls":6},87399]
[{"$nulls":6},87401]
[{"$nulls":6},87402]
[{"$nulls":6},87404]
[{"$nulls":6},87405]
[{"$nulls":6},87407]
[{"$nulls":6},87408]
[{"$nulls":6},87410]
[{"$nulls":6},88626]
[{"$nulls":6},88627]
[{"$nulls":6},88628]
[{"$nulls":6},88629]
[{"$nulls":6},88630]
[{"$nulls":6},88631]
[{"$nulls":6},88715]
[{"$nulls":6},95563]
[{"$nulls":6},100464]
[{"$nulls":6},100465]
[{"$nulls":6},100466]
[{"$nulls":6},100468]
[{"$nulls":6},100469]
[{"$nulls":6},100470]
[{"$nulls":6},100472]
[{"$nulls":6},100473]
[{"$nulls":6},100474]
[{"$nulls":6},100475]
[{"$nulls":6},100477]
[{"$nulls":6},100478]
[{"$nulls":6},100479]
[{"$nulls":6},100480]
[{"$nulls":6},100481]
[{"$nulls":6},100483]
[{"$nulls":6},100484]
[{"$nulls":6},100485]
[{"$nulls":6},100486]
[{"$nulls":6},100487]
[{"$nulls":6},100488]
[{"$nulls":6},100489]
[{"$nulls":6},100490]
[{"$nulls":6},100491]
[{"$nulls":6},100492]
[{"$nulls":6},92121]
[{"$nulls":6},92122]
[{"$nulls":6},92123]
[{"$nulls":6},100195]
[{"$nulls":6},100196]
[{"$nulls":6},100197]
[{"$nulls":6},100198]
[{"$nulls":6},100199]
[{"$nulls":6},100200]
[{"$nulls":6},100201]
[{"$nulls":6},100202]
[{"$nulls":6},100203]
[{"$nulls":6},100204]
[{"$nulls":6},100205]
[{"$nulls":6},100206]
[{"$nulls":6},100207]
[{"$nulls":6},100208]
[{"$nulls":6},100209]
[{"$nulls":6},100210]
[{"$nulls":6},100211]
[{"$nulls":6},100212]
[{"$nulls":6},100213]
[{"$nulls":6},100214]
[{"$nulls":6},100215]
[{"$nulls":6},100216]
[{"$nulls":6},100217]
[{"$nulls":6},100218]
[{"$nulls":6},100219]
[{"$nulls":6},100220]
[{"$nulls":6},100221]
[{"$nulls":6},100222]
[{"$nulls":6},100223]
[{"$nulls":6},100224]
[{"$nulls":6},100225]
[{"$nulls":6},100226]
[{"$nulls":6},100227]
[{"$nulls":6},100228]
[{"$nulls":6},100229]
[{"$nulls":6},100230]
[{"$nulls":6},100231]
[{"$nulls":6},100232]
[{"$nulls":6},100233]
[{"$nulls":6},100234]
[{"$nulls":6},100235]
[{"$nulls":6},100236]
[{"$nulls":6},100237]
[{"$nulls":6},100238]
[{"$nulls":6},100239]
[{"$nulls":6},100240]
[{"$nulls":6},100241]
[{"$nulls":6},100242]
[{"$nulls":6},100243]
[{"$nulls":6},100244]
[{"$nulls":6},100245]
[{"$nulls":6},100246]
[{"$nulls":6},100247]
[{"$nulls":6},100248]
[{"$nulls":6},100249]
[{"$nulls":6},100250]
[{"$nulls":6},100251]
[{"$nulls":6},100252]
[{"$nulls":6},100253]
[{"$nulls":6},100254]
[{"$nulls":6},100255]
[{"$nulls":6},100256]
[{"$nulls":6},100257]
[{"$nulls":6},100258]
[{"$nulls":6},100259]
[{"$nulls":6},100260]
[{"$nulls":6},100261]
[{"$nulls":6},100262]
[{"$nulls":6},100263]
[{"$nulls":6},100264]
[{"$nulls":6},100265]
[{"$nulls":6},100266]
[{"$nulls":6},100267]
[{"$nulls":6},100268]
[{"$nulls":6},100269]
[{"$nulls":6},100270]
[{"$nulls":6},100271]
[{"$nulls":6},100272]
[{"$nulls":6},100273]
[{"$nulls":6},100274]
[{"$nulls":6},100275]
[{"$nulls":6},100276]
[{"$nulls":6},100277]
[{"$nulls":6},100278]
[{"$nulls":6},100279]
[{"$nulls":6},100280]
[{"$nulls":6},100281]
[{"$nulls":6},100282]
[{"$nulls":6},100283]
[{"$nulls":6},100284]
[{"$nulls":6},100285]
[{"$nulls":6},100286]
[{"$nulls":6},100287]
[{"$nulls":6},99802]
[{"$nulls":6},99803]
[{"$nulls":6},99804]
[{"$nulls":6},99805]
[{"$nulls":6},99806]
[{"$nulls":6},99807]
[{"$nulls":6},99808]
[{"$nulls":6},99809]
[{"$nulls":6},99810]
[{"$nulls":6},99811]
[{"$nulls":6},99812]
[{"$nulls":6},99813]
[{"$nulls":6},99814]
[{"$nulls":6},99815]
[{"$nulls":6},99816]
[{"$nulls":6},99817]
[{"$nulls":6},99818]
[{"$nulls":6},99819]
[{"$nulls":6},99820]
[{"$nulls":6},99821]
[{"$nulls":6},99822]
[{"$nulls":6},99823]
[{"$nulls":6},99824]
[{"$nulls":6},99825]
[{"$nulls":6},99826]
[{"$nulls":6},97013]
[{"$nulls":6},97014]
[{"$nulls":6},97015]
[{"$nulls":6},97016]
[{"$nulls":6},97017]
[{"$nulls":6},97018]
[{"$nulls":6},97031]
[{"$nulls":6},97032]
[{"$nulls":6},97033]
[{"$nulls":6},97034]
[{"$nulls":6},97039]
[{"$nulls":6},97040]
[{"$nulls":6},97041]
[{"$nulls":6},97046]
[{"$nulls":6},97047]
[{"$nulls":6},97048]
[{"$nulls":6},97054]
[{"$nulls":6},97062]
[{"$nulls":6},97063]
[{"$nulls":6},97064]
[{"$nulls":6},97065]
[{"$nulls":6},97066]
[{"$nulls":6},97067]
[{"$nulls":6},105103]
[{"$nulls":6},105104]
[{"$nulls":6},105105]
[{"$nulls":6},105106]
[{"$nulls":6},105107]
[{"$nulls":6},105110]
[{"$nulls":6},105111]
[{"$nulls":6},105112]
[{"$nulls":6},97621]
[{"$nulls":6},97622]
[{"$nulls":6},97623]
[{"$nulls":6},97624]
[{"$nulls":6},97625]
[{"$nulls":6},97626]
[{"$nulls":6},97627]
[{"$nulls":6},97628]
[{"$nulls":6},97629]
[{"$nulls":6},97631]
[{"$nulls":6},97632]
[{"$nulls":6},97633]
[{"$nulls":6},97634]
[{"$nulls":6},97635]
[{"$nulls":6},97636]
[{"$nulls":6},97637]
[{"$nulls":6},97638]
[{"$nulls":6},97639]
[{"$nulls":6},97640]
[{"$nulls":6},97641]
[{"$nulls":6},97642]
[{"$nulls":6},97643]
[{"$nulls":6},97644]
[{"$nulls":6},97645]
[{"$nulls":6},97647]
[{"$nulls":6},97648]
[{"$nulls":6},97649]
[{"$nulls":6},97650]
[{"$nulls":6},97651]
[{"$nulls":6},97652]
[{"$nulls":6},97653]
[{"$nulls":6},97654]
[{"$nulls":6},97655]
[{"$nulls":6},97656]
[{"$nulls":6},97657]
[{"$nulls":6},97658]
[{"$nulls":6},97659]
[{"$nulls":6},97660]
[{"$nulls":6},97661]
[{"$nulls":6},97662]
[{"$nulls":6},97663]
[{"$nulls":6},97664]
[{"$nulls":6},97665]
[{"$nulls":6},97666]
[{"$nulls":6},104789]
[{"$nulls":6},104790]
[{"$nulls":6},104791]
[{"$nulls":6},104792]
[{"$nulls":6},104793]
[{"$nulls":6},104794]
[{"$nulls":6},104795]
[{"$nulls":6},104796]
[{"$nulls":6},104797]
[{"$nulls":6},104798]
[{"$nulls":6},104799]
[{"$nulls":6},104800]
[{"$nulls":6},104801]
[{"$nulls":6},104802]
[{"$nulls":6},104803]
[{"$nulls":6},95967]
[{"$nulls":6},99059]
[{"$nulls":6},99060]
[{"$nulls":6},99061]
[{"$nulls":6},99062]
[{"$nulls":6},99063]
[{"$nulls":6},105007]
[{"$nulls":6},105009]
[{"$nulls":6},105011]
[{"$nulls":6},93588]
[{"$nulls":6},93589]
[{"$nulls":6},93590]
[{"$nulls":6},93591]
[{"$nulls":6},93592]
[{"$nulls":6},93593]
[{"$nulls":6},93594]
[{"$nulls":6},93595]
[{"$nulls":6},93596]
[{"$nulls":6},93597]
[{"$nulls":6},93598]
[{"$nulls":6},93599]
[{"$nulls":6},95425]
[{"$nulls":6},95426]
[{"$nulls":6},95427]
[{"$nulls":6},95428]
[{"$nulls":6},95429]
[{"$nulls":6},95430]
[{"$nulls":6},95875]
[{"$nulls":6},95876]
[{"$nulls":6},95877]
[{"$nulls":6},95878]
[{"$nulls":6},95879]
[{"$nulls":6},95880]
[{"$nulls":6},97912]
[{"$nulls":6},97913]
[{"$nulls":6},97914]
[{"$nulls":6},97915]
[{"$nulls":6},100937]
[{"$nulls":6},100938]
[{"$nulls":6},100939]
[{"$nulls":6},100940]
[{"$nulls":6},100941]
[{"$nulls":6},100942]
[{"$nulls":6},100943]
[{"$nulls":6},100944]
[{"$nulls":6},100945]
[{"$nulls":6},100946]
[{"$nulls":6},100947]
[{"$nulls":6},100948]
[{"$nulls":6},100949]
[{"$nulls":6},100950]
[{"$nulls":6},100951]
[{"$nulls":6},100952]
[{"$nulls":6},100953]
[{"$nulls":6},100954]
[{"$nulls":6},100955]
[{"$nulls":6},100956]
[{"$nulls":6},100957]
[{"$nulls":6},100958]
[{"$nulls":6},100959]
[{"$nulls":6},100960]
[{"$nulls":6},100961]
[{"$nulls":6},100962]
[{"$nulls":6},100963]
[{"$nulls":6},100964]
[{"$nulls":6},100973]
[{"$nulls":6},100974]
[{"$nulls":6},100975]
[{"$nulls":6},100965]
[{"$nulls":6},100966]
[{"$nulls":6},100969]
[{"$nulls":6},100970]
[{"$nulls":6},102330]
[{"$nulls":6},102331]
[{"$nulls":6},102332]
[{"$nulls":6},102333]
[{"$nulls":6},101019]
[{"$nulls":6},101479]
[{"$nulls":6},102568]
[{"$nulls":6},100976]
[{"$nulls":6},100977]
[{"$nulls":6},100978]
[{"$nulls":6},100979]
[{"$nulls":6},100980]
[{"$nulls":6},100981]
[{"$nulls":6},100982]
[{"$nulls":6},100983]
[{"$nulls":6},100984]
[{"$nulls":6},100985]
[{"$nulls":6},100986]
[{"$nulls":6},100987]
[{"$nulls":6},100988]
[{"$nulls":6},100989]
[{"$nulls":6},100990]
[{"$nulls":6},100991]
[{"$nulls":6},100992]
[{"$nulls":6},100993]
[{"$nulls":6},100994]
[{"$nulls":6},100995]
[{"$nulls":6},100996]
[{"$nulls":6},100997]
[{"$nulls":6},100998]
[{"$nulls":6},100999]
[{"$nulls":6},101000]
[{"$nulls":6},101001]
[{"$nulls":6},101002]
[{"$nulls":6},101003]
[{"$nulls":6},101004]
[{"$nulls":6},101005]
[{"$nulls":6},101006]
[{"$nulls":6},101007]
[{"$nulls":6},101008]
[{"$nulls":6},101009]
[{"$nulls":6},101010]
[{"$nulls":6},101013]
[{"$nulls":6},101014]
[{"$nulls":6},101015]
[{"$nulls":6},101016]
[{"$nulls":6},101017]
[{"$nulls":6},101018]
[{"$nulls":6},101463]
[{"$nulls":6},101464]
[{"$nulls":6},101465]
[{"$nulls":6},101466]
[{"$nulls":6},101467]
[{"$nulls":6},101468]
[{"$nulls":6},101469]
[{"$nulls":6},101470]
[{"$nulls":6},101471]
[{"$nulls":6},101472]
[{"$nulls":6},101473]
[{"$nulls":6},101474]
[{"$nulls":6},101475]
[{"$nulls":6},101476]
[{"$nulls":6},101477]
[{"$nulls":6},101478]
[{"$nulls":6},101480]
[{"$nulls":6},101481]
[{"$nulls":6},101482]
[{"$nulls":6},101483]
[{"$nulls":6},101484]
[{"$nulls":6},101485]
[{"$nulls":6},101486]
[{"$nulls":6},101487]
[{"$nulls":6},101488]
[{"$nulls":6},101188]
[{"$nulls":6},101189]
[{"$nulls":6},101190]
[{"$nulls":6},101191]
[{"$nulls":6},101192]
[{"$nulls":6},101193]
[{"$nulls":6},101194]
[{"$nulls":6},101197]
[{"$nulls":6},101198]
[{"$nulls":6},101199]
[{"$nulls":6},101200]
[{"$nulls":6},101201]
[{"$nulls":6},101202]
[{"$nulls":6},101203]
[{"$nulls":6},101204]
[{"$nulls":6},101205]
[{"$nulls":6},102362]
[{"$nulls":6},102363]
[{"$nulls":6},102364]
[{"$nulls":6},98509]
[{"$nulls":6},98510]
[{"$nulls":6},98511]
[{"$nulls":6},98516]
[{"$nulls":6},98519]
[{"$nulls":6},98520]
[{"$nulls":6},98521]
[{"$nulls":6},98522]
[{"$nulls":6},98524]
[{"$nulls":6},98503]
[{"$nulls":6},98504]
[{"$nulls":6},98505]
[{"$nulls":6},103946]
[{"$nulls":6},105000]
[{"$nulls":6},105001]
[{"$nulls":6},105002]
[{"$nulls":6},105003]
[{"$nulls":6},105004]
[{"$nulls":6},105005]
[{"$nulls":6},103185]
[{"$nulls":6},103186]
[{"$nulls":6},103187]
[{"$nulls":6},103188]
[{"$nulls":6},103189]
[{"$nulls":6},103190]
[{"$nulls":6},103191]
[{"$nulls":6},103192]
[{"$nulls":6},103193]
[{"$nulls":6},103194]
[{"$nulls":6},103195]
[{"$nulls":6},103205]
[{"$nulls":6},103206]
[{"$nulls":6},103207]
[{"$nulls":6},103208]
[{"$nulls":6},103209]
[{"$nulls":6},103210]
[{"$nulls":6},103304]
[{"$nulls":6},103307]
[{"$nulls":6},103310]
[{"$nulls":6},103314]
[{"$nulls":6},103315]
[{"$nulls":6},103769]
[{"$nulls":6},98525]
[{"$nulls":6},98526]
[{"$nulls":6},98527]
[{"$nulls":6},98528]
[{"$nulls":6},98529]
[{"$nulls":6},98530]
[{"$nulls":6},98531]
[{"$nulls":6},98532]
[{"$nulls":6},98533]
[{"$nulls":6},98534]
[{"$nulls":6},98535]
[{"$nulls":6},88238]
[{"$nulls":6},88239]
[{"$nulls":6},88240]
[{"$nulls":6},88241]
[{"$nulls":6},88242]
[{"$nulls":6},88243]
[{"$nulls":6},88245]
[{"$nulls":6},88246]
[{"$nulls":6},88247]
[{"$nulls":6},88248]
[{"$nulls":6},88249]
[{"$nulls":6},88250]
[{"$nulls":6},88251]
[{"$nulls":6},88252]
[{"$nulls":6},88253]
[{"$nulls":6},88255]
[{"$nulls":6},88256]
[{"$nulls":6},88257]
[{"$nulls":6},88260]
[{"$nulls":6},88261]
[{"$nulls":6},88262]
[{"$nulls":6},88263]
[{"$nulls":6},88264]
[{"$nulls":6},88266]
[{"$nulls":6},88267]
[{"$nulls":6},88269]
[{"$nulls":6},88270]
[{"$nulls":6},88272]
[{"$nulls":6},88273]
[{"$nulls":6},88274]
[{"$nulls":6},88275]
[{"$nulls":6},88277]
[{"$nulls":6},88278]
[{"$nulls":6},88279]
[{"$nulls":6},88281]
[{"$nulls":6},88282]
[{"$nulls":6},88283]
[{"$nulls":6},88284]
[{"$nulls":6},88286]
[{"$nulls":6},88288]
[{"$nulls":6},88291]
[{"$nulls":6},88292]
[{"$nulls":6},88293]
[{"$nulls":6},88294]
[{"$nulls":6},88295]
[{"$nulls":6},88296]
[{"$nulls":6},88297]
[{"$nulls":6},88298]
[{"$nulls":6},88299]
[{"$nulls":6},88300]
[{"$nulls":6},88301]
[{"$nulls":6},88302]
[{"$nulls":6},88303]
[{"$nulls":6},88304]
[{"$nulls":6},88306]
[{"$nulls":6},88307]
[{"$nulls":6},88308]
[{"$nulls":6},88309]
[{"$nulls":6},88310]
[{"$nulls":6},88311]
[{"$nulls":6},88312]
[{"$nulls":6},88313]
[{"$nulls":6},88314]
[{"$nulls":6},88315]
[{"$nulls":6},88316]
[{"$nulls":6},88317]
[{"$nulls":6},88318]
[{"$nulls":6},88321]
[{"$nulls":6},88322]
[{"$nulls":6},88323]
[{"$nulls":6},88324]
[{"$nulls":6},88325]
[{"$nulls":6},88377]
[{"$nulls":6},88441]
[{"$nulls":6},90766]
[{"$nulls":6},90767]
[{"$nulls":6},90768]
[{"$nulls":6},90769]
[{"$nulls":6},90770]
[{"$nulls":6},90772]
[{"$nulls":6},90775]
[{"$nulls":6},90776]
[{"$nulls":6},90777]
[{"$nulls":6},90778]
[{"$nulls":6},90779]
[{"$nulls":6},90780]
[{"$nulls":6},90781]
[{"$nulls":6},93558]
[{"$nulls":6},93561]
[{"$nulls":6},93563]
[{"$nulls":6},93564]
[{"$nulls":6},93565]
[{"$nulls":6},93566]
[{"$nulls":6},93567]
[{"$nulls":6},93568]
[{"$nulls":6},93569]
[{"$nulls":6},93570]
[{"$nulls":6},93571]
[{"$nulls":6},93572]
[{"$nulls":6},94295]
[{"$nulls":6},94296]
[{"$nulls":6},95308]
[{"$nulls":6},95309]
[{"$nulls":6},95310]
[{"$nulls":6},95311]
[{"$nulls":6},95312]
[{"$nulls":6},95313]
[{"$nulls":6},95314]
[{"$nulls":6},95315]
[{"$nulls":6},95316]
[{"$nulls":6},95317]
[{"$nulls":6},95318]
[{"$nulls":6},95319]
[{"$nulls":6},95320]
[{"$nulls":6},95321]
[{"$nulls":6},95322]
[{"$nulls":6},95323]
[{"$nulls":6},95324]
[{"$nulls":6},95325]
[{"$nulls":6},95328]
[{"$nulls":6},95329]
[{"$nulls":6},95330]
[{"$nulls":6},95331]
[{"$nulls":6},95332]
[{"$nulls":6},95334]
[{"$nulls":6},95335]
[{"$nulls":6},95337]
[{"$nulls":6},95338]
[{"$nulls":6},95339]
[{"$nulls":6},95340]
[{"$nulls":6},95341]
[{"$nulls":6},95342]
[{"$nulls":6},95343]
[{"$nulls":6},95344]
[{"$nulls":6},95345]
[{"$nulls":6},95346]
[{"$nulls":6},95347]
[{"$nulls":6},95348]
[{"$nulls":6},95349]
[{"$nulls":6},95351]
[{"$nulls":6},95352]
[{"$nulls":6},95354]
[{"$nulls":6},95355]
[{"$nulls":6},95356]
[{"$nulls":6},95357]
[{"$nulls":6},95358]
[{"$nulls":6},95359]
[{"$nulls":6},95360]
[{"$nulls":6},95361]
[{"$nulls":6},95362]
[{"$nulls":6},95363]
[{"$nulls":6},95364]
[{"$nulls":6},95365]
[{"$nulls":6},95366]
[{"$nulls":6},95367]
[{"$nulls":6},95368]
[{"$nulls":6},95369]
[{"$nulls":6},95370]
[{"$nulls":6},95371]
[{"$nulls":6},95372]
[{"$nulls":6},95373]
[{"$nulls":6},95374]
[{"$nulls":6},95375]
[{"$nulls":6},95376]
[{"$nulls":6},95377]
[{"$nulls":6},95378]
[{"$nulls":6},95379]
[{"$nulls":6},95380]
[{"$nulls":6},95383]
[{"$nulls":6},95384]
[{"$nulls":6},95385]
[{"$nulls":6},95386]
[{"$nulls":6},95387]
[{"$nulls":6},95389]
[{"$nulls":6},95390]
[{"$nulls":6},95392]
[{"$nulls":6},95393]
[{"$nulls":6},95394]
[{"$nulls":6},95395]
[{"$nulls":6},95396]
[{"$nulls":6},95398]
[{"$nulls":6},95400]
[{"$nulls":6},95401]
[{"$nulls":6},95402]
[{"$nulls":6},95403]
[{"$nulls":6},95404]
[{"$nulls":6},95405]
[{"$nulls":6},95406]
[{"$nulls":6},95408]
[{"$nulls":6},95411]
[{"$nulls":6},95413]
[{"$nulls":6},95414]
[{"$nulls":6},95415]
[{"$nulls":6},95416]
[{"$nulls":6},95417]
[{"$nulls":6},95418]
[{"$nulls":6},95419]
[{"$nulls":6},95420]
[{"$nulls":6},95421]
[{"$nulls":6},95422]
[{"$nulls":6},95423]
[{"$nulls":6},95424]
[{"$nulls":6},100288]
[{"$nulls":6},100289]
[{"$nulls":6},100291]
[{"$nulls":6},100293]
[{"$nulls":6},100295]
[{"$nulls":6},100298]
[{"$nulls":6},100299]
[{"$nulls":6},100301]
[{"$nulls":6},100303]
[{"$nulls":6},100307]
[{"$nulls":6},100308]
[{"$nulls":6},100309]
[{"$nulls":6},100315]
[{"$nulls":6},100321]
[{"$nulls":6},100533]
[{"$nulls":6},100534]
[{"$nulls":6},100535]
[{"$nulls":6},100536]
[{"$nulls":6},101286]
[{"$nulls":6},101287]
[{"$nulls":6},101288]
[{"$nulls":6},101289]
[{"$nulls":6},101290]
[{"$nulls":6},101291]
[{"$nulls":6},101292]
[{"$nulls":6},101293]
[{"$nulls":6},101294]
[{"$nulls":6},101295]
[{"$nulls":6},101296]
[{"$nulls":6},101297]
[{"$nulls":6},101298]
[{"$nulls":6},101299]
[{"$nulls":6},101300]
[{"$nulls":6},101301]
[{"$nulls":6},101302]
[{"$nulls":6},101303]
[{"$nulls":6},101304]
[{"$nulls":6},101305]
[{"$nulls":6},101307]
[{"$nulls":6},101308]
[{"$nulls":6},101309]
[{"$nulls":6},101310]
[{"$nulls":6},101311]
[{"$nulls":6},101312]
[{"$nulls":6},101313]
[{"$nulls":6},101315]
[{"$nulls":6},101316]
[{"$nulls":6},101320]
[{"$nulls":6},101322]
[{"$nulls":6},101323]
[{"$nulls":6},101324]
[{"$nulls":6},101325]
[{"$nulls":6},101326]
[{"$nulls":6},101328]
[{"$nulls":6},101329]
[{"$nulls":6},101330]
[{"$nulls":6},101331]
[{"$nulls":6},101332]
[{"$nulls":6},101333]
[{"$nulls":6},101334]
[{"$nulls":6},101336]
[{"$nulls":6},101337]
[{"$nulls":6},101338]
[{"$nulls":6},101339]
[{"$nulls":6},101340]
[{"$nulls":6},101341]
[{"$nulls":6},101342]
[{"$nulls":6},101343]
[{"$nulls":6},101344]
[{"$nulls":6},101345]
[{"$nulls":6},101346]
[{"$nulls":6},101347]
[{"$nulls":6},101348]
[{"$nulls":6},101349]
[{"$nulls":6},101350]
[{"$nulls":6},101351]
[{"$nulls":6},101352]
[{"$nulls":6},101353]
[{"$nulls":6},101355]
[{"$nulls":6},101356]
[{"$nulls":6},101357]
[{"$nulls":6},101358]
[{"$nulls":6},101359]
[{"$nulls":6},101360]
[{"$nulls":6},101361]
[{"$nulls":6},101363]
[{"$nulls":6},101364]
[{"$nulls":6},101365]
[{"$nulls":6},101366]
[{"$nulls":6},101368]
[{"$nulls":6},101369]
[{"$nulls":6},101370]
[{"$nulls":6},101371]
[{"$nulls":6},101372]
[{"$nulls":6},101374]
[{"$nulls":6},101375]
[{"$nulls":6},101376]
[{"$nulls":6},101377]
[{"$nulls":6},101378]
[{"$nulls":6},101379]
[{"$nulls":6},101380]
[{"$nulls":6},101381]
[{"$nulls":6},101382]
[{"$nulls":6},101383]
[{"$nulls":6},101384]
[{"$nulls":6},101385]
[{"$nulls":6},101386]
[{"$nulls":6},101387]
[{"$nulls":6},101388]
[{"$nulls":6},101389]
[{"$nulls":6},101390]
[{"$nulls":6},101391]
[{"$nulls":6},101392]
[{"$nulls":6},101394]
[{"$nulls":6},101395]
[{"$nulls":6},101396]
[{"$nulls":6},101397]
[{"$nulls":6},101398]
[{"$nulls":6},101399]
[{"$nulls":6},101401]
[{"$nulls":6},101402]
[{"$nulls":6},101407]
[{"$nulls":6},101408]
[{"$nulls":6},101409]
[{"$nulls":6},101410]
[{"$nulls":6},101412]
[{"$nulls":6},101413]
[{"$nulls":6},101414]
[{"$nulls":6},101415]
[{"$nulls":6},101416]
[{"$nulls":6},101417]
[{"$nulls":6},101418]
[{"$nulls":6},101419]
[{"$nulls":6},101420]
[{"$nulls":6},101421]
[{"$nulls":6},101422]
[{"$nulls":6},101424]
[{"$nulls":6},101425]
[{"$nulls":6},101426]
[{"$nulls":6},101427]
[{"$nulls":6},101428]
[{"$nulls":6},101429]
[{"$nulls":6},101430]
[{"$nulls":6},101431]
[{"$nulls":6},101432]
[{"$nulls":6},101433]
[{"$nulls":6},101434]
[{"$nulls":6},101435]
[{"$nulls":6},101436]
[{"$nulls":6},101437]
[{"$nulls":6},101438]
[{"$nulls":6},101439]
[{"$nulls":6},101440]
[{"$nulls":6},101441]
[{"$nulls":6},101443]
[{"$nulls":6},101444]
[{"$nulls":6},101445]
[{"$nulls":6},101446]
[{"$nulls":6},101447]
[{"$nulls":6},101448]
[{"$nulls":6},101449]
[{"$nulls":6},101451]
[{"$nulls":6},101452]
[{"$nulls":6},101453]
[{"$nulls":6},101454]
[{"$nulls":6},101456]
[{"$nulls":6},101457]
[{"$nulls":6},101458]
[{"$nulls":6},101459]
[{"$nulls":6},101460]

{"sheet":"5.CURVELO","index":4,"n_rows":7543,"n_cols":30,"rows_kept":7543,"cut":false,"hidden":false,"merged":[[1,1,3,11],[4,1,4,13],[5,1,8,1],[5,2,8,2],[5,3,8,3],[5,4,8,7],[6,9,7,9],[6,12,8,12],[6,13,8,13],[20,4,20,7],[9,4,9,7],[10,4,10,7],[11,4,11,7],[12,4,12,7],[13,4,13,7],[14,4,14,7],[15,4,15,7],[16,4,16,7],[17,4,17,7],[18,4,18,7],[19,4,19,7],[32,4,32,7],[21,4,21,7],[22,4,22,7],[23,4,23,7],[24,4,24,7],[25,4,25,7],[26,4,26,7],[27,4,27,7],[28,4,28,7],[29,4,29,7],[30,4,30,7],[31,4,31,7],[48,4,48,7],[33,4,33,7],[34,4,34,7],[35,4,35,7],[36,4,36,7],[37,4,37,7],[38,4,38,7],[40,4,40,7],[41,4,41,7],[42,4,42,7],[44,4,44,7],[46,4,46,7],[55,4,55,7],[56,4,56,7],[57,1,57,12],[49,4,49,7],[50,4,50,7],[51,4,51,7],[52,4,52,7],[53,4,53,7],[54,4,54,7]]}
[]
[null,"LOGOTIPO DA EMPRESA"]
[]
[{"$nulls":12},"Data Base do Orçamento","2024-08-01"]
[null,"CONTRATAÇÃO DE SERVIÇOS DE PAVIMENTAÇÃO ASFÁLTICA COM CONCRETO BETUMINOSO USINADO A QUENTE (CBUQ) EM VIAS URBANAS E RURAIS INSERIDAS NA ÁREA DE ATUAÇÃO DA 1ª SUPERINTENDÊNCIA REGIONAL DA CODEVASF, NO ESTADO DE MINAS GERAIS - ITEM 5: CURVELO/MG"]
[null,"ITEM","ORIGEM\nCOMPOSIÇÃO","CÓDIGO\nCOMPOSIÇÃO","DISCRIMINAÇÃO DOS SERVIÇOS",null,null,null,"BDI % = ",{"$f":"BDI!C17","v":0},"BDI  DIFERENCIADO% =",{"$f":"BDI!C33","v":0},"R$/m²",{"$f":"N58/I8","v":0},{"$f":"N58","v":0}]
[{"$nulls":8},"Total de m²","Encargos Sociais:","Horista","Mensalista","PREÇO UNITÁRIO COM BDI","PREÇO TOTAL COM BDI "]
[{"$nulls":8},63000,null,{"$f":"'ENC.SOC.'!$E$51","v":0},{"$f":"'ENC.SOC.'!$F$51","v":0}]
[{"$nulls":8},"UND","QTDE.","BDI","PREÇO UNITÁRIO "]
[{"$nulls":4},"MOBILIZAÇÃO/DESMOBILIZAÇÃO"]
[null,1,"Codevasf","Mob","Mobilização",null,null,null,"kmxfrente",540,{"$f":"(M11/L11-1)","v":{"$error":"#DIV/0!"}},null,{"$f":"L11*(1+$J$6)","v":0},{"$f":"M11*J11","v":0},{"$f":"N11/$N$58","v":{"$error":"#DIV/0!"}}]
[null,2,"Codevasf","Mob","Desmobilização",null,null,null,"kmxfrente",540,{"$f":"(M12/L12-1)","v":{"$error":"#DIV/0!"}},null,{"$f":"L12*(1+$J$6)","v":0},{"$f":"M12*J12","v":0},{"$f":"N12/$N$58","v":{"$error":"#DIV/0!"}}]
[{"$nulls":4},"INSTALAÇÃO DE CANTEIRO"]
[null,3,"Codevasf","Canteiro","Canteiro de Obras e Almoxarifado",null,null,null,"frente",6,{"$f":"(M14/L14-1)","v":{"$error":"#DIV/0!"}},null,{"$f":"L14*(1+$J$6)","v":0},{"$f":"ROUND(ROUND(J14,2)*ROUND(M14,6),2)","v":0},{"$f":"N14/N58","v":{"$error":"#DIV/0!"}}]
[null,4,"SINAPI",103689,"FORNECIMENTO E INSTALAÇÃO DE PLACA DE OBRA COM CHAPA GALVANIZADA E ESTRUTURA DE MADEIRA",null,null,null,"m²",96,{"$f":"(M15/L15-1)","v":{"$error":"#DIV/0!"}},null,0,{"$f":"ROUND(ROUND(J15,2)*ROUND(M15,6),2)","v":0}]
[{"$nulls":4},"ADMINISTRAÇÃO LOCAL DA OBRA"]
[null,5,"Codevasf","Adm Local","Administração Local da Obra",null,null,null,"und",1,{"$f":"(M17/L17-1)","v":{"$error":"#DIV/0!"}},null,{"$f":"L17*(1+$J$6)","v":0},{"$f":"ROUND(ROUND(J17,2)*ROUND(M17,6),2)","v":0},{"$f":"N17/N58","v":{"$error":"#DIV/0!"}}]
[{"$nulls":4},"TERRAPLANAGEM"]
[null,6,"SICRO",5502114,"Escavação, carga e transporte de material de 1ª categoria - DMT de 1.000 a 1.200 m - caminho de serviço em leito natural - com escavadeira e caminhão basculante de 14 m³",null,null,null,"m³",22050,{"$f":"M19/L19-1","v":{"$error":"#DIV/0!"}},null,{"$f":"L19*(1+$J$6)","v":0},{"$f":"ROUND(ROUND(J19,2)*ROUND(M19,6),2)","v":0}]
[null,7,"SICRO",4413942,"Espalhamento de material em bota-fora",null,null,null,"m³",22050,{"$error":"#DIV/0!"},null,0,0,{"$nulls":15},1]
[{"$nulls":4},"PAVIMENTAÇÃO"]
[null,8,"SICRO",4011463,"Concreto asfáltico - faixa C - areia e brita comerciais",null,null,null,"t",7560,{"$f":"M22/L22-1","v":{"$error":"#DIV/0!"}},null,{"$f":"L22*(1+$J$6)","v":0},{"$f":"ROUND(ROUND(J22,2)*ROUND(M22,6),2)","v":0}]
[null,9,"SICRO",4011352,"Imprimação com emulsão asfáltica",null,null,null,"m²",63000,{"$error":"#DIV/0!"},null,0,0]
[null,10,"SICRO",4011353,"Pintura de ligação",null,null,null,"m²",63000,{"$error":"#DIV/0!"},null,0,0]
[null,11,"SICRO",4011268,"Base estabilizada granulometricamente com mistura solo brita (70% - 30%) em usina com material de jazida e brita comercial",null,null,null,"m³",9450,{"$error":"#DIV/0!"},null,0,0]
[null,12,"SICRO",4011228,"Sub-base estabilizada granulometricamente com mistura de solos na pista com material de jazida",null,null,null,"m³",9450,{"$error":"#DIV/0!"},null,0,0]
[null,13,"SICRO",4011209,"Regularização do subleito",null,null,null,"m²",63000,{"$error":"#DIV/0!"},null,0,0]
[{"$nulls":4},"AQUISIÇÃO E TRANSPORTE DO MATERIAL BETUMINOSO"]
[null,14,"CODEVASF","CPU-13","AQUISIÇÃO DE CIMENTO ASFALTICO CAP 50/70",null,null,null,"t",487.54,{"$f":"M29/L29-1","v":{"$error":"#DIV/0!"}},null,{"$f":"L29*(1+$L$6)","v":0},{"$f":"ROUND(ROUND(J29,2)*ROUND(M29,6),2)","v":0}]
[null,15,"CODEVASF","CPU-17","TRANSPORTE CAP 50/70",null,null,null,"t",487.54,{"$error":"#DIV/0!"},null,{"$f":"L30*(1+$L$6)","v":0},0]
[null,16,"CODEVASF","CPU-14","AQUISIÇÃO DE EAI",null,null,null,"t",81.900000000000006,{"$error":"#DIV/0!"},null,0,0]
[null,17,"CODEVASF","CPU-18","TRANSPORTE DE EAI",null,null,null,"t",81.900000000000006,{"$error":"#DIV/0!"},null,0,0]
[null,18,"CODEVASF","CPU-15","AQUISIÇÃO DE EMULSÃO ASFÁLTICA RR-1C",null,null,null,"t",28.35,{"$error":"#DIV/0!"},null,0,0]
[null,19,"CODEVASF","CPU-19","TRANSPORTE RR-1C",null,null,null,"t",28.35,{"$error":"#DIV/0!"},null,0,0]
[{"$nulls":4},"SINALIZAÇÃO"]
[null,20,"SICRO",5213440,"Placa de regulamentação em aço D = 0,60 m - película retrorrefletiva tipo I + SI - fornecimento e implantação",null,null,null,"und",27,{"$f":"M36/L36-1","v":{"$error":"#DIV/0!"}},null,{"$f":"L36*(1+$J$6)","v":0},{"$f":"ROUND(ROUND(J36,2)*ROUND(M36,6),2)","v":0}]
[null,21,"SICRO",5213464,"Placa de advertência em aço, lado de 0,60 m - película retrorrefletiva tipo I + SI - fornecimento e implantação",null,null,null,"und",27,{"$error":"#DIV/0!"},null,0,0]
[null,22,"SICRO",5213863,"Suporte metálico galvanizado para placa de advertência ou regulamentação - lado ou diâmetro de 0,60 m - fornecimento e implantação",null,null,null,"und",54,{"$error":"#DIV/0!"},null,0,0]
[null,23,"SICRO",5213400,"Pintura de faixa com tinta acrílica - espessura de 0,4 mm",null,null,null,"m²",2520,{"$error":"#DIV/0!"},null,0,0]
[{"$nulls":4},"DRENAGEM"]
[null,24,"SINAPI",94273,"ASSENTAMENTO DE GUIA (MEIO-FIO) EM TRECHO RETO, CONFECCIONADA EM CONCRETO PRÉ-FABRICADO, DIMENSÕES 100X15X13X30 CM (COMPRIMENTO X BASE INFERIOR X BASE SUPERIOR X ALTURA)",null,null,null,"m",18000,{"$f":"M41/L41-1","v":{"$error":"#DIV/0!"}},null,{"$f":"L41*(1+$J$6)","v":0},{"$f":"ROUND(ROUND(J41,2)*ROUND(M41,6),2)","v":0}]
[null,25,"SINAPI",94287,"EXECUÇÃO DE SARJETA DE CONCRETO USINADO, MOLDADA  IN LOCO  EM TRECHO RETO, 30 CM BASE X 10 CM ALTURA",null,null,null,"m",18000,{"$f":"M42/L42-1","v":{"$error":"#DIV/0!"}},null,0,{"$f":"ROUND(ROUND(J42,2)*ROUND(M42,6),2)","v":0}]
[null,26,"SICRO",4915724,"Caiação mecanizada com fixador de cal",null,null,null,"m²",2160,{"$f":"(M43/L43-1)","v":{"$error":"#DIV/0!"}},null,0,{"$f":"ROUND(ROUND(J43,2)*ROUND(M43,6),2)","v":0},{"$nulls":10},4514640]
[{"$nulls":4},"SERVIÇOS COMPLEMENTARES"]
[null,27,"Codevasf","CPU-12","Conserto de quebra no ramal na rua sem pavimento com fornecimento de material hidráulico",null,null,null,"m",900,{"$f":"M45/L45-1","v":{"$error":"#DIV/0!"}},null,{"$f":"L45*(1+$J$6)","v":0},{"$f":"ROUND(ROUND(J45,2)*ROUND(M45,6),2)","v":0}]
[{"$nulls":4},"PROJETO EXECUTIVO"]
[null,28,"Codevasf","Composição Própria","Projeto Executivo",null,null,null,"m²",63000,{"$f":"M47/L47-1","v":{"$error":"#DIV/0!"}},null,{"$f":"L47*(1+$J$6)","v":0},{"$f":"ROUND(ROUND(J47,2)*ROUND(M47,6),2)","v":0}]
[{"$nulls":4},"MOMENTO DE TRANSPORTE"]
[null,29,"SICRO",5914359,"Transporte com caminhão basculante de 10 m³ - rodovia em leito natural",null,null,null,"tkm",141234.82999999999,{"$f":"M49/L49-1","v":{"$error":"#DIV/0!"}},null,{"$f":"L49*(1+$J$6)","v":0},{"$f":"ROUND(ROUND(J49,2)*ROUND(M49,6),2)","v":0}]
[null,30,"SICRO",5914374,"Transporte com caminhão basculante de 10 m³ - rodovia em revestimento primário",null,null,null,"tkm",141234.82999999999,{"$error":"#DIV/0!"},null,0,0]
[null,31,"SICRO",5914389,"Transporte com caminhão basculante de 10 m³ - rodovia pavimentada",null,null,null,"tkm",1129879.02,{"$error":"#DIV/0!"},null,0,0]
[null,32,"SICRO",5914449,"Transporte com caminhão carroceria de 15 t - rodovia em leito natural",null,null,null,"tkm",556.23,{"$error":"#DIV/0!"},null,0,0]
[null,33,"SICRO",5914464,"Transporte com caminhão carroceria de 15 t - rodovia em revestimento primário",null,null,null,"tkm",556.23,{"$error":"#DIV/0!"},null,0,0]
[null,34,"SICRO",5914479,"Transporte com caminhão carroceria de 15 t - rodovia pavimentada",null,null,null,"tkm",4449.83,{"$error":"#DIV/0!"},null,0,0]
[null,35,"SICRO",5914364,"Transporte de cimento ou cal hidratada a granel com caminhão silo de 30 m³ - rodovia em leito natural",null,null,null,"tkm",446.98,{"$error":"#DIV/0!"},null,0,0]
[null,36,"SICRO",5914365,"Transporte de cimento ou cal hidratada a granel com caminhão silo de 30 m³ - rodovia em revestimento primário",null,null,null,"tkm",446.98,{"$error":"#DIV/0!"},null,0,0]
[null,37,"SICRO",5914366,"Transporte de cimento ou cal hidratada a granel com caminhão silo de 30 m³ - rodovia pavimentada",null,null,null,"tkm",3575.82,{"$f":"M57/L57-1","v":{"$error":"#DIV/0!"}},null,0,{"$f":"ROUND(ROUND(J57,2)*ROUND(M57,6),2)","v":0},{"$f":"SUM(N49:N57)/N58","v":{"$error":"#DIV/0!"}}]
[null,"VALOR TOTAL DO SRP",{"$nulls":11},{"$f":"SUM(N11:N57)","v":0}]
[null,"Obs.: Os valores estão apresentados com apenas 2 casas decimais, mas os valores da presente planilha foram calculados utilizando a precisão de 6 casas decimais. "]
[{"$nulls":13},{"$f":"(N58/#REF!)/2000000","v":{"$error":"#REF!"}}]
{"$rows_empty":6598}
[{"$nulls":6},87354]
[{"$nulls":6},87355]
[{"$nulls":6},87356]
[{"$nulls":6},87357]
[{"$nulls":6},87358]
[{"$nulls":6},87359]
[{"$nulls":6},87360]
[{"$nulls":6},87361]
[{"$nulls":6},87362]
[{"$nulls":6},87363]
[{"$nulls":6},87364]
[{"$nulls":6},87365]
[{"$nulls":6},87366]
[{"$nulls":6},87367]
[{"$nulls":6},87368]
[{"$nulls":6},87369]
[{"$nulls":6},87370]
[{"$nulls":6},87371]
[{"$nulls":6},87372]
[{"$nulls":6},87373]
[{"$nulls":6},87374]
[{"$nulls":6},87375]
[{"$nulls":6},87376]
[{"$nulls":6},87377]
[{"$nulls":6},87378]
[{"$nulls":6},87379]
[{"$nulls":6},87380]
[{"$nulls":6},87381]
[{"$nulls":6},87382]
[{"$nulls":6},87383]
[{"$nulls":6},87384]
[{"$nulls":6},87385]
[{"$nulls":6},87386]
[{"$nulls":6},87387]
[{"$nulls":6},87388]
[{"$nulls":6},87389]
[{"$nulls":6},87390]
[{"$nulls":6},87391]
[{"$nulls":6},87393]
[{"$nulls":6},87394]
[{"$nulls":6},87395]
[{"$nulls":6},87396]
[{"$nulls":6},87397]
[{"$nulls":6},87398]
[{"$nulls":6},87399]
[{"$nulls":6},87401]
[{"$nulls":6},87402]
[{"$nulls":6},87404]
[{"$nulls":6},87405]
[{"$nulls":6},87407]
[{"$nulls":6},87408]
[{"$nulls":6},87410]
[{"$nulls":6},88626]
[{"$nulls":6},88627]
[{"$nulls":6},88628]
[{"$nulls":6},88629]
[{"$nulls":6},88630]
[{"$nulls":6},88631]
[{"$nulls":6},88715]
[{"$nulls":6},95563]
[{"$nulls":6},100464]
[{"$nulls":6},100465]
[{"$nulls":6},100466]
[{"$nulls":6},100468]
[{"$nulls":6},100469]
[{"$nulls":6},100470]
[{"$nulls":6},100472]
[{"$nulls":6},100473]
[{"$nulls":6},100474]
[{"$nulls":6},100475]
[{"$nulls":6},100477]
[{"$nulls":6},100478]
[{"$nulls":6},100479]
[{"$nulls":6},100480]
[{"$nulls":6},100481]
[{"$nulls":6},100483]
[{"$nulls":6},100484]
[{"$nulls":6},100485]
[{"$nulls":6},100486]
[{"$nulls":6},100487]
[{"$nulls":6},100488]
[{"$nulls":6},100489]
[{"$nulls":6},100490]
[{"$nulls":6},100491]
[{"$nulls":6},100492]
[{"$nulls":6},92121]
[{"$nulls":6},92122]
[{"$nulls":6},92123]
[{"$nulls":6},100195]
[{"$nulls":6},100196]
[{"$nulls":6},100197]
[{"$nulls":6},100198]
[{"$nulls":6},100199]
[{"$nulls":6},100200]
[{"$nulls":6},100201]
[{"$nulls":6},100202]
[{"$nulls":6},100203]
[{"$nulls":6},100204]
[{"$nulls":6},100205]
[{"$nulls":6},100206]
[{"$nulls":6},100207]
[{"$nulls":6},100208]
[{"$nulls":6},100209]
[{"$nulls":6},100210]
[{"$nulls":6},100211]
[{"$nulls":6},100212]
[{"$nulls":6},100213]
[{"$nulls":6},100214]
[{"$nulls":6},100215]
[{"$nulls":6},100216]
[{"$nulls":6},100217]
[{"$nulls":6},100218]
[{"$nulls":6},100219]
[{"$nulls":6},100220]
[{"$nulls":6},100221]
[{"$nulls":6},100222]
[{"$nulls":6},100223]
[{"$nulls":6},100224]
[{"$nulls":6},100225]
[{"$nulls":6},100226]
[{"$nulls":6},100227]
[{"$nulls":6},100228]
[{"$nulls":6},100229]
[{"$nulls":6},100230]
[{"$nulls":6},100231]
[{"$nulls":6},100232]
[{"$nulls":6},100233]
[{"$nulls":6},100234]
[{"$nulls":6},100235]
[{"$nulls":6},100236]
[{"$nulls":6},100237]
[{"$nulls":6},100238]
[{"$nulls":6},100239]
[{"$nulls":6},100240]
[{"$nulls":6},100241]
[{"$nulls":6},100242]
[{"$nulls":6},100243]
[{"$nulls":6},100244]
[{"$nulls":6},100245]
[{"$nulls":6},100246]
[{"$nulls":6},100247]
[{"$nulls":6},100248]
[{"$nulls":6},100249]
[{"$nulls":6},100250]
[{"$nulls":6},100251]
[{"$nulls":6},100252]
[{"$nulls":6},100253]
[{"$nulls":6},100254]
[{"$nulls":6},100255]
[{"$nulls":6},100256]
[{"$nulls":6},100257]
[{"$nulls":6},100258]
[{"$nulls":6},100259]
[{"$nulls":6},100260]
[{"$nulls":6},100261]
[{"$nulls":6},100262]
[{"$nulls":6},100263]
[{"$nulls":6},100264]
[{"$nulls":6},100265]
[{"$nulls":6},100266]
[{"$nulls":6},100267]
[{"$nulls":6},100268]
[{"$nulls":6},100269]
[{"$nulls":6},100270]
[{"$nulls":6},100271]
[{"$nulls":6},100272]
[{"$nulls":6},100273]
[{"$nulls":6},100274]
[{"$nulls":6},100275]
[{"$nulls":6},100276]
[{"$nulls":6},100277]
[{"$nulls":6},100278]
[{"$nulls":6},100279]
[{"$nulls":6},100280]
[{"$nulls":6},100281]
[{"$nulls":6},100282]
[{"$nulls":6},100283]
[{"$nulls":6},100284]
[{"$nulls":6},100285]
[{"$nulls":6},100286]
[{"$nulls":6},100287]
[{"$nulls":6},99802]
[{"$nulls":6},99803]
[{"$nulls":6},99804]
[{"$nulls":6},99805]
[{"$nulls":6},99806]
[{"$nulls":6},99807]
[{"$nulls":6},99808]
[{"$nulls":6},99809]
[{"$nulls":6},99810]
[{"$nulls":6},99811]
[{"$nulls":6},99812]
[{"$nulls":6},99813]
[{"$nulls":6},99814]
[{"$nulls":6},99815]
[{"$nulls":6},99816]
[{"$nulls":6},99817]
[{"$nulls":6},99818]
[{"$nulls":6},99819]
[{"$nulls":6},99820]
[{"$nulls":6},99821]
[{"$nulls":6},99822]
[{"$nulls":6},99823]
[{"$nulls":6},99824]
[{"$nulls":6},99825]
[{"$nulls":6},99826]
[{"$nulls":6},97013]
[{"$nulls":6},97014]
[{"$nulls":6},97015]
[{"$nulls":6},97016]
[{"$nulls":6},97017]
[{"$nulls":6},97018]
[{"$nulls":6},97031]
[{"$nulls":6},97032]
[{"$nulls":6},97033]
[{"$nulls":6},97034]
[{"$nulls":6},97039]
[{"$nulls":6},97040]
[{"$nulls":6},97041]
[{"$nulls":6},97046]
[{"$nulls":6},97047]
[{"$nulls":6},97048]
[{"$nulls":6},97054]
[{"$nulls":6},97062]
[{"$nulls":6},97063]
[{"$nulls":6},97064]
[{"$nulls":6},97065]
[{"$nulls":6},97066]
[{"$nulls":6},97067]
[{"$nulls":6},105103]
[{"$nulls":6},105104]
[{"$nulls":6},105105]
[{"$nulls":6},105106]
[{"$nulls":6},105107]
[{"$nulls":6},105110]
[{"$nulls":6},105111]
[{"$nulls":6},105112]
[{"$nulls":6},97621]
[{"$nulls":6},97622]
[{"$nulls":6},97623]
[{"$nulls":6},97624]
[{"$nulls":6},97625]
[{"$nulls":6},97626]
[{"$nulls":6},97627]
[{"$nulls":6},97628]
[{"$nulls":6},97629]
[{"$nulls":6},97631]
[{"$nulls":6},97632]
[{"$nulls":6},97633]
[{"$nulls":6},97634]
[{"$nulls":6},97635]
[{"$nulls":6},97636]
[{"$nulls":6},97637]
[{"$nulls":6},97638]
[{"$nulls":6},97639]
[{"$nulls":6},97640]
[{"$nulls":6},97641]
[{"$nulls":6},97642]
[{"$nulls":6},97643]
[{"$nulls":6},97644]
[{"$nulls":6},97645]
[{"$nulls":6},97647]
[{"$nulls":6},97648]
[{"$nulls":6},97649]
[{"$nulls":6},97650]
[{"$nulls":6},97651]
[{"$nulls":6},97652]
[{"$nulls":6},97653]
[{"$nulls":6},97654]
[{"$nulls":6},97655]
[{"$nulls":6},97656]
[{"$nulls":6},97657]
[{"$nulls":6},97658]
[{"$nulls":6},97659]
[{"$nulls":6},97660]
[{"$nulls":6},97661]
[{"$nulls":6},97662]
[{"$nulls":6},97663]
[{"$nulls":6},97664]
[{"$nulls":6},97665]
[{"$nulls":6},97666]
[{"$nulls":6},104789]
[{"$nulls":6},104790]
[{"$nulls":6},104791]
[{"$nulls":6},104792]
[{"$nulls":6},104793]
[{"$nulls":6},104794]
[{"$nulls":6},104795]
[{"$nulls":6},104796]
[{"$nulls":6},104797]
[{"$nulls":6},104798]
[{"$nulls":6},104799]
[{"$nulls":6},104800]
[{"$nulls":6},104801]
[{"$nulls":6},104802]
[{"$nulls":6},104803]
[{"$nulls":6},95967]
[{"$nulls":6},99059]
[{"$nulls":6},99060]
[{"$nulls":6},99061]
[{"$nulls":6},99062]
[{"$nulls":6},99063]
[{"$nulls":6},105007]
[{"$nulls":6},105009]
[{"$nulls":6},105011]
[{"$nulls":6},93588]
[{"$nulls":6},93589]
[{"$nulls":6},93590]
[{"$nulls":6},93591]
[{"$nulls":6},93592]
[{"$nulls":6},93593]
[{"$nulls":6},93594]
[{"$nulls":6},93595]
[{"$nulls":6},93596]
[{"$nulls":6},93597]
[{"$nulls":6},93598]
[{"$nulls":6},93599]
[{"$nulls":6},95425]
[{"$nulls":6},95426]
[{"$nulls":6},95427]
[{"$nulls":6},95428]
[{"$nulls":6},95429]
[{"$nulls":6},95430]
[{"$nulls":6},95875]
[{"$nulls":6},95876]
[{"$nulls":6},95877]
[{"$nulls":6},95878]
[{"$nulls":6},95879]
[{"$nulls":6},95880]
[{"$nulls":6},97912]
[{"$nulls":6},97913]
[{"$nulls":6},97914]
[{"$nulls":6},97915]
[{"$nulls":6},100937]
[{"$nulls":6},100938]
[{"$nulls":6},100939]
[{"$nulls":6},100940]
[{"$nulls":6},100941]
[{"$nulls":6},100942]
[{"$nulls":6},100943]
[{"$nulls":6},100944]
[{"$nulls":6},100945]
[{"$nulls":6},100946]
[{"$nulls":6},100947]
[{"$nulls":6},100948]
[{"$nulls":6},100949]
[{"$nulls":6},100950]
[{"$nulls":6},100951]
[{"$nulls":6},100952]
[{"$nulls":6},100953]
[{"$nulls":6},100954]
[{"$nulls":6},100955]
[{"$nulls":6},100956]
[{"$nulls":6},100957]
[{"$nulls":6},100958]
[{"$nulls":6},100959]
[{"$nulls":6},100960]
[{"$nulls":6},100961]
[{"$nulls":6},100962]
[{"$nulls":6},100963]
[{"$nulls":6},100964]
[{"$nulls":6},100973]
[{"$nulls":6},100974]
[{"$nulls":6},100975]
[{"$nulls":6},100965]
[{"$nulls":6},100966]
[{"$nulls":6},100969]
[{"$nulls":6},100970]
[{"$nulls":6},102330]
[{"$nulls":6},102331]
[{"$nulls":6},102332]
[{"$nulls":6},102333]
[{"$nulls":6},101019]
[{"$nulls":6},101479]
[{"$nulls":6},102568]
[{"$nulls":6},100976]
[{"$nulls":6},100977]
[{"$nulls":6},100978]
[{"$nulls":6},100979]
[{"$nulls":6},100980]
[{"$nulls":6},100981]
[{"$nulls":6},100982]
[{"$nulls":6},100983]
[{"$nulls":6},100984]
[{"$nulls":6},100985]
[{"$nulls":6},100986]
[{"$nulls":6},100987]
[{"$nulls":6},100988]
[{"$nulls":6},100989]
[{"$nulls":6},100990]
[{"$nulls":6},100991]
[{"$nulls":6},100992]
[{"$nulls":6},100993]
[{"$nulls":6},100994]
[{"$nulls":6},100995]
[{"$nulls":6},100996]
[{"$nulls":6},100997]
[{"$nulls":6},100998]
[{"$nulls":6},100999]
[{"$nulls":6},101000]
[{"$nulls":6},101001]
[{"$nulls":6},101002]
[{"$nulls":6},101003]
[{"$nulls":6},101004]
[{"$nulls":6},101005]
[{"$nulls":6},101006]
[{"$nulls":6},101007]
[{"$nulls":6},101008]
[{"$nulls":6},101009]
[{"$nulls":6},101010]
[{"$nulls":6},101013]
[{"$nulls":6},101014]
[{"$nulls":6},101015]
[{"$nulls":6},101016]
[{"$nulls":6},101017]
[{"$nulls":6},101018]
[{"$nulls":6},101463]
[{"$nulls":6},101464]
[{"$nulls":6},101465]
[{"$nulls":6},101466]
[{"$nulls":6},101467]
[{"$nulls":6},101468]
[{"$nulls":6},101469]
[{"$nulls":6},101470]
[{"$nulls":6},101471]
[{"$nulls":6},101472]
[{"$nulls":6},101473]
[{"$nulls":6},101474]
[{"$nulls":6},101475]
[{"$nulls":6},101476]
[{"$nulls":6},101477]
[{"$nulls":6},101478]
[{"$nulls":6},101480]
[{"$nulls":6},101481]
[{"$nulls":6},101482]
[{"$nulls":6},101483]
[{"$nulls":6},101484]
[{"$nulls":6},101485]
[{"$nulls":6},101486]
[{"$nulls":6},101487]
[{"$nulls":6},101488]
[{"$nulls":6},101188]
[{"$nulls":6},101189]
[{"$nulls":6},101190]
[{"$nulls":6},101191]
[{"$nulls":6},101192]
[{"$nulls":6},101193]
[{"$nulls":6},101194]
[{"$nulls":6},101197]
[{"$nulls":6},101198]
[{"$nulls":6},101199]
[{"$nulls":6},101200]
[{"$nulls":6},101201]
[{"$nulls":6},101202]
[{"$nulls":6},101203]
[{"$nulls":6},101204]
[{"$nulls":6},101205]
[{"$nulls":6},102362]
[{"$nulls":6},102363]
[{"$nulls":6},102364]
[{"$nulls":6},98509]
[{"$nulls":6},98510]
[{"$nulls":6},98511]
[{"$nulls":6},98516]
[{"$nulls":6},98519]
[{"$nulls":6},98520]
[{"$nulls":6},98521]
[{"$nulls":6},98522]
[{"$nulls":6},98524]
[{"$nulls":6},98503]
[{"$nulls":6},98504]
[{"$nulls":6},98505]
[{"$nulls":6},103946]
[{"$nulls":6},105000]
[{"$nulls":6},105001]
[{"$nulls":6},105002]
[{"$nulls":6},105003]
[{"$nulls":6},105004]
[{"$nulls":6},105005]
[{"$nulls":6},103185]
[{"$nulls":6},103186]
[{"$nulls":6},103187]
[{"$nulls":6},103188]
[{"$nulls":6},103189]
[{"$nulls":6},103190]
[{"$nulls":6},103191]
[{"$nulls":6},103192]
[{"$nulls":6},103193]
[{"$nulls":6},103194]
[{"$nulls":6},103195]
[{"$nulls":6},103205]
[{"$nulls":6},103206]
[{"$nulls":6},103207]
[{"$nulls":6},103208]
[{"$nulls":6},103209]
[{"$nulls":6},103210]
[{"$nulls":6},103304]
[{"$nulls":6},103307]
[{"$nulls":6},103310]
[{"$nulls":6},103314]
[{"$nulls":6},103315]
[{"$nulls":6},103769]
[{"$nulls":6},98525]
[{"$nulls":6},98526]
[{"$nulls":6},98527]
[{"$nulls":6},98528]
[{"$nulls":6},98529]
[{"$nulls":6},98530]
[{"$nulls":6},98531]
[{"$nulls":6},98532]
[{"$nulls":6},98533]
[{"$nulls":6},98534]
[{"$nulls":6},98535]
[{"$nulls":6},88238]
[{"$nulls":6},88239]
[{"$nulls":6},88240]
[{"$nulls":6},88241]
[{"$nulls":6},88242]
[{"$nulls":6},88243]
[{"$nulls":6},88245]
[{"$nulls":6},88246]
[{"$nulls":6},88247]
[{"$nulls":6},88248]
[{"$nulls":6},88249]
[{"$nulls":6},88250]
[{"$nulls":6},88251]
[{"$nulls":6},88252]
[{"$nulls":6},88253]
[{"$nulls":6},88255]
[{"$nulls":6},88256]
[{"$nulls":6},88257]
[{"$nulls":6},88260]
[{"$nulls":6},88261]
[{"$nulls":6},88262]
[{"$nulls":6},88263]
[{"$nulls":6},88264]
[{"$nulls":6},88266]
[{"$nulls":6},88267]
[{"$nulls":6},88269]
[{"$nulls":6},88270]
[{"$nulls":6},88272]
[{"$nulls":6},88273]
[{"$nulls":6},88274]
[{"$nulls":6},88275]
[{"$nulls":6},88277]
[{"$nulls":6},88278]
[{"$nulls":6},88279]
[{"$nulls":6},88281]
[{"$nulls":6},88282]
[{"$nulls":6},88283]
[{"$nulls":6},88284]
[{"$nulls":6},88286]
[{"$nulls":6},88288]
[{"$nulls":6},88291]
[{"$nulls":6},88292]
[{"$nulls":6},88293]
[{"$nulls":6},88294]
[{"$nulls":6},88295]
[{"$nulls":6},88296]
[{"$nulls":6},88297]
[{"$nulls":6},88298]
[{"$nulls":6},88299]
[{"$nulls":6},88300]
[{"$nulls":6},88301]
[{"$nulls":6},88302]
[{"$nulls":6},88303]
[{"$nulls":6},88304]
[{"$nulls":6},88306]
[{"$nulls":6},88307]
[{"$nulls":6},88308]
[{"$nulls":6},88309]
[{"$nulls":6},88310]
[{"$nulls":6},88311]
[{"$nulls":6},88312]
[{"$nulls":6},88313]
[{"$nulls":6},88314]
[{"$nulls":6},88315]
[{"$nulls":6},88316]
[{"$nulls":6},88317]
[{"$nulls":6},88318]
[{"$nulls":6},88321]
[{"$nulls":6},88322]
[{"$nulls":6},88323]
[{"$nulls":6},88324]
[{"$nulls":6},88325]
[{"$nulls":6},88377]
[{"$nulls":6},88441]
[{"$nulls":6},90766]
[{"$nulls":6},90767]
[{"$nulls":6},90768]
[{"$nulls":6},90769]
[{"$nulls":6},90770]
[{"$nulls":6},90772]
[{"$nulls":6},90775]
[{"$nulls":6},90776]
[{"$nulls":6},90777]
[{"$nulls":6},90778]
[{"$nulls":6},90779]
[{"$nulls":6},90780]
[{"$nulls":6},90781]
[{"$nulls":6},93558]
[{"$nulls":6},93561]
[{"$nulls":6},93563]
[{"$nulls":6},93564]
[{"$nulls":6},93565]
[{"$nulls":6},93566]
[{"$nulls":6},93567]
[{"$nulls":6},93568]
[{"$nulls":6},93569]
[{"$nulls":6},93570]
[{"$nulls":6},93571]
[{"$nulls":6},93572]
[{"$nulls":6},94295]
[{"$nulls":6},94296]
[{"$nulls":6},95308]
[{"$nulls":6},95309]
[{"$nulls":6},95310]
[{"$nulls":6},95311]
[{"$nulls":6},95312]
[{"$nulls":6},95313]
[{"$nulls":6},95314]
[{"$nulls":6},95315]
[{"$nulls":6},95316]
[{"$nulls":6},95317]
[{"$nulls":6},95318]
[{"$nulls":6},95319]
[{"$nulls":6},95320]
[{"$nulls":6},95321]
[{"$nulls":6},95322]
[{"$nulls":6},95323]
[{"$nulls":6},95324]
[{"$nulls":6},95325]
[{"$nulls":6},95328]
[{"$nulls":6},95329]
[{"$nulls":6},95330]
[{"$nulls":6},95331]
[{"$nulls":6},95332]
[{"$nulls":6},95334]
[{"$nulls":6},95335]
[{"$nulls":6},95337]
[{"$nulls":6},95338]
[{"$nulls":6},95339]
[{"$nulls":6},95340]
[{"$nulls":6},95341]
[{"$nulls":6},95342]
[{"$nulls":6},95343]
[{"$nulls":6},95344]
[{"$nulls":6},95345]
[{"$nulls":6},95346]
[{"$nulls":6},95347]
[{"$nulls":6},95348]
[{"$nulls":6},95349]
[{"$nulls":6},95351]
[{"$nulls":6},95352]
[{"$nulls":6},95354]
[{"$nulls":6},95355]
[{"$nulls":6},95356]
[{"$nulls":6},95357]
[{"$nulls":6},95358]
[{"$nulls":6},95359]
[{"$nulls":6},95360]
[{"$nulls":6},95361]
[{"$nulls":6},95362]
[{"$nulls":6},95363]
[{"$nulls":6},95364]
[{"$nulls":6},95365]
[{"$nulls":6},95366]
[{"$nulls":6},95367]
[{"$nulls":6},95368]
[{"$nulls":6},95369]
[{"$nulls":6},95370]
[{"$nulls":6},95371]
[{"$nulls":6},95372]
[{"$nulls":6},95373]
[{"$nulls":6},95374]
[{"$nulls":6},95375]
[{"$nulls":6},95376]
[{"$nulls":6},95377]
[{"$nulls":6},95378]
[{"$nulls":6},95379]
[{"$nulls":6},95380]
[{"$nulls":6},95383]
[{"$nulls":6},95384]
[{"$nulls":6},95385]
[{"$nulls":6},95386]
[{"$nulls":6},95387]
[{"$nulls":6},95389]
[{"$nulls":6},95390]
[{"$nulls":6},95392]
[{"$nulls":6},95393]
[{"$nulls":6},95394]
[{"$nulls":6},95395]
[{"$nulls":6},95396]
[{"$nulls":6},95398]
[{"$nulls":6},95400]
[{"$nulls":6},95401]
[{"$nulls":6},95402]
[{"$nulls":6},95403]
[{"$nulls":6},95404]
[{"$nulls":6},95405]
[{"$nulls":6},95406]
[{"$nulls":6},95408]
[{"$nulls":6},95411]
[{"$nulls":6},95413]
[{"$nulls":6},95414]
[{"$nulls":6},95415]
[{"$nulls":6},95416]
[{"$nulls":6},95417]
[{"$nulls":6},95418]
[{"$nulls":6},95419]
[{"$nulls":6},95420]
[{"$nulls":6},95421]
[{"$nulls":6},95422]
[{"$nulls":6},95423]
[{"$nulls":6},95424]
[{"$nulls":6},100288]
[{"$nulls":6},100289]
[{"$nulls":6},100291]
[{"$nulls":6},100293]
[{"$nulls":6},100295]
[{"$nulls":6},100298]
[{"$nulls":6},100299]
[{"$nulls":6},100301]
[{"$nulls":6},100303]
[{"$nulls":6},100307]
[{"$nulls":6},100308]
[{"$nulls":6},100309]
[{"$nulls":6},100315]
[{"$nulls":6},100321]
[{"$nulls":6},100533]
[{"$nulls":6},100534]
[{"$nulls":6},100535]
[{"$nulls":6},100536]
[{"$nulls":6},101286]
[{"$nulls":6},101287]
[{"$nulls":6},101288]
[{"$nulls":6},101289]
[{"$nulls":6},101290]
[{"$nulls":6},101291]
[{"$nulls":6},101292]
[{"$nulls":6},101293]
[{"$nulls":6},101294]
[{"$nulls":6},101295]
[{"$nulls":6},101296]
[{"$nulls":6},101297]
[{"$nulls":6},101298]
[{"$nulls":6},101299]
[{"$nulls":6},101300]
[{"$nulls":6},101301]
[{"$nulls":6},101302]
[{"$nulls":6},101303]
[{"$nulls":6},101304]
[{"$nulls":6},101305]
[{"$nulls":6},101307]
[{"$nulls":6},101308]
[{"$nulls":6},101309]
[{"$nulls":6},101310]
[{"$nulls":6},101311]
[{"$nulls":6},101312]
[{"$nulls":6},101313]
[{"$nulls":6},101315]
[{"$nulls":6},101316]
[{"$nulls":6},101320]
[{"$nulls":6},101322]
[{"$nulls":6},101323]
[{"$nulls":6},101324]
[{"$nulls":6},101325]
[{"$nulls":6},101326]
[{"$nulls":6},101328]
[{"$nulls":6},101329]
[{"$nulls":6},101330]
[{"$nulls":6},101331]
[{"$nulls":6},101332]
[{"$nulls":6},101333]
[{"$nulls":6},101334]
[{"$nulls":6},101336]
[{"$nulls":6},101337]
[{"$nulls":6},101338]
[{"$nulls":6},101339]
[{"$nulls":6},101340]
[{"$nulls":6},101341]
[{"$nulls":6},101342]
[{"$nulls":6},101343]
[{"$nulls":6},101344]
[{"$nulls":6},101345]
[{"$nulls":6},101346]
[{"$nulls":6},101347]
[{"$nulls":6},101348]
[{"$nulls":6},101349]
[{"$nulls":6},101350]
[{"$nulls":6},101351]
[{"$nulls":6},101352]
[{"$nulls":6},101353]
[{"$nulls":6},101355]
[{"$nulls":6},101356]
[{"$nulls":6},101357]
[{"$nulls":6},101358]
[{"$nulls":6},101359]
[{"$nulls":6},101360]
[{"$nulls":6},101361]
[{"$nulls":6},101363]
[{"$nulls":6},101364]
[{"$nulls":6},101365]
[{"$nulls":6},101366]
[{"$nulls":6},101368]
[{"$nulls":6},101369]
[{"$nulls":6},101370]
[{"$nulls":6},101371]
[{"$nulls":6},101372]
[{"$nulls":6},101374]
[{"$nulls":6},101375]
[{"$nulls":6},101376]
[{"$nulls":6},101377]
[{"$nulls":6},101378]
[{"$nulls":6},101379]
[{"$nulls":6},101380]
[{"$nulls":6},101381]
[{"$nulls":6},101382]
[{"$nulls":6},101383]
[{"$nulls":6},101384]
[{"$nulls":6},101385]
[{"$nulls":6},101386]
[{"$nulls":6},101387]
[{"$nulls":6},101388]
[{"$nulls":6},101389]
[{"$nulls":6},101390]
[{"$nulls":6},101391]
[{"$nulls":6},101392]
[{"$nulls":6},101394]
[{"$nulls":6},101395]
[{"$nulls":6},101396]
[{"$nulls":6},101397]
[{"$nulls":6},101398]
[{"$nulls":6},101399]
[{"$nulls":6},101401]
[{"$nulls":6},101402]
[{"$nulls":6},101407]
[{"$nulls":6},101408]
[{"$nulls":6},101409]
[{"$nulls":6},101410]
[{"$nulls":6},101412]
[{"$nulls":6},101413]
[{"$nulls":6},101414]
[{"$nulls":6},101415]
[{"$nulls":6},101416]
[{"$nulls":6},101417]
[{"$nulls":6},101418]
[{"$nulls":6},101419]
[{"$nulls":6},101420]
[{"$nulls":6},101421]
[{"$nulls":6},101422]
[{"$nulls":6},101424]
[{"$nulls":6},101425]
[{"$nulls":6},101426]
[{"$nulls":6},101427]
[{"$nulls":6},101428]
[{"$nulls":6},101429]
[{"$nulls":6},101430]
[{"$nulls":6},101431]
[{"$nulls":6},101432]
[{"$nulls":6},101433]
[{"$nulls":6},101434]
[{"$nulls":6},101435]
[{"$nulls":6},101436]
[{"$nulls":6},101437]
[{"$nulls":6},101438]
[{"$nulls":6},101439]
[{"$nulls":6},101440]
[{"$nulls":6},101441]
[{"$nulls":6},101443]
[{"$nulls":6},101444]
[{"$nulls":6},101445]
[{"$nulls":6},101446]
[{"$nulls":6},101447]
[{"$nulls":6},101448]
[{"$nulls":6},101449]
[{"$nulls":6},101451]
[{"$nulls":6},101452]
[{"$nulls":6},101453]
[{"$nulls":6},101454]
[{"$nulls":6},101456]
[{"$nulls":6},101457]
[{"$nulls":6},101458]
[{"$nulls":6},101459]
[{"$nulls":6},101460]

{"sheet":"6.SALINAS","index":5,"n_rows":7543,"n_cols":30,"rows_kept":7543,"cut":false,"hidden":false,"merged":[[1,1,3,11],[4,1,4,13],[5,1,8,1],[5,2,8,2],[5,3,8,3],[5,4,8,7],[6,9,7,9],[6,12,8,12],[6,13,8,13],[20,4,20,7],[9,4,9,7],[10,4,10,7],[11,4,11,7],[12,4,12,7],[13,4,13,7],[14,4,14,7],[15,4,15,7],[16,4,16,7],[17,4,17,7],[18,4,18,7],[19,4,19,7],[32,4,32,7],[21,4,21,7],[22,4,22,7],[23,4,23,7],[24,4,24,7],[25,4,25,7],[26,4,26,7],[27,4,27,7],[28,4,28,7],[29,4,29,7],[30,4,30,7],[31,4,31,7],[48,4,48,7],[33,4,33,7],[34,4,34,7],[35,4,35,7],[36,4,36,7],[37,4,37,7],[38,4,38,7],[40,4,40,7],[41,4,41,7],[42,4,42,7],[44,4,44,7],[46,4,46,7],[55,4,55,7],[56,4,56,7],[57,1,57,12],[49,4,49,7],[50,4,50,7],[51,4,51,7],[52,4,52,7],[53,4,53,7],[54,4,54,7]]}
[]
[null,"LOGOTIPO DA EMPRESA"]
[]
[{"$nulls":12},"Data Base do Orçamento","2024-08-01"]
[null,"CONTRATAÇÃO DE SERVIÇOS DE PAVIMENTAÇÃO ASFÁLTICA COM CONCRETO BETUMINOSO USINADO A QUENTE (CBUQ) EM VIAS URBANAS E RURAIS INSERIDAS NA ÁREA DE ATUAÇÃO DA 1ª SUPERINTENDÊNCIA REGIONAL DA CODEVASF, NO ESTADO DE MINAS GERAIS - ITEM 6: SALINAS/MG"]
[null,"ITEM","ORIGEM\nCOMPOSIÇÃO","CÓDIGO\nCOMPOSIÇÃO","DISCRIMINAÇÃO DOS SERVIÇOS",null,null,null,"BDI % = ",{"$f":"BDI!C17","v":0},"BDI  DIFERENCIADO% =",{"$f":"BDI!C33","v":0},"R$/m²",{"$f":"N58/I8","v":0},{"$f":"N58","v":0}]
[{"$nulls":8},"Total de m²","Encargos Sociais:","Horista","Mensalista","PREÇO UNITÁRIO COM BDI","PREÇO TOTAL COM BDI "]
[{"$nulls":8},63000,null,{"$f":"'ENC.SOC.'!$E$51","v":0},{"$f":"'ENC.SOC.'!$F$51","v":0}]
[{"$nulls":8},"UND","QTDE.","BDI","PREÇO UNITÁRIO "]
[{"$nulls":4},"MOBILIZAÇÃO/DESMOBILIZAÇÃO"]
[null,1,"Codevasf","Mob","Mobilização",null,null,null,"kmxfrente",540,{"$f":"(M11/L11-1)","v":{"$error":"#DIV/0!"}},null,{"$f":"L11*(1+$J$6)","v":0},{"$f":"M11*J11","v":0},{"$f":"N11/$N$58","v":{"$error":"#DIV/0!"}}]
[null,2,"Codevasf","Mob","Desmobilização",null,null,null,"kmxfrente",540,{"$f":"(M12/L12-1)","v":{"$error":"#DIV/0!"}},null,{"$f":"L12*(1+$J$6)","v":0},{"$f":"M12*J12","v":0},{"$f":"N12/$N$58","v":{"$error":"#DIV/0!"}}]
[{"$nulls":4},"INSTALAÇÃO DE CANTEIRO"]
[null,3,"Codevasf","Canteiro","Canteiro de Obras e Almoxarifado",null,null,null,"frente",6,{"$f":"(M14/L14-1)","v":{"$error":"#DIV/0!"}},null,{"$f":"L14*(1+$J$6)","v":0},{"$f":"ROUND(ROUND(J14,2)*ROUND(M14,6),2)","v":0},{"$f":"N14/N58","v":{"$error":"#DIV/0!"}}]
[null,4,"SINAPI",103689,{"$f":"VLOOKUP(D15,'[203]COMP Sint. Sinapi'!G$7:L$7526,2,0)","v":"FORNECIMENTO E INSTALAÇÃO DE PLACA DE OBRA COM CHAPA GALVANIZADA E ESTRUTURA DE MADEIRA"},null,null,null,"m²",96,{"$f":"(M15/L15-1)","v":{"$error":"#DIV/0!"}},null,0,{"$f":"ROUND(ROUND(J15,2)*ROUND(M15,6),2)","v":0}]
[{"$nulls":4},"ADMINISTRAÇÃO LOCAL DA OBRA"]
[null,5,"Codevasf","Adm Local","Administração Local da Obra",null,null,null,"und",1,{"$f":"(M17/L17-1)","v":{"$error":"#DIV/0!"}},null,{"$f":"L17*(1+$J$6)","v":0},{"$f":"ROUND(ROUND(J17,2)*ROUND(M17,6),2)","v":0},{"$f":"N17/N58","v":{"$error":"#DIV/0!"}}]
[{"$nulls":4},"TERRAPLANAGEM"]
[null,6,"SICRO",5502114,{"$f":"VLOOKUP(D19,'[203]SINTÉTICO SICRO'!$A$4:$D$1048576,2,0)","v":"Escavação, carga e transporte de material de 1ª categoria - DMT de 1.000 a 1.200 m - caminho de serviço em leito natural - com escavadeira e caminhão basculante de 14 m³"},null,null,null,"m³",22050,{"$f":"M19/L19-1","v":{"$error":"#DIV/0!"}},null,{"$f":"L19*(1+$J$6)","v":0},{"$f":"ROUND(ROUND(J19,2)*ROUND(M19,6),2)","v":0}]
[null,7,"SICRO",4413942,{"$f":"VLOOKUP(D20,'[203]SINTÉTICO SICRO'!$A$4:$D$1048576,2,0)","v":"Espalhamento de material em bota-fora"},null,null,null,"m³",22050,{"$error":"#DIV/0!"},null,0,0,{"$nulls":15},1]
[{"$nulls":4},"PAVIMENTAÇÃO"]
[null,8,"SICRO",4011463,{"$f":"VLOOKUP(D22,'[203]SINTÉTICO SICRO'!$A$4:$D$1048576,2,0)","v":"Concreto asfáltico - faixa C - areia e brita comerciais"},null,null,null,"t",7560,{"$f":"M22/L22-1","v":{"$error":"#DIV/0!"}},null,{"$f":"L22*(1+$J$6)","v":0},{"$f":"ROUND(ROUND(J22,2)*ROUND(M22,6),2)","v":0}]
[null,9,"SICRO",4011352,{"$f":"VLOOKUP(D23,'[203]SINTÉTICO SICRO'!$A$4:$D$1048576,2,0)","v":"Imprimação com emulsão asfáltica"},null,null,null,"m²",63000,{"$error":"#DIV/0!"},null,0,0]
[null,10,"SICRO",4011353,{"$f":"VLOOKUP(D24,'[203]SINTÉTICO SICRO'!$A$4:$D$1048576,2,0)","v":"Pintura de ligação"},null,null,null,"m²",63000,{"$error":"#DIV/0!"},null,0,0]
[null,11,"SICRO",4011268,{"$f":"VLOOKUP(D25,'[203]SINTÉTICO SICRO'!$A$4:$D$1048576,2,0)","v":"Base estabilizada granulometricamente com mistura solo brita (70% - 30%) em usina com material de jazida e brita comercial"},null,null,null,"m³",9450,{"$error":"#DIV/0!"},null,0,0]
[null,12,"SICRO",4011228,{"$f":"VLOOKUP(D26,'[203]SINTÉTICO SICRO'!$A$4:$D$1048576,2,0)","v":"Sub-base estabilizada granulometricamente com mistura de solos na pista com material de jazida"},null,null,null,"m³",9450,{"$error":"#DIV/0!"},null,0,0]
[null,13,"SICRO",4011209,{"$f":"VLOOKUP(D27,'[203]SINTÉTICO SICRO'!$A$4:$D$1048576,2,0)","v":"Regularização do subleito"},null,null,null,"m²",63000,{"$error":"#DIV/0!"},null,0,0]
[{"$nulls":4},"AQUISIÇÃO E TRANSPORTE DO MATERIAL BETUMINOSO"]
[null,14,"CODEVASF","CPU-13","AQUISIÇÃO DE CIMENTO ASFALTICO CAP 50/70",null,null,null,"t",487.54,{"$f":"M29/L29-1","v":{"$error":"#DIV/0!"}},null,{"$f":"L29*(1+$L$6)","v":0},{"$f":"ROUND(ROUND(J29,2)*ROUND(M29,6),2)","v":0}]
[null,15,"CODEVASF","CPU-17","TRANSPORTE CAP 50/70",null,null,null,"t",487.54,{"$error":"#DIV/0!"},null,{"$f":"L30*(1+$L$6)","v":0},0]
[null,16,"CODEVASF","CPU-14","AQUISIÇÃO DE EAI",null,null,null,"t",81.900000000000006,{"$error":"#DIV/0!"},null,0,0]
[null,17,"CODEVASF","CPU-18","TRANSPORTE DE EAI",null,null,null,"t",81.900000000000006,{"$error":"#DIV/0!"},null,0,0]
[null,18,"CODEVASF","CPU-15","AQUISIÇÃO DE EMULSÃO ASFÁLTICA RR-1C",null,null,null,"t",28.35,{"$error":"#DIV/0!"},null,0,0]
[null,19,"CODEVASF","CPU-19","TRANSPORTE RR-1C",null,null,null,"t",28.35,{"$error":"#DIV/0!"},null,0,0]
[{"$nulls":4},"SINALIZAÇÃO"]
[null,20,"SICRO",5213440,{"$f":"VLOOKUP(D36,'[203]SINTÉTICO SICRO'!$A$4:$D$1048576,2,0)","v":"Placa de regulamentação em aço D = 0,60 m - película retrorrefletiva tipo I + SI - fornecimento e implantação"},null,null,null,"und",27,{"$f":"M36/L36-1","v":{"$error":"#DIV/0!"}},null,{"$f":"L36*(1+$J$6)","v":0},{"$f":"ROUND(ROUND(J36,2)*ROUND(M36,6),2)","v":0}]
[null,21,"SICRO",5213464,{"$f":"VLOOKUP(D37,'[203]SINTÉTICO SICRO'!$A$4:$D$1048576,2,0)","v":"Placa de advertência em aço, lado de 0,60 m - película retrorrefletiva tipo I + SI - fornecimento e implantação"},null,null,null,"und",27,{"$error":"#DIV/0!"},null,0,0]
[null,22,"SICRO",5213863,{"$f":"VLOOKUP(D38,'[203]SINTÉTICO SICRO'!$A$4:$D$1048576,2,0)","v":"Suporte metálico galvanizado para placa de advertência ou regulamentação - lado ou diâmetro de 0,60 m - fornecimento e implantação"},null,null,null,"und",54,{"$error":"#DIV/0!"},null,0,0]
[null,23,"SICRO",5213400,{"$f":"VLOOKUP(D39,'[203]SINTÉTICO SICRO'!$A$4:$D$1048576,2,0)","v":"Pintura de faixa com tinta acrílica - espessura de 0,4 mm"},null,null,null,"m²",2520,{"$error":"#DIV/0!"},null,0,0]
[{"$nulls":4},"DRENAGEM"]
[null,24,"SINAPI",94273,{"$f":"VLOOKUP(D41,'[203]COMP Sint. Sinapi'!G$7:L$7526,2,0)","v":"ASSENTAMENTO DE GUIA (MEIO-FIO) EM TRECHO RETO, CONFECCIONADA EM CONCRETO PRÉ-FABRICADO, DIMENSÕES 100X15X13X30 CM (COMPRIMENTO X BASE INFERIOR X BASE SUPERIOR X ALTURA)"},null,null,null,"m",18000,{"$f":"M41/L41-1","v":{"$error":"#DIV/0!"}},null,{"$f":"L41*(1+$J$6)","v":0},{"$f":"ROUND(ROUND(J41,2)*ROUND(M41,6),2)","v":0}]
[null,25,"SINAPI",94287,{"$f":"VLOOKUP(D42,'[203]COMP Sint. Sinapi'!G$7:L$7526,2,0)","v":"EXECUÇÃO DE SARJETA DE CONCRETO USINADO, MOLDADA  IN LOCO  EM TRECHO RETO, 30 CM BASE X 10 CM ALTURA"},null,null,null,"m",18000,{"$f":"M42/L42-1","v":{"$error":"#DIV/0!"}},null,0,{"$f":"ROUND(ROUND(J42,2)*ROUND(M42,6),2)","v":0}]
[null,26,"SICRO",4915724,{"$f":"VLOOKUP(D43,'[203]SINTÉTICO SICRO'!$A$4:$D$1048576,2,0)","v":"Caiação mecanizada com fixador de cal"},null,null,null,"m²",2160,{"$f":"(M43/L43-1)","v":{"$error":"#DIV/0!"}},null,0,{"$f":"ROUND(ROUND(J43,2)*ROUND(M43,6),2)","v":0},{"$nulls":10},4514640]
[{"$nulls":4},"SERVIÇOS COMPLEMENTARES"]
[null,27,"Codevasf","CPU-12","Conserto de quebra no ramal na rua sem pavimento com fornecimento de material hidráulico",null,null,null,"m",900,{"$f":"M45/L45-1","v":{"$error":"#DIV/0!"}},null,{"$f":"L45*(1+$J$6)","v":0},{"$f":"ROUND(ROUND(J45,2)*ROUND(M45,6),2)","v":0}]
[{"$nulls":4},"PROJETO EXECUTIVO"]
[null,28,"Codevasf","Composição Própria","Projeto Executivo",null,null,null,"m²",63000,{"$f":"M47/L47-1","v":{"$error":"#DIV/0!"}},null,{"$f":"L47*(1+$J$6)","v":0},{"$f":"ROUND(ROUND(J47,2)*ROUND(M47,6),2)","v":0}]
[{"$nulls":4},"MOMENTO DE TRANSPORTE"]
[null,29,"SICRO",5914359,{"$f":"VLOOKUP(D49,'[203]SINTÉTICO SICRO'!$A$4:$D$1048576,2,0)","v":"Transporte com caminhão basculante de 10 m³ - rodovia em leito natural"},null,null,null,"tkm",112864.29,{"$f":"M49/L49-1","v":{"$error":"#DIV/0!"}},null,{"$f":"L49*(1+$J$6)","v":0},{"$f":"ROUND(ROUND(J49,2)*ROUND(M49,6),2)","v":0}]
[null,30,"SICRO",5914374,{"$f":"VLOOKUP(D50,'[203]SINTÉTICO SICRO'!$A$4:$D$1048576,2,0)","v":"Transporte com caminhão basculante de 10 m³ - rodovia em revestimento primário"},null,null,null,"tkm",112864.29,{"$error":"#DIV/0!"},null,0,0]
[null,31,"SICRO",5914389,{"$f":"VLOOKUP(D51,'[203]SINTÉTICO SICRO'!$A$4:$D$1048576,2,0)","v":"Transporte com caminhão basculante de 10 m³ - rodovia pavimentada"},null,null,null,"tkm",902914.68,{"$error":"#DIV/0!"},null,0,0]
[null,32,"SICRO",5914449,{"$f":"VLOOKUP(D52,'[203]SINTÉTICO SICRO'!$A$4:$D$1048576,2,0)","v":"Transporte com caminhão carroceria de 15 t - rodovia em leito natural"},null,null,null,"tkm",1103.27,{"$error":"#DIV/0!"},null,0,0]
[null,33,"SICRO",5914464,{"$f":"VLOOKUP(D53,'[203]SINTÉTICO SICRO'!$A$4:$D$1048576,2,0)","v":"Transporte com caminhão carroceria de 15 t - rodovia em revestimento primário"},null,null,null,"tkm",1103.27,{"$error":"#DIV/0!"},null,0,0]
[null,34,"SICRO",5914479,{"$f":"VLOOKUP(D54,'[203]SINTÉTICO SICRO'!$A$4:$D$1048576,2,0)","v":"Transporte com caminhão carroceria de 15 t - rodovia pavimentada"},null,null,null,"tkm",8826.16,{"$error":"#DIV/0!"},null,0,0]
[null,35,"SICRO",5914364,{"$f":"VLOOKUP(D55,'[203]SINTÉTICO SICRO'!$A$4:$D$1048576,2,0)","v":"Transporte de cimento ou cal hidratada a granel com caminhão silo de 30 m³ - rodovia em leito natural"},null,null,null,"tkm",467.39,{"$error":"#DIV/0!"},null,0,0]
[null,36,"SICRO",5914365,{"$f":"VLOOKUP(D56,'[203]SINTÉTICO SICRO'!$A$4:$D$1048576,2,0)","v":"Transporte de cimento ou cal hidratada a granel com caminhão silo de 30 m³ - rodovia em revestimento primário"},null,null,null,"tkm",467.39,{"$error":"#DIV/0!"},null,0,0]
[null,37,"SICRO",5914366,{"$f":"VLOOKUP(D57,'[203]SINTÉTICO SICRO'!$A$4:$D$1048576,2,0)","v":"Transporte de cimento ou cal hidratada a granel com caminhão silo de 30 m³ - rodovia pavimentada"},null,null,null,"tkm",3739.12,{"$f":"M57/L57-1","v":{"$error":"#DIV/0!"}},null,0,{"$f":"ROUND(ROUND(J57,2)*ROUND(M57,6),2)","v":0},{"$f":"SUM(N49:N57)/N58","v":{"$error":"#DIV/0!"}}]
[null,"VALOR TOTAL DO SRP",{"$nulls":11},{"$f":"SUM(N11:N57)","v":0}]
[null,"Obs.: Os valores estão apresentados com apenas 2 casas decimais, mas os valores da presente planilha foram calculados utilizando a precisão de 6 casas decimais. "]
[{"$nulls":13},{"$f":"(N58/#REF!)/2000000","v":{"$error":"#REF!"}}]
{"$rows_empty":6598}
[{"$nulls":6},87354]
[{"$nulls":6},87355]
[{"$nulls":6},87356]
[{"$nulls":6},87357]
[{"$nulls":6},87358]
[{"$nulls":6},87359]
[{"$nulls":6},87360]
[{"$nulls":6},87361]
[{"$nulls":6},87362]
[{"$nulls":6},87363]
[{"$nulls":6},87364]
[{"$nulls":6},87365]
[{"$nulls":6},87366]
[{"$nulls":6},87367]
[{"$nulls":6},87368]
[{"$nulls":6},87369]
[{"$nulls":6},87370]
[{"$nulls":6},87371]
[{"$nulls":6},87372]
[{"$nulls":6},87373]
[{"$nulls":6},87374]
[{"$nulls":6},87375]
[{"$nulls":6},87376]
[{"$nulls":6},87377]
[{"$nulls":6},87378]
[{"$nulls":6},87379]
[{"$nulls":6},87380]
[{"$nulls":6},87381]
[{"$nulls":6},87382]
[{"$nulls":6},87383]
[{"$nulls":6},87384]
[{"$nulls":6},87385]
[{"$nulls":6},87386]
[{"$nulls":6},87387]
[{"$nulls":6},87388]
[{"$nulls":6},87389]
[{"$nulls":6},87390]
[{"$nulls":6},87391]
[{"$nulls":6},87393]
[{"$nulls":6},87394]
[{"$nulls":6},87395]
[{"$nulls":6},87396]
[{"$nulls":6},87397]
[{"$nulls":6},87398]
[{"$nulls":6},87399]
[{"$nulls":6},87401]
[{"$nulls":6},87402]
[{"$nulls":6},87404]
[{"$nulls":6},87405]
[{"$nulls":6},87407]
[{"$nulls":6},87408]
[{"$nulls":6},87410]
[{"$nulls":6},88626]
[{"$nulls":6},88627]
[{"$nulls":6},88628]
[{"$nulls":6},88629]
[{"$nulls":6},88630]
[{"$nulls":6},88631]
[{"$nulls":6},88715]
[{"$nulls":6},95563]
[{"$nulls":6},100464]
[{"$nulls":6},100465]
[{"$nulls":6},100466]
[{"$nulls":6},100468]
[{"$nulls":6},100469]
[{"$nulls":6},100470]
[{"$nulls":6},100472]
[{"$nulls":6},100473]
[{"$nulls":6},100474]
[{"$nulls":6},100475]
[{"$nulls":6},100477]
[{"$nulls":6},100478]
[{"$nulls":6},100479]
[{"$nulls":6},100480]
[{"$nulls":6},100481]
[{"$nulls":6},100483]
[{"$nulls":6},100484]
[{"$nulls":6},100485]
[{"$nulls":6},100486]
[{"$nulls":6},100487]
[{"$nulls":6},100488]
[{"$nulls":6},100489]
[{"$nulls":6},100490]
[{"$nulls":6},100491]
[{"$nulls":6},100492]
[{"$nulls":6},92121]
[{"$nulls":6},92122]
[{"$nulls":6},92123]
[{"$nulls":6},100195]
[{"$nulls":6},100196]
[{"$nulls":6},100197]
[{"$nulls":6},100198]
[{"$nulls":6},100199]
[{"$nulls":6},100200]
[{"$nulls":6},100201]
[{"$nulls":6},100202]
[{"$nulls":6},100203]
[{"$nulls":6},100204]
[{"$nulls":6},100205]
[{"$nulls":6},100206]
[{"$nulls":6},100207]
[{"$nulls":6},100208]
[{"$nulls":6},100209]
[{"$nulls":6},100210]
[{"$nulls":6},100211]
[{"$nulls":6},100212]
[{"$nulls":6},100213]
[{"$nulls":6},100214]
[{"$nulls":6},100215]
[{"$nulls":6},100216]
[{"$nulls":6},100217]
[{"$nulls":6},100218]
[{"$nulls":6},100219]
[{"$nulls":6},100220]
[{"$nulls":6},100221]
[{"$nulls":6},100222]
[{"$nulls":6},100223]
[{"$nulls":6},100224]
[{"$nulls":6},100225]
[{"$nulls":6},100226]
[{"$nulls":6},100227]
[{"$nulls":6},100228]
[{"$nulls":6},100229]
[{"$nulls":6},100230]
[{"$nulls":6},100231]
[{"$nulls":6},100232]
[{"$nulls":6},100233]
[{"$nulls":6},100234]
[{"$nulls":6},100235]
[{"$nulls":6},100236]
[{"$nulls":6},100237]
[{"$nulls":6},100238]
[{"$nulls":6},100239]
[{"$nulls":6},100240]
[{"$nulls":6},100241]
[{"$nulls":6},100242]
[{"$nulls":6},100243]
[{"$nulls":6},100244]
[{"$nulls":6},100245]
[{"$nulls":6},100246]
[{"$nulls":6},100247]
[{"$nulls":6},100248]
[{"$nulls":6},100249]
[{"$nulls":6},100250]
[{"$nulls":6},100251]
[{"$nulls":6},100252]
[{"$nulls":6},100253]
[{"$nulls":6},100254]
[{"$nulls":6},100255]
[{"$nulls":6},100256]
[{"$nulls":6},100257]
[{"$nulls":6},100258]
[{"$nulls":6},100259]
[{"$nulls":6},100260]
[{"$nulls":6},100261]
[{"$nulls":6},100262]
[{"$nulls":6},100263]
[{"$nulls":6},100264]
[{"$nulls":6},100265]
[{"$nulls":6},100266]
[{"$nulls":6},100267]
[{"$nulls":6},100268]
[{"$nulls":6},100269]
[{"$nulls":6},100270]
[{"$nulls":6},100271]
[{"$nulls":6},100272]
[{"$nulls":6},100273]
[{"$nulls":6},100274]
[{"$nulls":6},100275]
[{"$nulls":6},100276]
[{"$nulls":6},100277]
[{"$nulls":6},100278]
[{"$nulls":6},100279]
[{"$nulls":6},100280]
[{"$nulls":6},100281]
[{"$nulls":6},100282]
[{"$nulls":6},100283]
[{"$nulls":6},100284]
[{"$nulls":6},100285]
[{"$nulls":6},100286]
[{"$nulls":6},100287]
[{"$nulls":6},99802]
[{"$nulls":6},99803]
[{"$nulls":6},99804]
[{"$nulls":6},99805]
[{"$nulls":6},99806]
[{"$nulls":6},99807]
[{"$nulls":6},99808]
[{"$nulls":6},99809]
[{"$nulls":6},99810]
[{"$nulls":6},99811]
[{"$nulls":6},99812]
[{"$nulls":6},99813]
[{"$nulls":6},99814]
[{"$nulls":6},99815]
[{"$nulls":6},99816]
[{"$nulls":6},99817]
[{"$nulls":6},99818]
[{"$nulls":6},99819]
[{"$nulls":6},99820]
[{"$nulls":6},99821]
[{"$nulls":6},99822]
[{"$nulls":6},99823]
[{"$nulls":6},99824]
[{"$nulls":6},99825]
[{"$nulls":6},99826]
[{"$nulls":6},97013]
[{"$nulls":6},97014]
[{"$nulls":6},97015]
[{"$nulls":6},97016]
[{"$nulls":6},97017]
[{"$nulls":6},97018]
[{"$nulls":6},97031]
[{"$nulls":6},97032]
[{"$nulls":6},97033]
[{"$nulls":6},97034]
[{"$nulls":6},97039]
[{"$nulls":6},97040]
[{"$nulls":6},97041]
[{"$nulls":6},97046]
[{"$nulls":6},97047]
[{"$nulls":6},97048]
[{"$nulls":6},97054]
[{"$nulls":6},97062]
[{"$nulls":6},97063]
[{"$nulls":6},97064]
[{"$nulls":6},97065]
[{"$nulls":6},97066]
[{"$nulls":6},97067]
[{"$nulls":6},105103]
[{"$nulls":6},105104]
[{"$nulls":6},105105]
[{"$nulls":6},105106]
[{"$nulls":6},105107]
[{"$nulls":6},105110]
[{"$nulls":6},105111]
[{"$nulls":6},105112]
[{"$nulls":6},97621]
[{"$nulls":6},97622]
[{"$nulls":6},97623]
[{"$nulls":6},97624]
[{"$nulls":6},97625]
[{"$nulls":6},97626]
[{"$nulls":6},97627]
[{"$nulls":6},97628]
[{"$nulls":6},97629]
[{"$nulls":6},97631]
[{"$nulls":6},97632]
[{"$nulls":6},97633]
[{"$nulls":6},97634]
[{"$nulls":6},97635]
[{"$nulls":6},97636]
[{"$nulls":6},97637]
[{"$nulls":6},97638]
[{"$nulls":6},97639]
[{"$nulls":6},97640]
[{"$nulls":6},97641]
[{"$nulls":6},97642]
[{"$nulls":6},97643]
[{"$nulls":6},97644]
[{"$nulls":6},97645]
[{"$nulls":6},97647]
[{"$nulls":6},97648]
[{"$nulls":6},97649]
[{"$nulls":6},97650]
[{"$nulls":6},97651]
[{"$nulls":6},97652]
[{"$nulls":6},97653]
[{"$nulls":6},97654]
[{"$nulls":6},97655]
[{"$nulls":6},97656]
[{"$nulls":6},97657]
[{"$nulls":6},97658]
[{"$nulls":6},97659]
[{"$nulls":6},97660]
[{"$nulls":6},97661]
[{"$nulls":6},97662]
[{"$nulls":6},97663]
[{"$nulls":6},97664]
[{"$nulls":6},97665]
[{"$nulls":6},97666]
[{"$nulls":6},104789]
[{"$nulls":6},104790]
[{"$nulls":6},104791]
[{"$nulls":6},104792]
[{"$nulls":6},104793]
[{"$nulls":6},104794]
[{"$nulls":6},104795]
[{"$nulls":6},104796]
[{"$nulls":6},104797]
[{"$nulls":6},104798]
[{"$nulls":6},104799]
[{"$nulls":6},104800]
[{"$nulls":6},104801]
[{"$nulls":6},104802]
[{"$nulls":6},104803]
[{"$nulls":6},95967]
[{"$nulls":6},99059]
[{"$nulls":6},99060]
[{"$nulls":6},99061]
[{"$nulls":6},99062]
[{"$nulls":6},99063]
[{"$nulls":6},105007]
[{"$nulls":6},105009]
[{"$nulls":6},105011]
[{"$nulls":6},93588]
[{"$nulls":6},93589]
[{"$nulls":6},93590]
[{"$nulls":6},93591]
[{"$nulls":6},93592]
[{"$nulls":6},93593]
[{"$nulls":6},93594]
[{"$nulls":6},93595]
[{"$nulls":6},93596]
[{"$nulls":6},93597]
[{"$nulls":6},93598]
[{"$nulls":6},93599]
[{"$nulls":6},95425]
[{"$nulls":6},95426]
[{"$nulls":6},95427]
[{"$nulls":6},95428]
[{"$nulls":6},95429]
[{"$nulls":6},95430]
[{"$nulls":6},95875]
[{"$nulls":6},95876]
[{"$nulls":6},95877]
[{"$nulls":6},95878]
[{"$nulls":6},95879]
[{"$nulls":6},95880]
[{"$nulls":6},97912]
[{"$nulls":6},97913]
[{"$nulls":6},97914]
[{"$nulls":6},97915]
[{"$nulls":6},100937]
[{"$nulls":6},100938]
[{"$nulls":6},100939]
[{"$nulls":6},100940]
[{"$nulls":6},100941]
[{"$nulls":6},100942]
[{"$nulls":6},100943]
[{"$nulls":6},100944]
[{"$nulls":6},100945]
[{"$nulls":6},100946]
[{"$nulls":6},100947]
[{"$nulls":6},100948]
[{"$nulls":6},100949]
[{"$nulls":6},100950]
[{"$nulls":6},100951]
[{"$nulls":6},100952]
[{"$nulls":6},100953]
[{"$nulls":6},100954]
[{"$nulls":6},100955]
[{"$nulls":6},100956]
[{"$nulls":6},100957]
[{"$nulls":6},100958]
[{"$nulls":6},100959]
[{"$nulls":6},100960]
[{"$nulls":6},100961]
[{"$nulls":6},100962]
[{"$nulls":6},100963]
[{"$nulls":6},100964]
[{"$nulls":6},100973]
[{"$nulls":6},100974]
[{"$nulls":6},100975]
[{"$nulls":6},100965]
[{"$nulls":6},100966]
[{"$nulls":6},100969]
[{"$nulls":6},100970]
[{"$nulls":6},102330]
[{"$nulls":6},102331]
[{"$nulls":6},102332]
[{"$nulls":6},102333]
[{"$nulls":6},101019]
[{"$nulls":6},101479]
[{"$nulls":6},102568]
[{"$nulls":6},100976]
[{"$nulls":6},100977]
[{"$nulls":6},100978]
[{"$nulls":6},100979]
[{"$nulls":6},100980]
[{"$nulls":6},100981]
[{"$nulls":6},100982]
[{"$nulls":6},100983]
[{"$nulls":6},100984]
[{"$nulls":6},100985]
[{"$nulls":6},100986]
[{"$nulls":6},100987]
[{"$nulls":6},100988]
[{"$nulls":6},100989]
[{"$nulls":6},100990]
[{"$nulls":6},100991]
[{"$nulls":6},100992]
[{"$nulls":6},100993]
[{"$nulls":6},100994]
[{"$nulls":6},100995]
[{"$nulls":6},100996]
[{"$nulls":6},100997]
[{"$nulls":6},100998]
[{"$nulls":6},100999]
[{"$nulls":6},101000]
[{"$nulls":6},101001]
[{"$nulls":6},101002]
[{"$nulls":6},101003]
[{"$nulls":6},101004]
[{"$nulls":6},101005]
[{"$nulls":6},101006]
[{"$nulls":6},101007]
[{"$nulls":6},101008]
[{"$nulls":6},101009]
[{"$nulls":6},101010]
[{"$nulls":6},101013]
[{"$nulls":6},101014]
[{"$nulls":6},101015]
[{"$nulls":6},101016]
[{"$nulls":6},101017]
[{"$nulls":6},101018]
[{"$nulls":6},101463]
[{"$nulls":6},101464]
[{"$nulls":6},101465]
[{"$nulls":6},101466]
[{"$nulls":6},101467]
[{"$nulls":6},101468]
[{"$nulls":6},101469]
[{"$nulls":6},101470]
[{"$nulls":6},101471]
[{"$nulls":6},101472]
[{"$nulls":6},101473]
[{"$nulls":6},101474]
[{"$nulls":6},101475]
[{"$nulls":6},101476]
[{"$nulls":6},101477]
[{"$nulls":6},101478]
[{"$nulls":6},101480]
[{"$nulls":6},101481]
[{"$nulls":6},101482]
[{"$nulls":6},101483]
[{"$nulls":6},101484]
[{"$nulls":6},101485]
[{"$nulls":6},101486]
[{"$nulls":6},101487]
[{"$nulls":6},101488]
[{"$nulls":6},101188]
[{"$nulls":6},101189]
[{"$nulls":6},101190]
[{"$nulls":6},101191]
[{"$nulls":6},101192]
[{"$nulls":6},101193]
[{"$nulls":6},101194]
[{"$nulls":6},101197]
[{"$nulls":6},101198]
[{"$nulls":6},101199]
[{"$nulls":6},101200]
[{"$nulls":6},101201]
[{"$nulls":6},101202]
[{"$nulls":6},101203]
[{"$nulls":6},101204]
[{"$nulls":6},101205]
[{"$nulls":6},102362]
[{"$nulls":6},102363]
[{"$nulls":6},102364]
[{"$nulls":6},98509]
[{"$nulls":6},98510]
[{"$nulls":6},98511]
[{"$nulls":6},98516]
[{"$nulls":6},98519]
[{"$nulls":6},98520]
[{"$nulls":6},98521]
[{"$nulls":6},98522]
[{"$nulls":6},98524]
[{"$nulls":6},98503]
[{"$nulls":6},98504]
[{"$nulls":6},98505]
[{"$nulls":6},103946]
[{"$nulls":6},105000]
[{"$nulls":6},105001]
[{"$nulls":6},105002]
[{"$nulls":6},105003]
[{"$nulls":6},105004]
[{"$nulls":6},105005]
[{"$nulls":6},103185]
[{"$nulls":6},103186]
[{"$nulls":6},103187]
[{"$nulls":6},103188]
[{"$nulls":6},103189]
[{"$nulls":6},103190]
[{"$nulls":6},103191]
[{"$nulls":6},103192]
[{"$nulls":6},103193]
[{"$nulls":6},103194]
[{"$nulls":6},103195]
[{"$nulls":6},103205]
[{"$nulls":6},103206]
[{"$nulls":6},103207]
[{"$nulls":6},103208]
[{"$nulls":6},103209]
[{"$nulls":6},103210]
[{"$nulls":6},103304]
[{"$nulls":6},103307]
[{"$nulls":6},103310]
[{"$nulls":6},103314]
[{"$nulls":6},103315]
[{"$nulls":6},103769]
[{"$nulls":6},98525]
[{"$nulls":6},98526]
[{"$nulls":6},98527]
[{"$nulls":6},98528]
[{"$nulls":6},98529]
[{"$nulls":6},98530]
[{"$nulls":6},98531]
[{"$nulls":6},98532]
[{"$nulls":6},98533]
[{"$nulls":6},98534]
[{"$nulls":6},98535]
[{"$nulls":6},88238]
[{"$nulls":6},88239]
[{"$nulls":6},88240]
[{"$nulls":6},88241]
[{"$nulls":6},88242]
[{"$nulls":6},88243]
[{"$nulls":6},88245]
[{"$nulls":6},88246]
[{"$nulls":6},88247]
[{"$nulls":6},88248]
[{"$nulls":6},88249]
[{"$nulls":6},88250]
[{"$nulls":6},88251]
[{"$nulls":6},88252]
[{"$nulls":6},88253]
[{"$nulls":6},88255]
[{"$nulls":6},88256]
[{"$nulls":6},88257]
[{"$nulls":6},88260]
[{"$nulls":6},88261]
[{"$nulls":6},88262]
[{"$nulls":6},88263]
[{"$nulls":6},88264]
[{"$nulls":6},88266]
[{"$nulls":6},88267]
[{"$nulls":6},88269]
[{"$nulls":6},88270]
[{"$nulls":6},88272]
[{"$nulls":6},88273]
[{"$nulls":6},88274]
[{"$nulls":6},88275]
[{"$nulls":6},88277]
[{"$nulls":6},88278]
[{"$nulls":6},88279]
[{"$nulls":6},88281]
[{"$nulls":6},88282]
[{"$nulls":6},88283]
[{"$nulls":6},88284]
[{"$nulls":6},88286]
[{"$nulls":6},88288]
[{"$nulls":6},88291]
[{"$nulls":6},88292]
[{"$nulls":6},88293]
[{"$nulls":6},88294]
[{"$nulls":6},88295]
[{"$nulls":6},88296]
[{"$nulls":6},88297]
[{"$nulls":6},88298]
[{"$nulls":6},88299]
[{"$nulls":6},88300]
[{"$nulls":6},88301]
[{"$nulls":6},88302]
[{"$nulls":6},88303]
[{"$nulls":6},88304]
[{"$nulls":6},88306]
[{"$nulls":6},88307]
[{"$nulls":6},88308]
[{"$nulls":6},88309]
[{"$nulls":6},88310]
[{"$nulls":6},88311]
[{"$nulls":6},88312]
[{"$nulls":6},88313]
[{"$nulls":6},88314]
[{"$nulls":6},88315]
[{"$nulls":6},88316]
[{"$nulls":6},88317]
[{"$nulls":6},88318]
[{"$nulls":6},88321]
[{"$nulls":6},88322]
[{"$nulls":6},88323]
[{"$nulls":6},88324]
[{"$nulls":6},88325]
[{"$nulls":6},88377]
[{"$nulls":6},88441]
[{"$nulls":6},90766]
[{"$nulls":6},90767]
[{"$nulls":6},90768]
[{"$nulls":6},90769]
[{"$nulls":6},90770]
[{"$nulls":6},90772]
[{"$nulls":6},90775]
[{"$nulls":6},90776]
[{"$nulls":6},90777]
[{"$nulls":6},90778]
[{"$nulls":6},90779]
[{"$nulls":6},90780]
[{"$nulls":6},90781]
[{"$nulls":6},93558]
[{"$nulls":6},93561]
[{"$nulls":6},93563]
[{"$nulls":6},93564]
[{"$nulls":6},93565]
[{"$nulls":6},93566]
[{"$nulls":6},93567]
[{"$nulls":6},93568]
[{"$nulls":6},93569]
[{"$nulls":6},93570]
[{"$nulls":6},93571]
[{"$nulls":6},93572]
[{"$nulls":6},94295]
[{"$nulls":6},94296]
[{"$nulls":6},95308]
[{"$nulls":6},95309]
[{"$nulls":6},95310]
[{"$nulls":6},95311]
[{"$nulls":6},95312]
[{"$nulls":6},95313]
[{"$nulls":6},95314]
[{"$nulls":6},95315]
[{"$nulls":6},95316]
[{"$nulls":6},95317]
[{"$nulls":6},95318]
[{"$nulls":6},95319]
[{"$nulls":6},95320]
[{"$nulls":6},95321]
[{"$nulls":6},95322]
[{"$nulls":6},95323]
[{"$nulls":6},95324]
[{"$nulls":6},95325]
[{"$nulls":6},95328]
[{"$nulls":6},95329]
[{"$nulls":6},95330]
[{"$nulls":6},95331]
[{"$nulls":6},95332]
[{"$nulls":6},95334]
[{"$nulls":6},95335]
[{"$nulls":6},95337]
[{"$nulls":6},95338]
[{"$nulls":6},95339]
[{"$nulls":6},95340]
[{"$nulls":6},95341]
[{"$nulls":6},95342]
[{"$nulls":6},95343]
[{"$nulls":6},95344]
[{"$nulls":6},95345]
[{"$nulls":6},95346]
[{"$nulls":6},95347]
[{"$nulls":6},95348]
[{"$nulls":6},95349]
[{"$nulls":6},95351]
[{"$nulls":6},95352]
[{"$nulls":6},95354]
[{"$nulls":6},95355]
[{"$nulls":6},95356]
[{"$nulls":6},95357]
[{"$nulls":6},95358]
[{"$nulls":6},95359]
[{"$nulls":6},95360]
[{"$nulls":6},95361]
[{"$nulls":6},95362]
[{"$nulls":6},95363]
[{"$nulls":6},95364]
[{"$nulls":6},95365]
[{"$nulls":6},95366]
[{"$nulls":6},95367]
[{"$nulls":6},95368]
[{"$nulls":6},95369]
[{"$nulls":6},95370]
[{"$nulls":6},95371]
[{"$nulls":6},95372]
[{"$nulls":6},95373]
[{"$nulls":6},95374]
[{"$nulls":6},95375]
[{"$nulls":6},95376]
[{"$nulls":6},95377]
[{"$nulls":6},95378]
[{"$nulls":6},95379]
[{"$nulls":6},95380]
[{"$nulls":6},95383]
[{"$nulls":6},95384]
[{"$nulls":6},95385]
[{"$nulls":6},95386]
[{"$nulls":6},95387]
[{"$nulls":6},95389]
[{"$nulls":6},95390]
[{"$nulls":6},95392]
[{"$nulls":6},95393]
[{"$nulls":6},95394]
[{"$nulls":6},95395]
[{"$nulls":6},95396]
[{"$nulls":6},95398]
[{"$nulls":6},95400]
[{"$nulls":6},95401]
[{"$nulls":6},95402]
[{"$nulls":6},95403]
[{"$nulls":6},95404]
[{"$nulls":6},95405]
[{"$nulls":6},95406]
[{"$nulls":6},95408]
[{"$nulls":6},95411]
[{"$nulls":6},95413]
[{"$nulls":6},95414]
[{"$nulls":6},95415]
[{"$nulls":6},95416]
[{"$nulls":6},95417]
[{"$nulls":6},95418]
[{"$nulls":6},95419]
[{"$nulls":6},95420]
[{"$nulls":6},95421]
[{"$nulls":6},95422]
[{"$nulls":6},95423]
[{"$nulls":6},95424]
[{"$nulls":6},100288]
[{"$nulls":6},100289]
[{"$nulls":6},100291]
[{"$nulls":6},100293]
[{"$nulls":6},100295]
[{"$nulls":6},100298]
[{"$nulls":6},100299]
[{"$nulls":6},100301]
[{"$nulls":6},100303]
[{"$nulls":6},100307]
[{"$nulls":6},100308]
[{"$nulls":6},100309]
[{"$nulls":6},100315]
[{"$nulls":6},100321]
[{"$nulls":6},100533]
[{"$nulls":6},100534]
[{"$nulls":6},100535]
[{"$nulls":6},100536]
[{"$nulls":6},101286]
[{"$nulls":6},101287]
[{"$nulls":6},101288]
[{"$nulls":6},101289]
[{"$nulls":6},101290]
[{"$nulls":6},101291]
[{"$nulls":6},101292]
[{"$nulls":6},101293]
[{"$nulls":6},101294]
[{"$nulls":6},101295]
[{"$nulls":6},101296]
[{"$nulls":6},101297]
[{"$nulls":6},101298]
[{"$nulls":6},101299]
[{"$nulls":6},101300]
[{"$nulls":6},101301]
[{"$nulls":6},101302]
[{"$nulls":6},101303]
[{"$nulls":6},101304]
[{"$nulls":6},101305]
[{"$nulls":6},101307]
[{"$nulls":6},101308]
[{"$nulls":6},101309]
[{"$nulls":6},101310]
[{"$nulls":6},101311]
[{"$nulls":6},101312]
[{"$nulls":6},101313]
[{"$nulls":6},101315]
[{"$nulls":6},101316]
[{"$nulls":6},101320]
[{"$nulls":6},101322]
[{"$nulls":6},101323]
[{"$nulls":6},101324]
[{"$nulls":6},101325]
[{"$nulls":6},101326]
[{"$nulls":6},101328]
[{"$nulls":6},101329]
[{"$nulls":6},101330]
[{"$nulls":6},101331]
[{"$nulls":6},101332]
[{"$nulls":6},101333]
[{"$nulls":6},101334]
[{"$nulls":6},101336]
[{"$nulls":6},101337]
[{"$nulls":6},101338]
[{"$nulls":6},101339]
[{"$nulls":6},101340]
[{"$nulls":6},101341]
[{"$nulls":6},101342]
[{"$nulls":6},101343]
[{"$nulls":6},101344]
[{"$nulls":6},101345]
[{"$nulls":6},101346]
[{"$nulls":6},101347]
[{"$nulls":6},101348]
[{"$nulls":6},101349]
[{"$nulls":6},101350]
[{"$nulls":6},101351]
[{"$nulls":6},101352]
[{"$nulls":6},101353]
[{"$nulls":6},101355]
[{"$nulls":6},101356]
[{"$nulls":6},101357]
[{"$nulls":6},101358]
[{"$nulls":6},101359]
[{"$nulls":6},101360]
[{"$nulls":6},101361]
[{"$nulls":6},101363]
[{"$nulls":6},101364]
[{"$nulls":6},101365]
[{"$nulls":6},101366]
[{"$nulls":6},101368]
[{"$nulls":6},101369]
[{"$nulls":6},101370]
[{"$nulls":6},101371]
[{"$nulls":6},101372]
[{"$nulls":6},101374]
[{"$nulls":6},101375]
[{"$nulls":6},101376]
[{"$nulls":6},101377]
[{"$nulls":6},101378]
[{"$nulls":6},101379]
[{"$nulls":6},101380]
[{"$nulls":6},101381]
[{"$nulls":6},101382]
[{"$nulls":6},101383]
[{"$nulls":6},101384]
[{"$nulls":6},101385]
[{"$nulls":6},101386]
[{"$nulls":6},101387]
[{"$nulls":6},101388]
[{"$nulls":6},101389]
[{"$nulls":6},101390]
[{"$nulls":6},101391]
[{"$nulls":6},101392]
[{"$nulls":6},101394]
[{"$nulls":6},101395]
[{"$nulls":6},101396]
[{"$nulls":6},101397]
[{"$nulls":6},101398]
[{"$nulls":6},101399]
[{"$nulls":6},101401]
[{"$nulls":6},101402]
[{"$nulls":6},101407]
[{"$nulls":6},101408]
[{"$nulls":6},101409]
[{"$nulls":6},101410]
[{"$nulls":6},101412]
[{"$nulls":6},101413]
[{"$nulls":6},101414]
[{"$nulls":6},101415]
[{"$nulls":6},101416]
[{"$nulls":6},101417]
[{"$nulls":6},101418]
[{"$nulls":6},101419]
[{"$nulls":6},101420]
[{"$nulls":6},101421]
[{"$nulls":6},101422]
[{"$nulls":6},101424]
[{"$nulls":6},101425]
[{"$nulls":6},101426]
[{"$nulls":6},101427]
[{"$nulls":6},101428]
[{"$nulls":6},101429]
[{"$nulls":6},101430]
[{"$nulls":6},101431]
[{"$nulls":6},101432]
[{"$nulls":6},101433]
[{"$nulls":6},101434]
[{"$nulls":6},101435]
[{"$nulls":6},101436]
[{"$nulls":6},101437]
[{"$nulls":6},101438]
[{"$nulls":6},101439]
[{"$nulls":6},101440]
[{"$nulls":6},101441]
[{"$nulls":6},101443]
[{"$nulls":6},101444]
[{"$nulls":6},101445]
[{"$nulls":6},101446]
[{"$nulls":6},101447]
[{"$nulls":6},101448]
[{"$nulls":6},101449]
[{"$nulls":6},101451]
[{"$nulls":6},101452]
[{"$nulls":6},101453]
[{"$nulls":6},101454]
[{"$nulls":6},101456]
[{"$nulls":6},101457]
[{"$nulls":6},101458]
[{"$nulls":6},101459]
[{"$nulls":6},101460]

{"sheet":"7.CAPELINHA","index":6,"n_rows":7543,"n_cols":30,"rows_kept":7543,"cut":false,"hidden":false,"merged":[[1,1,3,11],[4,1,4,13],[5,1,8,1],[5,2,8,2],[5,3,8,3],[5,4,8,7],[6,9,7,9],[6,12,8,12],[6,13,8,13],[20,4,20,7],[9,4,9,7],[10,4,10,7],[11,4,11,7],[12,4,12,7],[13,4,13,7],[14,4,14,7],[15,4,15,7],[16,4,16,7],[17,4,17,7],[18,4,18,7],[19,4,19,7],[32,4,32,7],[21,4,21,7],[22,4,22,7],[23,4,23,7],[24,4,24,7],[25,4,25,7],[26,4,26,7],[27,4,27,7],[28,4,28,7],[29,4,29,7],[30,4,30,7],[31,4,31,7],[48,4,48,7],[33,4,33,7],[34,4,34,7],[35,4,35,7],[36,4,36,7],[37,4,37,7],[38,4,38,7],[40,4,40,7],[41,4,41,7],[42,4,42,7],[44,4,44,7],[46,4,46,7],[55,4,55,7],[56,4,56,7],[57,1,57,12],[49,4,49,7],[50,4,50,7],[51,4,51,7],[52,4,52,7],[53,4,53,7],[54,4,54,7]]}
[]
[null,"LOGOTIPO DA EMPRESA"]
[]
[{"$nulls":12},"Data Base do Orçamento","2024-08-01"]
[null,"CONTRATAÇÃO DE SERVIÇOS DE PAVIMENTAÇÃO ASFÁLTICA COM CONCRETO BETUMINOSO USINADO A QUENTE (CBUQ) EM VIAS URBANAS E RURAIS INSERIDAS NA ÁREA DE ATUAÇÃO DA 1ª SUPERINTENDÊNCIA REGIONAL DA CODEVASF, NO ESTADO DE MINAS GERAIS - ITEM 7: CAPELINHA/MG"]
[null,"ITEM","ORIGEM\nCOMPOSIÇÃO","CÓDIGO\nCOMPOSIÇÃO","DISCRIMINAÇÃO DOS SERVIÇOS",null,null,null,"BDI % = ",{"$f":"BDI!C17","v":0},"BDI  DIFERENCIADO% =",{"$f":"BDI!C33","v":0},"R$/m²",{"$f":"N58/I8","v":0},{"$f":"N58","v":0}]
[{"$nulls":8},"Total de m²","Encargos Sociais:","Horista","Mensalista","PREÇO UNITÁRIO COM BDI","PREÇO TOTAL COM BDI "]
[{"$nulls":8},63000,null,{"$f":"'ENC.SOC.'!$E$51","v":0},{"$f":"'ENC.SOC.'!$F$51","v":0}]
[{"$nulls":8},"UND","QTDE.","BDI","PREÇO UNITÁRIO "]
[{"$nulls":4},"MOBILIZAÇÃO/DESMOBILIZAÇÃO"]
[null,1,"Codevasf","Mob","Mobilização",null,null,null,"kmxfrente",540,{"$f":"(M11/L11-1)","v":{"$error":"#DIV/0!"}},null,{"$f":"L11*(1+$J$6)","v":0},{"$f":"M11*J11","v":0},{"$f":"N11/$N$58","v":{"$error":"#DIV/0!"}}]
[null,2,"Codevasf","Mob","Desmobilização",null,null,null,"kmxfrente",540,{"$f":"(M12/L12-1)","v":{"$error":"#DIV/0!"}},null,{"$f":"L12*(1+$J$6)","v":0},{"$f":"M12*J12","v":0},{"$f":"N12/$N$58","v":{"$error":"#DIV/0!"}}]
[{"$nulls":4},"INSTALAÇÃO DE CANTEIRO"]
[null,3,"Codevasf","Canteiro","Canteiro de Obras e Almoxarifado",null,null,null,"frente",6,{"$f":"(M14/L14-1)","v":{"$error":"#DIV/0!"}},null,{"$f":"L14*(1+$J$6)","v":0},{"$f":"ROUND(ROUND(J14,2)*ROUND(M14,6),2)","v":0},{"$f":"N14/N58","v":{"$error":"#DIV/0!"}}]
[null,4,"SINAPI",103689,"FORNECIMENTO E INSTALAÇÃO DE PLACA DE OBRA COM CHAPA GALVANIZADA E ESTRUTURA DE MADEIRA",null,null,null,"m²",96,{"$f":"(M15/L15-1)","v":{"$error":"#DIV/0!"}},null,0,{"$f":"ROUND(ROUND(J15,2)*ROUND(M15,6),2)","v":0}]
[{"$nulls":4},"ADMINISTRAÇÃO LOCAL DA OBRA"]
[null,5,"Codevasf","Adm Local","Administração Local da Obra",null,null,null,"und",1,{"$f":"(M17/L17-1)","v":{"$error":"#DIV/0!"}},null,{"$f":"L17*(1+$J$6)","v":0},{"$f":"ROUND(ROUND(J17,2)*ROUND(M17,6),2)","v":0},{"$f":"N17/N58","v":{"$error":"#DIV/0!"}}]
[{"$nulls":4},"TERRAPLANAGEM"]
[null,6,"SICRO",5502114,"Escavação, carga e transporte de material de 1ª categoria - DMT de 1.000 a 1.200 m - caminho de serviço em leito natural - com escavadeira e caminhão basculante de 14 m³",null,null,null,"m³",22050,{"$f":"M19/L19-1","v":{"$error":"#DIV/0!"}},null,{"$f":"L19*(1+$J$6)","v":0},{"$f":"ROUND(ROUND(J19,2)*ROUND(M19,6),2)","v":0}]
[null,7,"SICRO",4413942,"Espalhamento de material em bota-fora",null,null,null,"m³",22050,{"$error":"#DIV/0!"},null,0,0,{"$nulls":15},1]
[{"$nulls":4},"PAVIMENTAÇÃO"]
[null,8,"SICRO",4011463,"Concreto asfáltico - faixa C - areia e brita comerciais",null,null,null,"t",7560,{"$f":"M22/L22-1","v":{"$error":"#DIV/0!"}},null,{"$f":"L22*(1+$J$6)","v":0},{"$f":"ROUND(ROUND(J22,2)*ROUND(M22,6),2)","v":0}]
[null,9,"SICRO",4011352,"Imprimação com emulsão asfáltica",null,null,null,"m²",63000,{"$error":"#DIV/0!"},null,0,0]
[null,10,"SICRO",4011353,"Pintura de ligação",null,null,null,"m²",63000,{"$error":"#DIV/0!"},null,0,0]
[null,11,"SICRO",4011268,"Base estabilizada granulometricamente com mistura solo brita (70% - 30%) em usina com material de jazida e brita comercial",null,null,null,"m³",9450,{"$error":"#DIV/0!"},null,0,0]
[null,12,"SICRO",4011228,"Sub-base estabilizada granulometricamente com mistura de solos na pista com material de jazida",null,null,null,"m³",9450,{"$error":"#DIV/0!"},null,0,0]
[null,13,"SICRO",4011209,"Regularização do subleito",null,null,null,"m²",63000,{"$error":"#DIV/0!"},null,0,0]
[{"$nulls":4},"AQUISIÇÃO E TRANSPORTE DO MATERIAL BETUMINOSO"]
[null,14,"CODEVASF","CPU-13","AQUISIÇÃO DE CIMENTO ASFALTICO CAP 50/70",null,null,null,"t",487.54,{"$f":"M29/L29-1","v":{"$error":"#DIV/0!"}},null,{"$f":"L29*(1+$L$6)","v":0},{"$f":"ROUND(ROUND(J29,2)*ROUND(M29,6),2)","v":0}]
[null,15,"CODEVASF","CPU-17","TRANSPORTE CAP 50/70",null,null,null,"t",487.54,{"$error":"#DIV/0!"},null,{"$f":"L30*(1+$L$6)","v":0},0]
[null,16,"CODEVASF","CPU-14","AQUISIÇÃO DE EAI",null,null,null,"t",81.900000000000006,{"$error":"#DIV/0!"},null,0,0]
[null,17,"CODEVASF","CPU-18","TRANSPORTE DE EAI",null,null,null,"t",81.900000000000006,{"$error":"#DIV/0!"},null,0,0]
[null,18,"CODEVASF","CPU-15","AQUISIÇÃO DE EMULSÃO ASFÁLTICA RR-1C",null,null,null,"t",28.35,{"$error":"#DIV/0!"},null,0,0]
[null,19,"CODEVASF","CPU-19","TRANSPORTE RR-1C",null,null,null,"t",28.35,{"$error":"#DIV/0!"},null,0,0]
[{"$nulls":4},"SINALIZAÇÃO"]
[null,20,"SICRO",5213440,"Placa de regulamentação em aço D = 0,60 m - película retrorrefletiva tipo I + SI - fornecimento e implantação",null,null,null,"und",27,{"$f":"M36/L36-1","v":{"$error":"#DIV/0!"}},null,{"$f":"L36*(1+$J$6)","v":0},{"$f":"ROUND(ROUND(J36,2)*ROUND(M36,6),2)","v":0}]
[null,21,"SICRO",5213464,"Placa de advertência em aço, lado de 0,60 m - película retrorrefletiva tipo I + SI - fornecimento e implantação",null,null,null,"und",27,{"$error":"#DIV/0!"},null,0,0]
[null,22,"SICRO",5213863,"Suporte metálico galvanizado para placa de advertência ou regulamentação - lado ou diâmetro de 0,60 m - fornecimento e implantação",null,null,null,"und",54,{"$error":"#DIV/0!"},null,0,0]
[null,23,"SICRO",5213400,"Pintura de faixa com tinta acrílica - espessura de 0,4 mm",null,null,null,"m²",2520,{"$error":"#DIV/0!"},null,0,0]
[{"$nulls":4},"DRENAGEM"]
[null,24,"SINAPI",94273,"ASSENTAMENTO DE GUIA (MEIO-FIO) EM TRECHO RETO, CONFECCIONADA EM CONCRETO PRÉ-FABRICADO, DIMENSÕES 100X15X13X30 CM (COMPRIMENTO X BASE INFERIOR X BASE SUPERIOR X ALTURA)",null,null,null,"m",18000,{"$f":"M41/L41-1","v":{"$error":"#DIV/0!"}},null,{"$f":"L41*(1+$J$6)","v":0},{"$f":"ROUND(ROUND(J41,2)*ROUND(M41,6),2)","v":0}]
[null,25,"SINAPI",94287,"EXECUÇÃO DE SARJETA DE CONCRETO USINADO, MOLDADA  IN LOCO  EM TRECHO RETO, 30 CM BASE X 10 CM ALTURA",null,null,null,"m",18000,{"$f":"M42/L42-1","v":{"$error":"#DIV/0!"}},null,0,{"$f":"ROUND(ROUND(J42,2)*ROUND(M42,6),2)","v":0}]
[null,26,"SICRO",4915724,"Caiação mecanizada com fixador de cal",null,null,null,"m²",2160,{"$f":"(M43/L43-1)","v":{"$error":"#DIV/0!"}},null,0,{"$f":"ROUND(ROUND(J43,2)*ROUND(M43,6),2)","v":0},{"$nulls":10},4514640]
[{"$nulls":4},"SERVIÇOS COMPLEMENTARES"]
[null,27,"Codevasf","CPU-12","Conserto de quebra no ramal na rua sem pavimento com fornecimento de material hidráulico",null,null,null,"m",900,{"$f":"M45/L45-1","v":{"$error":"#DIV/0!"}},null,{"$f":"L45*(1+$J$6)","v":0},{"$f":"ROUND(ROUND(J45,2)*ROUND(M45,6),2)","v":0}]
[{"$nulls":4},"PROJETO EXECUTIVO"]
[null,28,"Codevasf","Composição Própria","Projeto Executivo",null,null,null,"m²",63000,{"$f":"M47/L47-1","v":{"$error":"#DIV/0!"}},null,{"$f":"L47*(1+$J$6)","v":0},{"$f":"ROUND(ROUND(J47,2)*ROUND(M47,6),2)","v":0}]
[{"$nulls":4},"MOMENTO DE TRANSPORTE"]
[null,29,"SICRO",5914359,"Transporte com caminhão basculante de 10 m³ - rodovia em leito natural",null,null,null,"tkm",122493.12,{"$f":"M49/L49-1","v":{"$error":"#DIV/0!"}},null,{"$f":"L49*(1+$J$6)","v":0},{"$f":"ROUND(ROUND(J49,2)*ROUND(M49,6),2)","v":0}]
[null,30,"SICRO",5914374,"Transporte com caminhão basculante de 10 m³ - rodovia em revestimento primário",null,null,null,"tkm",122493.12,{"$error":"#DIV/0!"},null,0,0]
[null,31,"SICRO",5914389,"Transporte com caminhão basculante de 10 m³ - rodovia pavimentada",null,null,null,"tkm",979945.32,{"$error":"#DIV/0!"},null,0,0]
[null,32,"SICRO",5914449,"Transporte com caminhão carroceria de 15 t - rodovia em leito natural",null,null,null,"tkm",1103.27,{"$error":"#DIV/0!"},null,0,0]
[null,33,"SICRO",5914464,"Transporte com caminhão carroceria de 15 t - rodovia em revestimento primário",null,null,null,"tkm",1103.27,{"$error":"#DIV/0!"},null,0,0]
[null,34,"SICRO",5914479,"Transporte com caminhão carroceria de 15 t - rodovia pavimentada",null,null,null,"tkm",8826.16,{"$error":"#DIV/0!"},null,0,0]
[null,35,"SICRO",5914364,"Transporte de cimento ou cal hidratada a granel com caminhão silo de 30 m³ - rodovia em leito natural",null,null,null,"tkm",467.39,{"$error":"#DIV/0!"},null,0,0]
[null,36,"SICRO",5914365,"Transporte de cimento ou cal hidratada a granel com caminhão silo de 30 m³ - rodovia em revestimento primário",null,null,null,"tkm",467.39,{"$error":"#DIV/0!"},null,0,0]
[null,37,"SICRO",5914366,"Transporte de cimento ou cal hidratada a granel com caminhão silo de 30 m³ - rodovia pavimentada",null,null,null,"tkm",3739.12,{"$f":"M57/L57-1","v":{"$error":"#DIV/0!"}},null,0,{"$f":"ROUND(ROUND(J57,2)*ROUND(M57,6),2)","v":0},{"$f":"SUM(N49:N57)/N58","v":{"$error":"#DIV/0!"}}]
[null,"VALOR TOTAL DO SRP",{"$nulls":11},{"$f":"SUM(N11:N57)","v":0}]
[null,"Obs.: Os valores estão apresentados com apenas 2 casas decimais, mas os valores da presente planilha foram calculados utilizando a precisão de 6 casas decimais. "]
[{"$nulls":13},{"$f":"(N58/#REF!)/2000000","v":{"$error":"#REF!"}}]
{"$rows_empty":6598}
[{"$nulls":6},87354]
[{"$nulls":6},87355]
[{"$nulls":6},87356]
[{"$nulls":6},87357]
[{"$nulls":6},87358]
[{"$nulls":6},87359]
[{"$nulls":6},87360]
[{"$nulls":6},87361]
[{"$nulls":6},87362]
[{"$nulls":6},87363]
[{"$nulls":6},87364]
[{"$nulls":6},87365]
[{"$nulls":6},87366]
[{"$nulls":6},87367]
[{"$nulls":6},87368]
[{"$nulls":6},87369]
[{"$nulls":6},87370]
[{"$nulls":6},87371]
[{"$nulls":6},87372]
[{"$nulls":6},87373]
[{"$nulls":6},87374]
[{"$nulls":6},87375]
[{"$nulls":6},87376]
[{"$nulls":6},87377]
[{"$nulls":6},87378]
[{"$nulls":6},87379]
[{"$nulls":6},87380]
[{"$nulls":6},87381]
[{"$nulls":6},87382]
[{"$nulls":6},87383]
[{"$nulls":6},87384]
[{"$nulls":6},87385]
[{"$nulls":6},87386]
[{"$nulls":6},87387]
[{"$nulls":6},87388]
[{"$nulls":6},87389]
[{"$nulls":6},87390]
[{"$nulls":6},87391]
[{"$nulls":6},87393]
[{"$nulls":6},87394]
[{"$nulls":6},87395]
[{"$nulls":6},87396]
[{"$nulls":6},87397]
[{"$nulls":6},87398]
[{"$nulls":6},87399]
[{"$nulls":6},87401]
[{"$nulls":6},87402]
[{"$nulls":6},87404]
[{"$nulls":6},87405]
[{"$nulls":6},87407]
[{"$nulls":6},87408]
[{"$nulls":6},87410]
[{"$nulls":6},88626]
[{"$nulls":6},88627]
[{"$nulls":6},88628]
[{"$nulls":6},88629]
[{"$nulls":6},88630]
[{"$nulls":6},88631]
[{"$nulls":6},88715]
[{"$nulls":6},95563]
[{"$nulls":6},100464]
[{"$nulls":6},100465]
[{"$nulls":6},100466]
[{"$nulls":6},100468]
[{"$nulls":6},100469]
[{"$nulls":6},100470]
[{"$nulls":6},100472]
[{"$nulls":6},100473]
[{"$nulls":6},100474]
[{"$nulls":6},100475]
[{"$nulls":6},100477]
[{"$nulls":6},100478]
[{"$nulls":6},100479]
[{"$nulls":6},100480]
[{"$nulls":6},100481]
[{"$nulls":6},100483]
[{"$nulls":6},100484]
[{"$nulls":6},100485]
[{"$nulls":6},100486]
[{"$nulls":6},100487]
[{"$nulls":6},100488]
[{"$nulls":6},100489]
[{"$nulls":6},100490]
[{"$nulls":6},100491]
[{"$nulls":6},100492]
[{"$nulls":6},92121]
[{"$nulls":6},92122]
[{"$nulls":6},92123]
[{"$nulls":6},100195]
[{"$nulls":6},100196]
[{"$nulls":6},100197]
[{"$nulls":6},100198]
[{"$nulls":6},100199]
[{"$nulls":6},100200]
[{"$nulls":6},100201]
[{"$nulls":6},100202]
[{"$nulls":6},100203]
[{"$nulls":6},100204]
[{"$nulls":6},100205]
[{"$nulls":6},100206]
[{"$nulls":6},100207]
[{"$nulls":6},100208]
[{"$nulls":6},100209]
[{"$nulls":6},100210]
[{"$nulls":6},100211]
[{"$nulls":6},100212]
[{"$nulls":6},100213]
[{"$nulls":6},100214]
[{"$nulls":6},100215]
[{"$nulls":6},100216]
[{"$nulls":6},100217]
[{"$nulls":6},100218]
[{"$nulls":6},100219]
[{"$nulls":6},100220]
[{"$nulls":6},100221]
[{"$nulls":6},100222]
[{"$nulls":6},100223]
[{"$nulls":6},100224]
[{"$nulls":6},100225]
[{"$nulls":6},100226]
[{"$nulls":6},100227]
[{"$nulls":6},100228]
[{"$nulls":6},100229]
[{"$nulls":6},100230]
[{"$nulls":6},100231]
[{"$nulls":6},100232]
[{"$nulls":6},100233]
[{"$nulls":6},100234]
[{"$nulls":6},100235]
[{"$nulls":6},100236]
[{"$nulls":6},100237]
[{"$nulls":6},100238]
[{"$nulls":6},100239]
[{"$nulls":6},100240]
[{"$nulls":6},100241]
[{"$nulls":6},100242]
[{"$nulls":6},100243]
[{"$nulls":6},100244]
[{"$nulls":6},100245]
[{"$nulls":6},100246]
[{"$nulls":6},100247]
[{"$nulls":6},100248]
[{"$nulls":6},100249]
[{"$nulls":6},100250]
[{"$nulls":6},100251]
[{"$nulls":6},100252]
[{"$nulls":6},100253]
[{"$nulls":6},100254]
[{"$nulls":6},100255]
[{"$nulls":6},100256]
[{"$nulls":6},100257]
[{"$nulls":6},100258]
[{"$nulls":6},100259]
[{"$nulls":6},100260]
[{"$nulls":6},100261]
[{"$nulls":6},100262]
[{"$nulls":6},100263]
[{"$nulls":6},100264]
[{"$nulls":6},100265]
[{"$nulls":6},100266]
[{"$nulls":6},100267]
[{"$nulls":6},100268]
[{"$nulls":6},100269]
[{"$nulls":6},100270]
[{"$nulls":6},100271]
[{"$nulls":6},100272]
[{"$nulls":6},100273]
[{"$nulls":6},100274]
[{"$nulls":6},100275]
[{"$nulls":6},100276]
[{"$nulls":6},100277]
[{"$nulls":6},100278]
[{"$nulls":6},100279]
[{"$nulls":6},100280]
[{"$nulls":6},100281]
[{"$nulls":6},100282]
[{"$nulls":6},100283]
[{"$nulls":6},100284]
[{"$nulls":6},100285]
[{"$nulls":6},100286]
[{"$nulls":6},100287]
[{"$nulls":6},99802]
[{"$nulls":6},99803]
[{"$nulls":6},99804]
[{"$nulls":6},99805]
[{"$nulls":6},99806]
[{"$nulls":6},99807]
[{"$nulls":6},99808]
[{"$nulls":6},99809]
[{"$nulls":6},99810]
[{"$nulls":6},99811]
[{"$nulls":6},99812]
[{"$nulls":6},99813]
[{"$nulls":6},99814]
[{"$nulls":6},99815]
[{"$nulls":6},99816]
[{"$nulls":6},99817]
[{"$nulls":6},99818]
[{"$nulls":6},99819]
[{"$nulls":6},99820]
[{"$nulls":6},99821]
[{"$nulls":6},99822]
[{"$nulls":6},99823]
[{"$nulls":6},99824]
[{"$nulls":6},99825]
[{"$nulls":6},99826]
[{"$nulls":6},97013]
[{"$nulls":6},97014]
[{"$nulls":6},97015]
[{"$nulls":6},97016]
[{"$nulls":6},97017]
[{"$nulls":6},97018]
[{"$nulls":6},97031]
[{"$nulls":6},97032]
[{"$nulls":6},97033]
[{"$nulls":6},97034]
[{"$nulls":6},97039]
[{"$nulls":6},97040]
[{"$nulls":6},97041]
[{"$nulls":6},97046]
[{"$nulls":6},97047]
[{"$nulls":6},97048]
[{"$nulls":6},97054]
[{"$nulls":6},97062]
[{"$nulls":6},97063]
[{"$nulls":6},97064]
[{"$nulls":6},97065]
[{"$nulls":6},97066]
[{"$nulls":6},97067]
[{"$nulls":6},105103]
[{"$nulls":6},105104]
[{"$nulls":6},105105]
[{"$nulls":6},105106]
[{"$nulls":6},105107]
[{"$nulls":6},105110]
[{"$nulls":6},105111]
[{"$nulls":6},105112]
[{"$nulls":6},97621]
[{"$nulls":6},97622]
[{"$nulls":6},97623]
[{"$nulls":6},97624]
[{"$nulls":6},97625]
[{"$nulls":6},97626]
[{"$nulls":6},97627]
[{"$nulls":6},97628]
[{"$nulls":6},97629]
[{"$nulls":6},97631]
[{"$nulls":6},97632]
[{"$nulls":6},97633]
[{"$nulls":6},97634]
[{"$nulls":6},97635]
[{"$nulls":6},97636]
[{"$nulls":6},97637]
[{"$nulls":6},97638]
[{"$nulls":6},97639]
[{"$nulls":6},97640]
[{"$nulls":6},97641]
[{"$nulls":6},97642]
[{"$nulls":6},97643]
[{"$nulls":6},97644]
[{"$nulls":6},97645]
[{"$nulls":6},97647]
[{"$nulls":6},97648]
[{"$nulls":6},97649]
[{"$nulls":6},97650]
[{"$nulls":6},97651]
[{"$nulls":6},97652]
[{"$nulls":6},97653]
[{"$nulls":6},97654]
[{"$nulls":6},97655]
[{"$nulls":6},97656]
[{"$nulls":6},97657]
[{"$nulls":6},97658]
[{"$nulls":6},97659]
[{"$nulls":6},97660]
[{"$nulls":6},97661]
[{"$nulls":6},97662]
[{"$nulls":6},97663]
[{"$nulls":6},97664]
[{"$nulls":6},97665]
[{"$nulls":6},97666]
[{"$nulls":6},104789]
[{"$nulls":6},104790]
[{"$nulls":6},104791]
[{"$nulls":6},104792]
[{"$nulls":6},104793]
[{"$nulls":6},104794]
[{"$nulls":6},104795]
[{"$nulls":6},104796]
[{"$nulls":6},104797]
[{"$nulls":6},104798]
[{"$nulls":6},104799]
[{"$nulls":6},104800]
[{"$nulls":6},104801]
[{"$nulls":6},104802]
[{"$nulls":6},104803]
[{"$nulls":6},95967]
[{"$nulls":6},99059]
[{"$nulls":6},99060]
[{"$nulls":6},99061]
[{"$nulls":6},99062]
[{"$nulls":6},99063]
[{"$nulls":6},105007]
[{"$nulls":6},105009]
[{"$nulls":6},105011]
[{"$nulls":6},93588]
[{"$nulls":6},93589]
[{"$nulls":6},93590]
[{"$nulls":6},93591]
[{"$nulls":6},93592]
[{"$nulls":6},93593]
[{"$nulls":6},93594]
[{"$nulls":6},93595]
[{"$nulls":6},93596]
[{"$nulls":6},93597]
[{"$nulls":6},93598]
[{"$nulls":6},93599]
[{"$nulls":6},95425]
[{"$nulls":6},95426]
[{"$nulls":6},95427]
[{"$nulls":6},95428]
[{"$nulls":6},95429]
[{"$nulls":6},95430]
[{"$nulls":6},95875]
[{"$nulls":6},95876]
[{"$nulls":6},95877]
[{"$nulls":6},95878]
[{"$nulls":6},95879]
[{"$nulls":6},95880]
[{"$nulls":6},97912]
[{"$nulls":6},97913]
[{"$nulls":6},97914]
[{"$nulls":6},97915]
[{"$nulls":6},100937]
[{"$nulls":6},100938]
[{"$nulls":6},100939]
[{"$nulls":6},100940]
[{"$nulls":6},100941]
[{"$nulls":6},100942]
[{"$nulls":6},100943]
[{"$nulls":6},100944]
[{"$nulls":6},100945]
[{"$nulls":6},100946]
[{"$nulls":6},100947]
[{"$nulls":6},100948]
[{"$nulls":6},100949]
[{"$nulls":6},100950]
[{"$nulls":6},100951]
[{"$nulls":6},100952]
[{"$nulls":6},100953]
[{"$nulls":6},100954]
[{"$nulls":6},100955]
[{"$nulls":6},100956]
[{"$nulls":6},100957]
[{"$nulls":6},100958]
[{"$nulls":6},100959]
[{"$nulls":6},100960]
[{"$nulls":6},100961]
[{"$nulls":6},100962]
[{"$nulls":6},100963]
[{"$nulls":6},100964]
[{"$nulls":6},100973]
[{"$nulls":6},100974]
[{"$nulls":6},100975]
[{"$nulls":6},100965]
[{"$nulls":6},100966]
[{"$nulls":6},100969]
[{"$nulls":6},100970]
[{"$nulls":6},102330]
[{"$nulls":6},102331]
[{"$nulls":6},102332]
[{"$nulls":6},102333]
[{"$nulls":6},101019]
[{"$nulls":6},101479]
[{"$nulls":6},102568]
[{"$nulls":6},100976]
[{"$nulls":6},100977]
[{"$nulls":6},100978]
[{"$nulls":6},100979]
[{"$nulls":6},100980]
[{"$nulls":6},100981]
[{"$nulls":6},100982]
[{"$nulls":6},100983]
[{"$nulls":6},100984]
[{"$nulls":6},100985]
[{"$nulls":6},100986]
[{"$nulls":6},100987]
[{"$nulls":6},100988]
[{"$nulls":6},100989]
[{"$nulls":6},100990]
[{"$nulls":6},100991]
[{"$nulls":6},100992]
[{"$nulls":6},100993]
[{"$nulls":6},100994]
[{"$nulls":6},100995]
[{"$nulls":6},100996]
[{"$nulls":6},100997]
[{"$nulls":6},100998]
[{"$nulls":6},100999]
[{"$nulls":6},101000]
[{"$nulls":6},101001]
[{"$nulls":6},101002]
[{"$nulls":6},101003]
[{"$nulls":6},101004]
[{"$nulls":6},101005]
[{"$nulls":6},101006]
[{"$nulls":6},101007]
[{"$nulls":6},101008]
[{"$nulls":6},101009]
[{"$nulls":6},101010]
[{"$nulls":6},101013]
[{"$nulls":6},101014]
[{"$nulls":6},101015]
[{"$nulls":6},101016]
[{"$nulls":6},101017]
[{"$nulls":6},101018]
[{"$nulls":6},101463]
[{"$nulls":6},101464]
[{"$nulls":6},101465]
[{"$nulls":6},101466]
[{"$nulls":6},101467]
[{"$nulls":6},101468]
[{"$nulls":6},101469]
[{"$nulls":6},101470]
[{"$nulls":6},101471]
[{"$nulls":6},101472]
[{"$nulls":6},101473]
[{"$nulls":6},101474]
[{"$nulls":6},101475]
[{"$nulls":6},101476]
[{"$nulls":6},101477]
[{"$nulls":6},101478]
[{"$nulls":6},101480]
[{"$nulls":6},101481]
[{"$nulls":6},101482]
[{"$nulls":6},101483]
[{"$nulls":6},101484]
[{"$nulls":6},101485]
[{"$nulls":6},101486]
[{"$nulls":6},101487]
[{"$nulls":6},101488]
[{"$nulls":6},101188]
[{"$nulls":6},101189]
[{"$nulls":6},101190]
[{"$nulls":6},101191]
[{"$nulls":6},101192]
[{"$nulls":6},101193]
[{"$nulls":6},101194]
[{"$nulls":6},101197]
[{"$nulls":6},101198]
[{"$nulls":6},101199]
[{"$nulls":6},101200]
[{"$nulls":6},101201]
[{"$nulls":6},101202]
[{"$nulls":6},101203]
[{"$nulls":6},101204]
[{"$nulls":6},101205]
[{"$nulls":6},102362]
[{"$nulls":6},102363]
[{"$nulls":6},102364]
[{"$nulls":6},98509]
[{"$nulls":6},98510]
[{"$nulls":6},98511]
[{"$nulls":6},98516]
[{"$nulls":6},98519]
[{"$nulls":6},98520]
[{"$nulls":6},98521]
[{"$nulls":6},98522]
[{"$nulls":6},98524]
[{"$nulls":6},98503]
[{"$nulls":6},98504]
[{"$nulls":6},98505]
[{"$nulls":6},103946]
[{"$nulls":6},105000]
[{"$nulls":6},105001]
[{"$nulls":6},105002]
[{"$nulls":6},105003]
[{"$nulls":6},105004]
[{"$nulls":6},105005]
[{"$nulls":6},103185]
[{"$nulls":6},103186]
[{"$nulls":6},103187]
[{"$nulls":6},103188]
[{"$nulls":6},103189]
[{"$nulls":6},103190]
[{"$nulls":6},103191]
[{"$nulls":6},103192]
[{"$nulls":6},103193]
[{"$nulls":6},103194]
[{"$nulls":6},103195]
[{"$nulls":6},103205]
[{"$nulls":6},103206]
[{"$nulls":6},103207]
[{"$nulls":6},103208]
[{"$nulls":6},103209]
[{"$nulls":6},103210]
[{"$nulls":6},103304]
[{"$nulls":6},103307]
[{"$nulls":6},103310]
[{"$nulls":6},103314]
[{"$nulls":6},103315]
[{"$nulls":6},103769]
[{"$nulls":6},98525]
[{"$nulls":6},98526]
[{"$nulls":6},98527]
[{"$nulls":6},98528]
[{"$nulls":6},98529]
[{"$nulls":6},98530]
[{"$nulls":6},98531]
[{"$nulls":6},98532]
[{"$nulls":6},98533]
[{"$nulls":6},98534]
[{"$nulls":6},98535]
[{"$nulls":6},88238]
[{"$nulls":6},88239]
[{"$nulls":6},88240]
[{"$nulls":6},88241]
[{"$nulls":6},88242]
[{"$nulls":6},88243]
[{"$nulls":6},88245]
[{"$nulls":6},88246]
[{"$nulls":6},88247]
[{"$nulls":6},88248]
[{"$nulls":6},88249]
[{"$nulls":6},88250]
[{"$nulls":6},88251]
[{"$nulls":6},88252]
[{"$nulls":6},88253]
[{"$nulls":6},88255]
[{"$nulls":6},88256]
[{"$nulls":6},88257]
[{"$nulls":6},88260]
[{"$nulls":6},88261]
[{"$nulls":6},88262]
[{"$nulls":6},88263]
[{"$nulls":6},88264]
[{"$nulls":6},88266]
[{"$nulls":6},88267]
[{"$nulls":6},88269]
[{"$nulls":6},88270]
[{"$nulls":6},88272]
[{"$nulls":6},88273]
[{"$nulls":6},88274]
[{"$nulls":6},88275]
[{"$nulls":6},88277]
[{"$nulls":6},88278]
[{"$nulls":6},88279]
[{"$nulls":6},88281]
[{"$nulls":6},88282]
[{"$nulls":6},88283]
[{"$nulls":6},88284]
[{"$nulls":6},88286]
[{"$nulls":6},88288]
[{"$nulls":6},88291]
[{"$nulls":6},88292]
[{"$nulls":6},88293]
[{"$nulls":6},88294]
[{"$nulls":6},88295]
[{"$nulls":6},88296]
[{"$nulls":6},88297]
[{"$nulls":6},88298]
[{"$nulls":6},88299]
[{"$nulls":6},88300]
[{"$nulls":6},88301]
[{"$nulls":6},88302]
[{"$nulls":6},88303]
[{"$nulls":6},88304]
[{"$nulls":6},88306]
[{"$nulls":6},88307]
[{"$nulls":6},88308]
[{"$nulls":6},88309]
[{"$nulls":6},88310]
[{"$nulls":6},88311]
[{"$nulls":6},88312]
[{"$nulls":6},88313]
[{"$nulls":6},88314]
[{"$nulls":6},88315]
[{"$nulls":6},88316]
[{"$nulls":6},88317]
[{"$nulls":6},88318]
[{"$nulls":6},88321]
[{"$nulls":6},88322]
[{"$nulls":6},88323]
[{"$nulls":6},88324]
[{"$nulls":6},88325]
[{"$nulls":6},88377]
[{"$nulls":6},88441]
[{"$nulls":6},90766]
[{"$nulls":6},90767]
[{"$nulls":6},90768]
[{"$nulls":6},90769]
[{"$nulls":6},90770]
[{"$nulls":6},90772]
[{"$nulls":6},90775]
[{"$nulls":6},90776]
[{"$nulls":6},90777]
[{"$nulls":6},90778]
[{"$nulls":6},90779]
[{"$nulls":6},90780]
[{"$nulls":6},90781]
[{"$nulls":6},93558]
[{"$nulls":6},93561]
[{"$nulls":6},93563]
[{"$nulls":6},93564]
[{"$nulls":6},93565]
[{"$nulls":6},93566]
[{"$nulls":6},93567]
[{"$nulls":6},93568]
[{"$nulls":6},93569]
[{"$nulls":6},93570]
[{"$nulls":6},93571]
[{"$nulls":6},93572]
[{"$nulls":6},94295]
[{"$nulls":6},94296]
[{"$nulls":6},95308]
[{"$nulls":6},95309]
[{"$nulls":6},95310]
[{"$nulls":6},95311]
[{"$nulls":6},95312]
[{"$nulls":6},95313]
[{"$nulls":6},95314]
[{"$nulls":6},95315]
[{"$nulls":6},95316]
[{"$nulls":6},95317]
[{"$nulls":6},95318]
[{"$nulls":6},95319]
[{"$nulls":6},95320]
[{"$nulls":6},95321]
[{"$nulls":6},95322]
[{"$nulls":6},95323]
[{"$nulls":6},95324]
[{"$nulls":6},95325]
[{"$nulls":6},95328]
[{"$nulls":6},95329]
[{"$nulls":6},95330]
[{"$nulls":6},95331]
[{"$nulls":6},95332]
[{"$nulls":6},95334]
[{"$nulls":6},95335]
[{"$nulls":6},95337]
[{"$nulls":6},95338]
[{"$nulls":6},95339]
[{"$nulls":6},95340]
[{"$nulls":6},95341]
[{"$nulls":6},95342]
[{"$nulls":6},95343]
[{"$nulls":6},95344]
[{"$nulls":6},95345]
[{"$nulls":6},95346]
[{"$nulls":6},95347]
[{"$nulls":6},95348]
[{"$nulls":6},95349]
[{"$nulls":6},95351]
[{"$nulls":6},95352]
[{"$nulls":6},95354]
[{"$nulls":6},95355]
[{"$nulls":6},95356]
[{"$nulls":6},95357]
[{"$nulls":6},95358]
[{"$nulls":6},95359]
[{"$nulls":6},95360]
[{"$nulls":6},95361]
[{"$nulls":6},95362]
[{"$nulls":6},95363]
[{"$nulls":6},95364]
[{"$nulls":6},95365]
[{"$nulls":6},95366]
[{"$nulls":6},95367]
[{"$nulls":6},95368]
[{"$nulls":6},95369]
[{"$nulls":6},95370]
[{"$nulls":6},95371]
[{"$nulls":6},95372]
[{"$nulls":6},95373]
[{"$nulls":6},95374]
[{"$nulls":6},95375]
[{"$nulls":6},95376]
[{"$nulls":6},95377]
[{"$nulls":6},95378]
[{"$nulls":6},95379]
[{"$nulls":6},95380]
[{"$nulls":6},95383]
[{"$nulls":6},95384]
[{"$nulls":6},95385]
[{"$nulls":6},95386]
[{"$nulls":6},95387]
[{"$nulls":6},95389]
[{"$nulls":6},95390]
[{"$nulls":6},95392]
[{"$nulls":6},95393]
[{"$nulls":6},95394]
[{"$nulls":6},95395]
[{"$nulls":6},95396]
[{"$nulls":6},95398]
[{"$nulls":6},95400]
[{"$nulls":6},95401]
[{"$nulls":6},95402]
[{"$nulls":6},95403]
[{"$nulls":6},95404]
[{"$nulls":6},95405]
[{"$nulls":6},95406]
[{"$nulls":6},95408]
[{"$nulls":6},95411]
[{"$nulls":6},95413]
[{"$nulls":6},95414]
[{"$nulls":6},95415]
[{"$nulls":6},95416]
[{"$nulls":6},95417]
[{"$nulls":6},95418]
[{"$nulls":6},95419]
[{"$nulls":6},95420]
[{"$nulls":6},95421]
[{"$nulls":6},95422]
[{"$nulls":6},95423]
[{"$nulls":6},95424]
[{"$nulls":6},100288]
[{"$nulls":6},100289]
[{"$nulls":6},100291]
[{"$nulls":6},100293]
[{"$nulls":6},100295]
[{"$nulls":6},100298]
[{"$nulls":6},100299]
[{"$nulls":6},100301]
[{"$nulls":6},100303]
[{"$nulls":6},100307]
[{"$nulls":6},100308]
[{"$nulls":6},100309]
[{"$nulls":6},100315]
[{"$nulls":6},100321]
[{"$nulls":6},100533]
[{"$nulls":6},100534]
[{"$nulls":6},100535]
[{"$nulls":6},100536]
[{"$nulls":6},101286]
[{"$nulls":6},101287]
[{"$nulls":6},101288]
[{"$nulls":6},101289]
[{"$nulls":6},101290]
[{"$nulls":6},101291]
[{"$nulls":6},101292]
[{"$nulls":6},101293]
[{"$nulls":6},101294]
[{"$nulls":6},101295]
[{"$nulls":6},101296]
[{"$nulls":6},101297]
[{"$nulls":6},101298]
[{"$nulls":6},101299]
[{"$nulls":6},101300]
[{"$nulls":6},101301]
[{"$nulls":6},101302]
[{"$nulls":6},101303]
[{"$nulls":6},101304]
[{"$nulls":6},101305]
[{"$nulls":6},101307]
[{"$nulls":6},101308]
[{"$nulls":6},101309]
[{"$nulls":6},101310]
[{"$nulls":6},101311]
[{"$nulls":6},101312]
[{"$nulls":6},101313]
[{"$nulls":6},101315]
[{"$nulls":6},101316]
[{"$nulls":6},101320]
[{"$nulls":6},101322]
[{"$nulls":6},101323]
[{"$nulls":6},101324]
[{"$nulls":6},101325]
[{"$nulls":6},101326]
[{"$nulls":6},101328]
[{"$nulls":6},101329]
[{"$nulls":6},101330]
[{"$nulls":6},101331]
[{"$nulls":6},101332]
[{"$nulls":6},101333]
[{"$nulls":6},101334]
[{"$nulls":6},101336]
[{"$nulls":6},101337]
[{"$nulls":6},101338]
[{"$nulls":6},101339]
[{"$nulls":6},101340]
[{"$nulls":6},101341]
[{"$nulls":6},101342]
[{"$nulls":6},101343]
[{"$nulls":6},101344]
[{"$nulls":6},101345]
[{"$nulls":6},101346]
[{"$nulls":6},101347]
[{"$nulls":6},101348]
[{"$nulls":6},101349]
[{"$nulls":6},101350]
[{"$nulls":6},101351]
[{"$nulls":6},101352]
[{"$nulls":6},101353]
[{"$nulls":6},101355]
[{"$nulls":6},101356]
[{"$nulls":6},101357]
[{"$nulls":6},101358]
[{"$nulls":6},101359]
[{"$nulls":6},101360]
[{"$nulls":6},101361]
[{"$nulls":6},101363]
[{"$nulls":6},101364]
[{"$nulls":6},101365]
[{"$nulls":6},101366]
[{"$nulls":6},101368]
[{"$nulls":6},101369]
[{"$nulls":6},101370]
[{"$nulls":6},101371]
[{"$nulls":6},101372]
[{"$nulls":6},101374]
[{"$nulls":6},101375]
[{"$nulls":6},101376]
[{"$nulls":6},101377]
[{"$nulls":6},101378]
[{"$nulls":6},101379]
[{"$nulls":6},101380]
[{"$nulls":6},101381]
[{"$nulls":6},101382]
[{"$nulls":6},101383]
[{"$nulls":6},101384]
[{"$nulls":6},101385]
[{"$nulls":6},101386]
[{"$nulls":6},101387]
[{"$nulls":6},101388]
[{"$nulls":6},101389]
[{"$nulls":6},101390]
[{"$nulls":6},101391]
[{"$nulls":6},101392]
[{"$nulls":6},101394]
[{"$nulls":6},101395]
[{"$nulls":6},101396]
[{"$nulls":6},101397]
[{"$nulls":6},101398]
[{"$nulls":6},101399]
[{"$nulls":6},101401]
[{"$nulls":6},101402]
[{"$nulls":6},101407]
[{"$nulls":6},101408]
[{"$nulls":6},101409]
[{"$nulls":6},101410]
[{"$nulls":6},101412]
[{"$nulls":6},101413]
[{"$nulls":6},101414]
[{"$nulls":6},101415]
[{"$nulls":6},101416]
[{"$nulls":6},101417]
[{"$nulls":6},101418]
[{"$nulls":6},101419]
[{"$nulls":6},101420]
[{"$nulls":6},101421]
[{"$nulls":6},101422]
[{"$nulls":6},101424]
[{"$nulls":6},101425]
[{"$nulls":6},101426]
[{"$nulls":6},101427]
[{"$nulls":6},101428]
[{"$nulls":6},101429]
[{"$nulls":6},101430]
[{"$nulls":6},101431]
[{"$nulls":6},101432]
[{"$nulls":6},101433]
[{"$nulls":6},101434]
[{"$nulls":6},101435]
[{"$nulls":6},101436]
[{"$nulls":6},101437]
[{"$nulls":6},101438]
[{"$nulls":6},101439]
[{"$nulls":6},101440]
[{"$nulls":6},101441]
[{"$nulls":6},101443]
[{"$nulls":6},101444]
[{"$nulls":6},101445]
[{"$nulls":6},101446]
[{"$nulls":6},101447]
[{"$nulls":6},101448]
[{"$nulls":6},101449]
[{"$nulls":6},101451]
[{"$nulls":6},101452]
[{"$nulls":6},101453]
[{"$nulls":6},101454]
[{"$nulls":6},101456]
[{"$nulls":6},101457]
[{"$nulls":6},101458]
[{"$nulls":6},101459]
[{"$nulls":6},101460]

{"sheet":"8.JEQUITINHONHA","index":7,"n_rows":7543,"n_cols":30,"rows_kept":7543,"cut":false,"hidden":false,"merged":[[1,1,3,11],[4,1,4,13],[5,1,8,1],[5,2,8,2],[5,3,8,3],[5,4,8,7],[6,9,7,9],[6,12,8,12],[6,13,8,13],[20,4,20,7],[9,4,9,7],[10,4,10,7],[11,4,11,7],[12,4,12,7],[13,4,13,7],[14,4,14,7],[15,4,15,7],[16,4,16,7],[17,4,17,7],[18,4,18,7],[19,4,19,7],[32,4,32,7],[21,4,21,7],[22,4,22,7],[23,4,23,7],[24,4,24,7],[25,4,25,7],[26,4,26,7],[27,4,27,7],[28,4,28,7],[29,4,29,7],[30,4,30,7],[31,4,31,7],[48,4,48,7],[33,4,33,7],[34,4,34,7],[35,4,35,7],[36,4,36,7],[37,4,37,7],[38,4,38,7],[40,4,40,7],[41,4,41,7],[42,4,42,7],[44,4,44,7],[46,4,46,7],[55,4,55,7],[56,4,56,7],[57,1,57,12],[49,4,49,7],[50,4,50,7],[51,4,51,7],[52,4,52,7],[53,4,53,7],[54,4,54,7]]}
[]
[null,"LOGOTIPO DA EMPRESA"]
[]
[{"$nulls":12},"Data Base do Orçamento","2024-08-01"]
[null,"CONTRATAÇÃO DE SERVIÇOS DE PAVIMENTAÇÃO ASFÁLTICA COM CONCRETO BETUMINOSO USINADO A QUENTE (CBUQ) EM VIAS URBANAS E RURAIS INSERIDAS NA ÁREA DE ATUAÇÃO DA 1ª SUPERINTENDÊNCIA REGIONAL DA CODEVASF, NO ESTADO DE MINAS GERAIS - ITEM 8: JEQUITINHONHA/MG"]
[null,"ITEM","ORIGEM\nCOMPOSIÇÃO","CÓDIGO\nCOMPOSIÇÃO","DISCRIMINAÇÃO DOS SERVIÇOS",null,null,null,"BDI % = ",{"$f":"BDI!C17","v":0},"BDI  DIFERENCIADO% =",{"$f":"BDI!C33","v":0},"R$/m²",{"$f":"N58/I8","v":0},{"$f":"N58","v":0}]
[{"$nulls":8},"Total de m²","Encargos Sociais:","Horista","Mensalista","PREÇO UNITÁRIO COM BDI","PREÇO TOTAL COM BDI "]
[{"$nulls":8},84000,null,{"$f":"'ENC.SOC.'!$E$51","v":0},{"$f":"'ENC.SOC.'!$F$51","v":0}]
[{"$nulls":8},"UND","QTDE.","BDI","PREÇO UNITÁRIO "]
[{"$nulls":4},"MOBILIZAÇÃO/DESMOBILIZAÇÃO"]
[null,1,"Codevasf","Mob","Mobilização",null,null,null,"kmxfrente",720,{"$f":"(M11/L11-1)","v":{"$error":"#DIV/0!"}},null,{"$f":"L11*(1+$J$6)","v":0},{"$f":"M11*J11","v":0},{"$f":"N11/$N$58","v":{"$error":"#DIV/0!"}}]
[null,2,"Codevasf","Mob","Desmobilização",null,null,null,"kmxfrente",720,{"$f":"(M12/L12-1)","v":{"$error":"#DIV/0!"}},null,{"$f":"L12*(1+$J$6)","v":0},{"$f":"M12*J12","v":0},{"$f":"N12/$N$58","v":{"$error":"#DIV/0!"}}]
[{"$nulls":4},"INSTALAÇÃO DE CANTEIRO"]
[null,3,"Codevasf","Canteiro","Canteiro de Obras e Almoxarifado",null,null,null,"frente",8,{"$f":"(M14/L14-1)","v":{"$error":"#DIV/0!"}},null,{"$f":"L14*(1+$J$6)","v":0},{"$f":"ROUND(ROUND(J14,2)*ROUND(M14,6),2)","v":0},{"$f":"N14/N58","v":{"$error":"#DIV/0!"}}]
[null,4,"SINAPI",103689,"FORNECIMENTO E INSTALAÇÃO DE PLACA DE OBRA COM CHAPA GALVANIZADA E ESTRUTURA DE MADEIRA",null,null,null,"m²",128,{"$f":"(M15/L15-1)","v":{"$error":"#DIV/0!"}},null,0,{"$f":"ROUND(ROUND(J15,2)*ROUND(M15,6),2)","v":0}]
[{"$nulls":4},"ADMINISTRAÇÃO LOCAL DA OBRA"]
[null,5,"Codevasf","Adm Local","Administração Local da Obra",null,null,null,"und",1,{"$f":"(M17/L17-1)","v":{"$error":"#DIV/0!"}},null,{"$f":"L17*(1+$J$6)","v":0},{"$f":"ROUND(ROUND(J17,2)*ROUND(M17,6),2)","v":0},{"$f":"N17/N58","v":{"$error":"#DIV/0!"}}]
[{"$nulls":4},"TERRAPLANAGEM"]
[null,6,"SICRO",5502114,"Escavação, carga e transporte de material de 1ª categoria - DMT de 1.000 a 1.200 m - caminho de serviço em leito natural - com escavadeira e caminhão basculante de 14 m³",null,null,null,"m³",29399.999999999996,{"$f":"M19/L19-1","v":{"$error":"#DIV/0!"}},null,{"$f":"L19*(1+$J$6)","v":0},{"$f":"ROUND(ROUND(J19,2)*ROUND(M19,6),2)","v":0}]
[null,7,"SICRO",4413942,"Espalhamento de material em bota-fora",null,null,null,"m³",29399.999999999996,{"$error":"#DIV/0!"},null,0,0,{"$nulls":15},1]
[{"$nulls":4},"PAVIMENTAÇÃO"]
[null,8,"SICRO",4011463,"Concreto asfáltico - faixa C - areia e brita comerciais",null,null,null,"t",10080,{"$f":"M22/L22-1","v":{"$error":"#DIV/0!"}},null,{"$f":"L22*(1+$J$6)","v":0},{"$f":"ROUND(ROUND(J22,2)*ROUND(M22,6),2)","v":0}]
[null,9,"SICRO",4011352,"Imprimação com emulsão asfáltica",null,null,null,"m²",84000,{"$error":"#DIV/0!"},null,0,0]
[null,10,"SICRO",4011353,"Pintura de ligação",null,null,null,"m²",84000,{"$error":"#DIV/0!"},null,0,0]
[null,11,"SICRO",4011268,"Base estabilizada granulometricamente com mistura solo brita (70% - 30%) em usina com material de jazida e brita comercial",null,null,null,"m³",12600,{"$error":"#DIV/0!"},null,0,0]
[null,12,"SICRO",4011228,"Sub-base estabilizada granulometricamente com mistura de solos na pista com material de jazida",null,null,null,"m³",12600,{"$error":"#DIV/0!"},null,0,0]
[null,13,"SICRO",4011209,"Regularização do subleito",null,null,null,"m²",84000,{"$error":"#DIV/0!"},null,0,0]
[{"$nulls":4},"AQUISIÇÃO E TRANSPORTE DO MATERIAL BETUMINOSO"]
[null,14,"CODEVASF","CPU-13","AQUISIÇÃO DE CIMENTO ASFALTICO CAP 50/70",null,null,null,"t",650.05999999999995,{"$f":"M29/L29-1","v":{"$error":"#DIV/0!"}},null,{"$f":"L29*(1+$L$6)","v":0},{"$f":"ROUND(ROUND(J29,2)*ROUND(M29,6),2)","v":0}]
[null,15,"CODEVASF","CPU-17","TRANSPORTE CAP 50/70",null,null,null,"t",650.05999999999995,{"$error":"#DIV/0!"},null,{"$f":"L30*(1+$L$6)","v":0},0]
[null,16,"CODEVASF","CPU-14","AQUISIÇÃO DE EAI",null,null,null,"t",109.2,{"$error":"#DIV/0!"},null,0,0]
[null,17,"CODEVASF","CPU-18","TRANSPORTE DE EAI",null,null,null,"t",109.2,{"$error":"#DIV/0!"},null,0,0]
[null,18,"CODEVASF","CPU-15","AQUISIÇÃO DE EMULSÃO ASFÁLTICA RR-1C",null,null,null,"t",37.799999999999997,{"$error":"#DIV/0!"},null,0,0]
[null,19,"CODEVASF","CPU-19","TRANSPORTE RR-1C",null,null,null,"t",37.799999999999997,{"$error":"#DIV/0!"},null,0,0]
[{"$nulls":4},"SINALIZAÇÃO"]
[null,20,"SICRO",5213440,"Placa de regulamentação em aço D = 0,60 m - película retrorrefletiva tipo I + SI - fornecimento e implantação",null,null,null,"und",36,{"$f":"M36/L36-1","v":{"$error":"#DIV/0!"}},null,{"$f":"L36*(1+$J$6)","v":0},{"$f":"ROUND(ROUND(J36,2)*ROUND(M36,6),2)","v":0}]
[null,21,"SICRO",5213464,"Placa de advertência em aço, lado de 0,60 m - película retrorrefletiva tipo I + SI - fornecimento e implantação",null,null,null,"und",36,{"$error":"#DIV/0!"},null,0,0]
[null,22,"SICRO",5213863,"Suporte metálico galvanizado para placa de advertência ou regulamentação - lado ou diâmetro de 0,60 m - fornecimento e implantação",null,null,null,"und",72,{"$error":"#DIV/0!"},null,0,0]
[null,23,"SICRO",5213400,"Pintura de faixa com tinta acrílica - espessura de 0,4 mm",null,null,null,"m²",3360,{"$error":"#DIV/0!"},null,0,0]
[{"$nulls":4},"DRENAGEM"]
[null,24,"SINAPI",94273,"ASSENTAMENTO DE GUIA (MEIO-FIO) EM TRECHO RETO, CONFECCIONADA EM CONCRETO PRÉ-FABRICADO, DIMENSÕES 100X15X13X30 CM (COMPRIMENTO X BASE INFERIOR X BASE SUPERIOR X ALTURA)",null,null,null,"m",24000,{"$f":"M41/L41-1","v":{"$error":"#DIV/0!"}},null,{"$f":"L41*(1+$J$6)","v":0},{"$f":"ROUND(ROUND(J41,2)*ROUND(M41,6),2)","v":0}]
[null,25,"SINAPI",94287,"EXECUÇÃO DE SARJETA DE CONCRETO USINADO, MOLDADA  IN LOCO  EM TRECHO RETO, 30 CM BASE X 10 CM ALTURA",null,null,null,"m",24000,{"$f":"M42/L42-1","v":{"$error":"#DIV/0!"}},null,0,{"$f":"ROUND(ROUND(J42,2)*ROUND(M42,6),2)","v":0}]
[null,26,"SICRO",4915724,"Caiação mecanizada com fixador de cal",null,null,null,"m²",2880,{"$f":"(M43/L43-1)","v":{"$error":"#DIV/0!"}},null,0,{"$f":"ROUND(ROUND(J43,2)*ROUND(M43,6),2)","v":0},{"$nulls":10},4514640]
[{"$nulls":4},"SERVIÇOS COMPLEMENTARES"]
[null,27,"Codevasf","CPU-12","Conserto de quebra no ramal na rua sem pavimento com fornecimento de material hidráulico",null,null,null,"m",1200,{"$f":"M45/L45-1","v":{"$error":"#DIV/0!"}},null,{"$f":"L45*(1+$J$6)","v":0},{"$f":"ROUND(ROUND(J45,2)*ROUND(M45,6),2)","v":0}]
[{"$nulls":4},"PROJETO EXECUTIVO"]
[null,28,"Codevasf","Composição Própria","Projeto Executivo",null,null,null,"m²",84000,{"$f":"M47/L47-1","v":{"$error":"#DIV/0!"}},null,{"$f":"L47*(1+$J$6)","v":0},{"$f":"ROUND(ROUND(J47,2)*ROUND(M47,6),2)","v":0}]
[{"$nulls":4},"MOMENTO DE TRANSPORTE"]
[null,29,"SICRO",5914359,"Transporte com caminhão basculante de 10 m³ - rodovia em leito natural",null,null,null,"tkm",164682.29999999999,{"$f":"M49/L49-1","v":{"$error":"#DIV/0!"}},null,{"$f":"L49*(1+$J$6)","v":0},{"$f":"ROUND(ROUND(J49,2)*ROUND(M49,6),2)","v":0}]
[null,30,"SICRO",5914374,"Transporte com caminhão basculante de 10 m³ - rodovia em revestimento primário",null,null,null,"tkm",164682.29999999999,{"$error":"#DIV/0!"},null,0,0]
[null,31,"SICRO",5914389,"Transporte com caminhão basculante de 10 m³ - rodovia pavimentada",null,null,null,"tkm",1317458.8999999999,{"$error":"#DIV/0!"},null,0,0]
[null,32,"SICRO",5914449,"Transporte com caminhão carroceria de 15 t - rodovia em leito natural",null,null,null,"tkm",1471.03,{"$error":"#DIV/0!"},null,0,0]
[null,33,"SICRO",5914464,"Transporte com caminhão carroceria de 15 t - rodovia em revestimento primário",null,null,null,"tkm",1471.03,{"$error":"#DIV/0!"},null,0,0]
[null,34,"SICRO",5914479,"Transporte com caminhão carroceria de 15 t - rodovia pavimentada",null,null,null,"tkm",11768.22,{"$error":"#DIV/0!"},null,0,0]
[null,35,"SICRO",5914364,"Transporte de cimento ou cal hidratada a granel com caminhão silo de 30 m³ - rodovia em leito natural",null,null,null,"tkm",623.19000000000005,{"$error":"#DIV/0!"},null,0,0]
[null,36,"SICRO",5914365,"Transporte de cimento ou cal hidratada a granel com caminhão silo de 30 m³ - rodovia em revestimento primário",null,null,null,"tkm",623.19000000000005,{"$error":"#DIV/0!"},null,0,0]
[null,37,"SICRO",5914366,"Transporte de cimento ou cal hidratada a granel com caminhão silo de 30 m³ - rodovia pavimentada",null,null,null,"tkm",4985.49,{"$f":"M57/L57-1","v":{"$error":"#DIV/0!"}},null,0,{"$f":"ROUND(ROUND(J57,2)*ROUND(M57,6),2)","v":0},{"$f":"SUM(N49:N57)/N58","v":{"$error":"#DIV/0!"}}]
[null,"VALOR TOTAL DO SRP",{"$nulls":11},{"$f":"SUM(N11:N57)","v":0}]
[null,"Obs.: Os valores estão apresentados com apenas 2 casas decimais, mas os valores da presente planilha foram calculados utilizando a precisão de 6 casas decimais. "]
[{"$nulls":13},{"$f":"(N58/#REF!)/2000000","v":{"$error":"#REF!"}}]
{"$rows_empty":6598}
[{"$nulls":6},87354]
[{"$nulls":6},87355]
[{"$nulls":6},87356]
[{"$nulls":6},87357]
[{"$nulls":6},87358]
[{"$nulls":6},87359]
[{"$nulls":6},87360]
[{"$nulls":6},87361]
[{"$nulls":6},87362]
[{"$nulls":6},87363]
[{"$nulls":6},87364]
[{"$nulls":6},87365]
[{"$nulls":6},87366]
[{"$nulls":6},87367]
[{"$nulls":6},87368]
[{"$nulls":6},87369]
[{"$nulls":6},87370]
[{"$nulls":6},87371]
[{"$nulls":6},87372]
[{"$nulls":6},87373]
[{"$nulls":6},87374]
[{"$nulls":6},87375]
[{"$nulls":6},87376]
[{"$nulls":6},87377]
[{"$nulls":6},87378]
[{"$nulls":6},87379]
[{"$nulls":6},87380]
[{"$nulls":6},87381]
[{"$nulls":6},87382]
[{"$nulls":6},87383]
[{"$nulls":6},87384]
[{"$nulls":6},87385]
[{"$nulls":6},87386]
[{"$nulls":6},87387]
[{"$nulls":6},87388]
[{"$nulls":6},87389]
[{"$nulls":6},87390]
[{"$nulls":6},87391]
[{"$nulls":6},87393]
[{"$nulls":6},87394]
[{"$nulls":6},87395]
[{"$nulls":6},87396]
[{"$nulls":6},87397]
[{"$nulls":6},87398]
[{"$nulls":6},87399]
[{"$nulls":6},87401]
[{"$nulls":6},87402]
[{"$nulls":6},87404]
[{"$nulls":6},87405]
[{"$nulls":6},87407]
[{"$nulls":6},87408]
[{"$nulls":6},87410]
[{"$nulls":6},88626]
[{"$nulls":6},88627]
[{"$nulls":6},88628]
[{"$nulls":6},88629]
[{"$nulls":6},88630]
[{"$nulls":6},88631]
[{"$nulls":6},88715]
[{"$nulls":6},95563]
[{"$nulls":6},100464]
[{"$nulls":6},100465]
[{"$nulls":6},100466]
[{"$nulls":6},100468]
[{"$nulls":6},100469]
[{"$nulls":6},100470]
[{"$nulls":6},100472]
[{"$nulls":6},100473]
[{"$nulls":6},100474]
[{"$nulls":6},100475]
[{"$nulls":6},100477]
[{"$nulls":6},100478]
[{"$nulls":6},100479]
[{"$nulls":6},100480]
[{"$nulls":6},100481]
[{"$nulls":6},100483]
[{"$nulls":6},100484]
[{"$nulls":6},100485]
[{"$nulls":6},100486]
[{"$nulls":6},100487]
[{"$nulls":6},100488]
[{"$nulls":6},100489]
[{"$nulls":6},100490]
[{"$nulls":6},100491]
[{"$nulls":6},100492]
[{"$nulls":6},92121]
[{"$nulls":6},92122]
[{"$nulls":6},92123]
[{"$nulls":6},100195]
[{"$nulls":6},100196]
[{"$nulls":6},100197]
[{"$nulls":6},100198]
[{"$nulls":6},100199]
[{"$nulls":6},100200]
[{"$nulls":6},100201]
[{"$nulls":6},100202]
[{"$nulls":6},100203]
[{"$nulls":6},100204]
[{"$nulls":6},100205]
[{"$nulls":6},100206]
[{"$nulls":6},100207]
[{"$nulls":6},100208]
[{"$nulls":6},100209]
[{"$nulls":6},100210]
[{"$nulls":6},100211]
[{"$nulls":6},100212]
[{"$nulls":6},100213]
[{"$nulls":6},100214]
[{"$nulls":6},100215]
[{"$nulls":6},100216]
[{"$nulls":6},100217]
[{"$nulls":6},100218]
[{"$nulls":6},100219]
[{"$nulls":6},100220]
[{"$nulls":6},100221]
[{"$nulls":6},100222]
[{"$nulls":6},100223]
[{"$nulls":6},100224]
[{"$nulls":6},100225]
[{"$nulls":6},100226]
[{"$nulls":6},100227]
[{"$nulls":6},100228]
[{"$nulls":6},100229]
[{"$nulls":6},100230]
[{"$nulls":6},100231]
[{"$nulls":6},100232]
[{"$nulls":6},100233]
[{"$nulls":6},100234]
[{"$nulls":6},100235]
[{"$nulls":6},100236]
[{"$nulls":6},100237]
[{"$nulls":6},100238]
[{"$nulls":6},100239]
[{"$nulls":6},100240]
[{"$nulls":6},100241]
[{"$nulls":6},100242]
[{"$nulls":6},100243]
[{"$nulls":6},100244]
[{"$nulls":6},100245]
[{"$nulls":6},100246]
[{"$nulls":6},100247]
[{"$nulls":6},100248]
[{"$nulls":6},100249]
[{"$nulls":6},100250]
[{"$nulls":6},100251]
[{"$nulls":6},100252]
[{"$nulls":6},100253]
[{"$nulls":6},100254]
[{"$nulls":6},100255]
[{"$nulls":6},100256]
[{"$nulls":6},100257]
[{"$nulls":6},100258]
[{"$nulls":6},100259]
[{"$nulls":6},100260]
[{"$nulls":6},100261]
[{"$nulls":6},100262]
[{"$nulls":6},100263]
[{"$nulls":6},100264]
[{"$nulls":6},100265]
[{"$nulls":6},100266]
[{"$nulls":6},100267]
[{"$nulls":6},100268]
[{"$nulls":6},100269]
[{"$nulls":6},100270]
[{"$nulls":6},100271]
[{"$nulls":6},100272]
[{"$nulls":6},100273]
[{"$nulls":6},100274]
[{"$nulls":6},100275]
[{"$nulls":6},100276]
[{"$nulls":6},100277]
[{"$nulls":6},100278]
[{"$nulls":6},100279]
[{"$nulls":6},100280]
[{"$nulls":6},100281]
[{"$nulls":6},100282]
[{"$nulls":6},100283]
[{"$nulls":6},100284]
[{"$nulls":6},100285]
[{"$nulls":6},100286]
[{"$nulls":6},100287]
[{"$nulls":6},99802]
[{"$nulls":6},99803]
[{"$nulls":6},99804]
[{"$nulls":6},99805]
[{"$nulls":6},99806]
[{"$nulls":6},99807]
[{"$nulls":6},99808]
[{"$nulls":6},99809]
[{"$nulls":6},99810]
[{"$nulls":6},99811]
[{"$nulls":6},99812]
[{"$nulls":6},99813]
[{"$nulls":6},99814]
[{"$nulls":6},99815]
[{"$nulls":6},99816]
[{"$nulls":6},99817]
[{"$nulls":6},99818]
[{"$nulls":6},99819]
[{"$nulls":6},99820]
[{"$nulls":6},99821]
[{"$nulls":6},99822]
[{"$nulls":6},99823]
[{"$nulls":6},99824]
[{"$nulls":6},99825]
[{"$nulls":6},99826]
[{"$nulls":6},97013]
[{"$nulls":6},97014]
[{"$nulls":6},97015]
[{"$nulls":6},97016]
[{"$nulls":6},97017]
[{"$nulls":6},97018]
[{"$nulls":6},97031]
[{"$nulls":6},97032]
[{"$nulls":6},97033]
[{"$nulls":6},97034]
[{"$nulls":6},97039]
[{"$nulls":6},97040]
[{"$nulls":6},97041]
[{"$nulls":6},97046]
[{"$nulls":6},97047]
[{"$nulls":6},97048]
[{"$nulls":6},97054]
[{"$nulls":6},97062]
[{"$nulls":6},97063]
[{"$nulls":6},97064]
[{"$nulls":6},97065]
[{"$nulls":6},97066]
[{"$nulls":6},97067]
[{"$nulls":6},105103]
[{"$nulls":6},105104]
[{"$nulls":6},105105]
[{"$nulls":6},105106]
[{"$nulls":6},105107]
[{"$nulls":6},105110]
[{"$nulls":6},105111]
[{"$nulls":6},105112]
[{"$nulls":6},97621]
[{"$nulls":6},97622]
[{"$nulls":6},97623]
[{"$nulls":6},97624]
[{"$nulls":6},97625]
[{"$nulls":6},97626]
[{"$nulls":6},97627]
[{"$nulls":6},97628]
[{"$nulls":6},97629]
[{"$nulls":6},97631]
[{"$nulls":6},97632]
[{"$nulls":6},97633]
[{"$nulls":6},97634]
[{"$nulls":6},97635]
[{"$nulls":6},97636]
[{"$nulls":6},97637]
[{"$nulls":6},97638]
[{"$nulls":6},97639]
[{"$nulls":6},97640]
[{"$nulls":6},97641]
[{"$nulls":6},97642]
[{"$nulls":6},97643]
[{"$nulls":6},97644]
[{"$nulls":6},97645]
[{"$nulls":6},97647]
[{"$nulls":6},97648]
[{"$nulls":6},97649]
[{"$nulls":6},97650]
[{"$nulls":6},97651]
[{"$nulls":6},97652]
[{"$nulls":6},97653]
[{"$nulls":6},97654]
[{"$nulls":6},97655]
[{"$nulls":6},97656]
[{"$nulls":6},97657]
[{"$nulls":6},97658]
[{"$nulls":6},97659]
[{"$nulls":6},97660]
[{"$nulls":6},97661]
[{"$nulls":6},97662]
[{"$nulls":6},97663]
[{"$nulls":6},97664]
[{"$nulls":6},97665]
[{"$nulls":6},97666]
[{"$nulls":6},104789]
[{"$nulls":6},104790]
[{"$nulls":6},104791]
[{"$nulls":6},104792]
[{"$nulls":6},104793]
[{"$nulls":6},104794]
[{"$nulls":6},104795]
[{"$nulls":6},104796]
[{"$nulls":6},104797]
[{"$nulls":6},104798]
[{"$nulls":6},104799]
[{"$nulls":6},104800]
[{"$nulls":6},104801]
[{"$nulls":6},104802]
[{"$nulls":6},104803]
[{"$nulls":6},95967]
[{"$nulls":6},99059]
[{"$nulls":6},99060]
[{"$nulls":6},99061]
[{"$nulls":6},99062]
[{"$nulls":6},99063]
[{"$nulls":6},105007]
[{"$nulls":6},105009]
[{"$nulls":6},105011]
[{"$nulls":6},93588]
[{"$nulls":6},93589]
[{"$nulls":6},93590]
[{"$nulls":6},93591]
[{"$nulls":6},93592]
[{"$nulls":6},93593]
[{"$nulls":6},93594]
[{"$nulls":6},93595]
[{"$nulls":6},93596]
[{"$nulls":6},93597]
[{"$nulls":6},93598]
[{"$nulls":6},93599]
[{"$nulls":6},95425]
[{"$nulls":6},95426]
[{"$nulls":6},95427]
[{"$nulls":6},95428]
[{"$nulls":6},95429]
[{"$nulls":6},95430]
[{"$nulls":6},95875]
[{"$nulls":6},95876]
[{"$nulls":6},95877]
[{"$nulls":6},95878]
[{"$nulls":6},95879]
[{"$nulls":6},95880]
[{"$nulls":6},97912]
[{"$nulls":6},97913]
[{"$nulls":6},97914]
[{"$nulls":6},97915]
[{"$nulls":6},100937]
[{"$nulls":6},100938]
[{"$nulls":6},100939]
[{"$nulls":6},100940]
[{"$nulls":6},100941]
[{"$nulls":6},100942]
[{"$nulls":6},100943]
[{"$nulls":6},100944]
[{"$nulls":6},100945]
[{"$nulls":6},100946]
[{"$nulls":6},100947]
[{"$nulls":6},100948]
[{"$nulls":6},100949]
[{"$nulls":6},100950]
[{"$nulls":6},100951]
[{"$nulls":6},100952]
[{"$nulls":6},100953]
[{"$nulls":6},100954]
[{"$nulls":6},100955]
[{"$nulls":6},100956]
[{"$nulls":6},100957]
[{"$nulls":6},100958]
[{"$nulls":6},100959]
[{"$nulls":6},100960]
[{"$nulls":6},100961]
[{"$nulls":6},100962]
[{"$nulls":6},100963]
[{"$nulls":6},100964]
[{"$nulls":6},100973]
[{"$nulls":6},100974]
[{"$nulls":6},100975]
[{"$nulls":6},100965]
[{"$nulls":6},100966]
[{"$nulls":6},100969]
[{"$nulls":6},100970]
[{"$nulls":6},102330]
[{"$nulls":6},102331]
[{"$nulls":6},102332]
[{"$nulls":6},102333]
[{"$nulls":6},101019]
[{"$nulls":6},101479]
[{"$nulls":6},102568]
[{"$nulls":6},100976]
[{"$nulls":6},100977]
[{"$nulls":6},100978]
[{"$nulls":6},100979]
[{"$nulls":6},100980]
[{"$nulls":6},100981]
[{"$nulls":6},100982]
[{"$nulls":6},100983]
[{"$nulls":6},100984]
[{"$nulls":6},100985]
[{"$nulls":6},100986]
[{"$nulls":6},100987]
[{"$nulls":6},100988]
[{"$nulls":6},100989]
[{"$nulls":6},100990]
[{"$nulls":6},100991]
[{"$nulls":6},100992]
[{"$nulls":6},100993]
[{"$nulls":6},100994]
[{"$nulls":6},100995]
[{"$nulls":6},100996]
[{"$nulls":6},100997]
[{"$nulls":6},100998]
[{"$nulls":6},100999]
[{"$nulls":6},101000]
[{"$nulls":6},101001]
[{"$nulls":6},101002]
[{"$nulls":6},101003]
[{"$nulls":6},101004]
[{"$nulls":6},101005]
[{"$nulls":6},101006]
[{"$nulls":6},101007]
[{"$nulls":6},101008]
[{"$nulls":6},101009]
[{"$nulls":6},101010]
[{"$nulls":6},101013]
[{"$nulls":6},101014]
[{"$nulls":6},101015]
[{"$nulls":6},101016]
[{"$nulls":6},101017]
[{"$nulls":6},101018]
[{"$nulls":6},101463]
[{"$nulls":6},101464]
[{"$nulls":6},101465]
[{"$nulls":6},101466]
[{"$nulls":6},101467]
[{"$nulls":6},101468]
[{"$nulls":6},101469]
[{"$nulls":6},101470]
[{"$nulls":6},101471]
[{"$nulls":6},101472]
[{"$nulls":6},101473]
[{"$nulls":6},101474]
[{"$nulls":6},101475]
[{"$nulls":6},101476]
[{"$nulls":6},101477]
[{"$nulls":6},101478]
[{"$nulls":6},101480]
[{"$nulls":6},101481]
[{"$nulls":6},101482]
[{"$nulls":6},101483]
[{"$nulls":6},101484]
[{"$nulls":6},101485]
[{"$nulls":6},101486]
[{"$nulls":6},101487]
[{"$nulls":6},101488]
[{"$nulls":6},101188]
[{"$nulls":6},101189]
[{"$nulls":6},101190]
[{"$nulls":6},101191]
[{"$nulls":6},101192]
[{"$nulls":6},101193]
[{"$nulls":6},101194]
[{"$nulls":6},101197]
[{"$nulls":6},101198]
[{"$nulls":6},101199]
[{"$nulls":6},101200]
[{"$nulls":6},101201]
[{"$nulls":6},101202]
[{"$nulls":6},101203]
[{"$nulls":6},101204]
[{"$nulls":6},101205]
[{"$nulls":6},102362]
[{"$nulls":6},102363]
[{"$nulls":6},102364]
[{"$nulls":6},98509]
[{"$nulls":6},98510]
[{"$nulls":6},98511]
[{"$nulls":6},98516]
[{"$nulls":6},98519]
[{"$nulls":6},98520]
[{"$nulls":6},98521]
[{"$nulls":6},98522]
[{"$nulls":6},98524]
[{"$nulls":6},98503]
[{"$nulls":6},98504]
[{"$nulls":6},98505]
[{"$nulls":6},103946]
[{"$nulls":6},105000]
[{"$nulls":6},105001]
[{"$nulls":6},105002]
[{"$nulls":6},105003]
[{"$nulls":6},105004]
[{"$nulls":6},105005]
[{"$nulls":6},103185]
[{"$nulls":6},103186]
[{"$nulls":6},103187]
[{"$nulls":6},103188]
[{"$nulls":6},103189]
[{"$nulls":6},103190]
[{"$nulls":6},103191]
[{"$nulls":6},103192]
[{"$nulls":6},103193]
[{"$nulls":6},103194]
[{"$nulls":6},103195]
[{"$nulls":6},103205]
[{"$nulls":6},103206]
[{"$nulls":6},103207]
[{"$nulls":6},103208]
[{"$nulls":6},103209]
[{"$nulls":6},103210]
[{"$nulls":6},103304]
[{"$nulls":6},103307]
[{"$nulls":6},103310]
[{"$nulls":6},103314]
[{"$nulls":6},103315]
[{"$nulls":6},103769]
[{"$nulls":6},98525]
[{"$nulls":6},98526]
[{"$nulls":6},98527]
[{"$nulls":6},98528]
[{"$nulls":6},98529]
[{"$nulls":6},98530]
[{"$nulls":6},98531]
[{"$nulls":6},98532]
[{"$nulls":6},98533]
[{"$nulls":6},98534]
[{"$nulls":6},98535]
[{"$nulls":6},88238]
[{"$nulls":6},88239]
[{"$nulls":6},88240]
[{"$nulls":6},88241]
[{"$nulls":6},88242]
[{"$nulls":6},88243]
[{"$nulls":6},88245]
[{"$nulls":6},88246]
[{"$nulls":6},88247]
[{"$nulls":6},88248]
[{"$nulls":6},88249]
[{"$nulls":6},88250]
[{"$nulls":6},88251]
[{"$nulls":6},88252]
[{"$nulls":6},88253]
[{"$nulls":6},88255]
[{"$nulls":6},88256]
[{"$nulls":6},88257]
[{"$nulls":6},88260]
[{"$nulls":6},88261]
[{"$nulls":6},88262]
[{"$nulls":6},88263]
[{"$nulls":6},88264]
[{"$nulls":6},88266]
[{"$nulls":6},88267]
[{"$nulls":6},88269]
[{"$nulls":6},88270]
[{"$nulls":6},88272]
[{"$nulls":6},88273]
[{"$nulls":6},88274]
[{"$nulls":6},88275]
[{"$nulls":6},88277]
[{"$nulls":6},88278]
[{"$nulls":6},88279]
[{"$nulls":6},88281]
[{"$nulls":6},88282]
[{"$nulls":6},88283]
[{"$nulls":6},88284]
[{"$nulls":6},88286]
[{"$nulls":6},88288]
[{"$nulls":6},88291]
[{"$nulls":6},88292]
[{"$nulls":6},88293]
[{"$nulls":6},88294]
[{"$nulls":6},88295]
[{"$nulls":6},88296]
[{"$nulls":6},88297]
[{"$nulls":6},88298]
[{"$nulls":6},88299]
[{"$nulls":6},88300]
[{"$nulls":6},88301]
[{"$nulls":6},88302]
[{"$nulls":6},88303]
[{"$nulls":6},88304]
[{"$nulls":6},88306]
[{"$nulls":6},88307]
[{"$nulls":6},88308]
[{"$nulls":6},88309]
[{"$nulls":6},88310]
[{"$nulls":6},88311]
[{"$nulls":6},88312]
[{"$nulls":6},88313]
[{"$nulls":6},88314]
[{"$nulls":6},88315]
[{"$nulls":6},88316]
[{"$nulls":6},88317]
[{"$nulls":6},88318]
[{"$nulls":6},88321]
[{"$nulls":6},88322]
[{"$nulls":6},88323]
[{"$nulls":6},88324]
[{"$nulls":6},88325]
[{"$nulls":6},88377]
[{"$nulls":6},88441]
[{"$nulls":6},90766]
[{"$nulls":6},90767]
[{"$nulls":6},90768]
[{"$nulls":6},90769]
[{"$nulls":6},90770]
[{"$nulls":6},90772]
[{"$nulls":6},90775]
[{"$nulls":6},90776]
[{"$nulls":6},90777]
[{"$nulls":6},90778]
[{"$nulls":6},90779]
[{"$nulls":6},90780]
[{"$nulls":6},90781]
[{"$nulls":6},93558]
[{"$nulls":6},93561]
[{"$nulls":6},93563]
[{"$nulls":6},93564]
[{"$nulls":6},93565]
[{"$nulls":6},93566]
[{"$nulls":6},93567]
[{"$nulls":6},93568]
[{"$nulls":6},93569]
[{"$nulls":6},93570]
[{"$nulls":6},93571]
[{"$nulls":6},93572]
[{"$nulls":6},94295]
[{"$nulls":6},94296]
[{"$nulls":6},95308]
[{"$nulls":6},95309]
[{"$nulls":6},95310]
[{"$nulls":6},95311]
[{"$nulls":6},95312]
[{"$nulls":6},95313]
[{"$nulls":6},95314]
[{"$nulls":6},95315]
[{"$nulls":6},95316]
[{"$nulls":6},95317]
[{"$nulls":6},95318]
[{"$nulls":6},95319]
[{"$nulls":6},95320]
[{"$nulls":6},95321]
[{"$nulls":6},95322]
[{"$nulls":6},95323]
[{"$nulls":6},95324]
[{"$nulls":6},95325]
[{"$nulls":6},95328]
[{"$nulls":6},95329]
[{"$nulls":6},95330]
[{"$nulls":6},95331]
[{"$nulls":6},95332]
[{"$nulls":6},95334]
[{"$nulls":6},95335]
[{"$nulls":6},95337]
[{"$nulls":6},95338]
[{"$nulls":6},95339]
[{"$nulls":6},95340]
[{"$nulls":6},95341]
[{"$nulls":6},95342]
[{"$nulls":6},95343]
[{"$nulls":6},95344]
[{"$nulls":6},95345]
[{"$nulls":6},95346]
[{"$nulls":6},95347]
[{"$nulls":6},95348]
[{"$nulls":6},95349]
[{"$nulls":6},95351]
[{"$nulls":6},95352]
[{"$nulls":6},95354]
[{"$nulls":6},95355]
[{"$nulls":6},95356]
[{"$nulls":6},95357]
[{"$nulls":6},95358]
[{"$nulls":6},95359]
[{"$nulls":6},95360]
[{"$nulls":6},95361]
[{"$nulls":6},95362]
[{"$nulls":6},95363]
[{"$nulls":6},95364]
[{"$nulls":6},95365]
[{"$nulls":6},95366]
[{"$nulls":6},95367]
[{"$nulls":6},95368]
[{"$nulls":6},95369]
[{"$nulls":6},95370]
[{"$nulls":6},95371]
[{"$nulls":6},95372]
[{"$nulls":6},95373]
[{"$nulls":6},95374]
[{"$nulls":6},95375]
[{"$nulls":6},95376]
[{"$nulls":6},95377]
[{"$nulls":6},95378]
[{"$nulls":6},95379]
[{"$nulls":6},95380]
[{"$nulls":6},95383]
[{"$nulls":6},95384]
[{"$nulls":6},95385]
[{"$nulls":6},95386]
[{"$nulls":6},95387]
[{"$nulls":6},95389]
[{"$nulls":6},95390]
[{"$nulls":6},95392]
[{"$nulls":6},95393]
[{"$nulls":6},95394]
[{"$nulls":6},95395]
[{"$nulls":6},95396]
[{"$nulls":6},95398]
[{"$nulls":6},95400]
[{"$nulls":6},95401]
[{"$nulls":6},95402]
[{"$nulls":6},95403]
[{"$nulls":6},95404]
[{"$nulls":6},95405]
[{"$nulls":6},95406]
[{"$nulls":6},95408]
[{"$nulls":6},95411]
[{"$nulls":6},95413]
[{"$nulls":6},95414]
[{"$nulls":6},95415]
[{"$nulls":6},95416]
[{"$nulls":6},95417]
[{"$nulls":6},95418]
[{"$nulls":6},95419]
[{"$nulls":6},95420]
[{"$nulls":6},95421]
[{"$nulls":6},95422]
[{"$nulls":6},95423]
[{"$nulls":6},95424]
[{"$nulls":6},100288]
[{"$nulls":6},100289]
[{"$nulls":6},100291]
[{"$nulls":6},100293]
[{"$nulls":6},100295]
[{"$nulls":6},100298]
[{"$nulls":6},100299]
[{"$nulls":6},100301]
[{"$nulls":6},100303]
[{"$nulls":6},100307]
[{"$nulls":6},100308]
[{"$nulls":6},100309]
[{"$nulls":6},100315]
[{"$nulls":6},100321]
[{"$nulls":6},100533]
[{"$nulls":6},100534]
[{"$nulls":6},100535]
[{"$nulls":6},100536]
[{"$nulls":6},101286]
[{"$nulls":6},101287]
[{"$nulls":6},101288]
[{"$nulls":6},101289]
[{"$nulls":6},101290]
[{"$nulls":6},101291]
[{"$nulls":6},101292]
[{"$nulls":6},101293]
[{"$nulls":6},101294]
[{"$nulls":6},101295]
[{"$nulls":6},101296]
[{"$nulls":6},101297]
[{"$nulls":6},101298]
[{"$nulls":6},101299]
[{"$nulls":6},101300]
[{"$nulls":6},101301]
[{"$nulls":6},101302]
[{"$nulls":6},101303]
[{"$nulls":6},101304]
[{"$nulls":6},101305]
[{"$nulls":6},101307]
[{"$nulls":6},101308]
[{"$nulls":6},101309]
[{"$nulls":6},101310]
[{"$nulls":6},101311]
[{"$nulls":6},101312]
[{"$nulls":6},101313]
[{"$nulls":6},101315]
[{"$nulls":6},101316]
[{"$nulls":6},101320]
[{"$nulls":6},101322]
[{"$nulls":6},101323]
[{"$nulls":6},101324]
[{"$nulls":6},101325]
[{"$nulls":6},101326]
[{"$nulls":6},101328]
[{"$nulls":6},101329]
[{"$nulls":6},101330]
[{"$nulls":6},101331]
[{"$nulls":6},101332]
[{"$nulls":6},101333]
[{"$nulls":6},101334]
[{"$nulls":6},101336]
[{"$nulls":6},101337]
[{"$nulls":6},101338]
[{"$nulls":6},101339]
[{"$nulls":6},101340]
[{"$nulls":6},101341]
[{"$nulls":6},101342]
[{"$nulls":6},101343]
[{"$nulls":6},101344]
[{"$nulls":6},101345]
[{"$nulls":6},101346]
[{"$nulls":6},101347]
[{"$nulls":6},101348]
[{"$nulls":6},101349]
[{"$nulls":6},101350]
[{"$nulls":6},101351]
[{"$nulls":6},101352]
[{"$nulls":6},101353]
[{"$nulls":6},101355]
[{"$nulls":6},101356]
[{"$nulls":6},101357]
[{"$nulls":6},101358]
[{"$nulls":6},101359]
[{"$nulls":6},101360]
[{"$nulls":6},101361]
[{"$nulls":6},101363]
[{"$nulls":6},101364]
[{"$nulls":6},101365]
[{"$nulls":6},101366]
[{"$nulls":6},101368]
[{"$nulls":6},101369]
[{"$nulls":6},101370]
[{"$nulls":6},101371]
[{"$nulls":6},101372]
[{"$nulls":6},101374]
[{"$nulls":6},101375]
[{"$nulls":6},101376]
[{"$nulls":6},101377]
[{"$nulls":6},101378]
[{"$nulls":6},101379]
[{"$nulls":6},101380]
[{"$nulls":6},101381]
[{"$nulls":6},101382]
[{"$nulls":6},101383]
[{"$nulls":6},101384]
[{"$nulls":6},101385]
[{"$nulls":6},101386]
[{"$nulls":6},101387]
[{"$nulls":6},101388]
[{"$nulls":6},101389]
[{"$nulls":6},101390]
[{"$nulls":6},101391]
[{"$nulls":6},101392]
[{"$nulls":6},101394]
[{"$nulls":6},101395]
[{"$nulls":6},101396]
[{"$nulls":6},101397]
[{"$nulls":6},101398]
[{"$nulls":6},101399]
[{"$nulls":6},101401]
[{"$nulls":6},101402]
[{"$nulls":6},101407]
[{"$nulls":6},101408]
[{"$nulls":6},101409]
[{"$nulls":6},101410]
[{"$nulls":6},101412]
[{"$nulls":6},101413]
[{"$nulls":6},101414]
[{"$nulls":6},101415]
[{"$nulls":6},101416]
[{"$nulls":6},101417]
[{"$nulls":6},101418]
[{"$nulls":6},101419]
[{"$nulls":6},101420]
[{"$nulls":6},101421]
[{"$nulls":6},101422]
[{"$nulls":6},101424]
[{"$nulls":6},101425]
[{"$nulls":6},101426]
[{"$nulls":6},101427]
[{"$nulls":6},101428]
[{"$nulls":6},101429]
[{"$nulls":6},101430]
[{"$nulls":6},101431]
[{"$nulls":6},101432]
[{"$nulls":6},101433]
[{"$nulls":6},101434]
[{"$nulls":6},101435]
[{"$nulls":6},101436]
[{"$nulls":6},101437]
[{"$nulls":6},101438]
[{"$nulls":6},101439]
[{"$nulls":6},101440]
[{"$nulls":6},101441]
[{"$nulls":6},101443]
[{"$nulls":6},101444]
[{"$nulls":6},101445]
[{"$nulls":6},101446]
[{"$nulls":6},101447]
[{"$nulls":6},101448]
[{"$nulls":6},101449]
[{"$nulls":6},101451]
[{"$nulls":6},101452]
[{"$nulls":6},101453]
[{"$nulls":6},101454]
[{"$nulls":6},101456]
[{"$nulls":6},101457]
[{"$nulls":6},101458]
[{"$nulls":6},101459]
[{"$nulls":6},101460]

{"sheet":"CRONOG","index":8,"n_rows":36,"n_cols":17,"rows_kept":36,"cut":false,"hidden":false,"merged":[[0,1,0,14],[30,0,30,1],[1,0,1,14],[2,0,2,14],[27,0,27,1],[28,0,28,1],[29,0,29,1]]}
[null,"LOGOTIPO DA EMPRESA"]
["CONTRATAÇÃO DE SERVIÇOS DE PAVIMENTAÇÃO ASFÁLTICA COM CONCRETO BETUMINOSO USINADO A QUENTE (CBUQ) EM VIAS URBANAS E RURAIS INSERIDAS NA ÁREA DE ATUAÇÃO DA 1ª SUPERINTENDÊNCIA REGIONAL DA CODEVASF, NO ESTADO DE MINAS GERAIS - ITEM X: XXXXXXXXXXX/MG"]
["Cronograma Físico e Financeiro "]
["Item","Descrição","Total Por Etapa","30 DIAS","60 DIAS","90 DIAS","120 DIAS","150 DIAS","180 DIAS","210 DIAS","240 DIAS","270 DIAS","300 DIAS","330 DIAS","360 DIAS"]
[null,{"$f":"'1.MONTES CLAROS'!E10","v":"MOBILIZAÇÃO/DESMOBILIZAÇÃO"},{"$f":"SUM(D5:O5)","v":0}]
[null,null,{"$f":"SUM('1.MONTES CLAROS'!N11:N12)","v":0},{"$nulls":12},{"$f":"SUM(D6:O6)","v":0},{"$f":"IF(P6=C6,\"OK\",\"\")","v":"OK"}]
[null,{"$f":"'1.MONTES CLAROS'!E13","v":"INSTALAÇÃO DE CANTEIRO"},{"$f":"SUM(D7:O7)","v":0}]
[null,null,{"$f":"SUM('1.MONTES CLAROS'!N14:N15)","v":0},{"$nulls":12},{"$f":"SUM(D8:O8)","v":0},{"$f":"IF(P8=C8,\"OK\",\"\")","v":"OK"}]
[null,{"$f":"'1.MONTES CLAROS'!E16","v":"ADMINISTRAÇÃO LOCAL DA OBRA"},{"$f":"SUM(D9:O9)","v":0}]
[null,null,{"$f":"SUM('1.MONTES CLAROS'!N17)","v":0},{"$nulls":12},{"$f":"SUM(D10:O10)","v":0},{"$f":"IF(P10=C10,\"OK\",\"\")","v":"OK"}]
[null,{"$f":"'1.MONTES CLAROS'!E18","v":"TERRAPLANAGEM"},{"$f":"SUM(D11:O11)","v":0}]
[null,null,{"$f":"SUM('1.MONTES CLAROS'!N19:N20)","v":0},{"$nulls":12},{"$f":"SUM(D12:O12)","v":0},{"$f":"IF(P12=C12,\"OK\",\"\")","v":"OK"}]
[null,{"$f":"'1.MONTES CLAROS'!E21","v":"PAVIMENTAÇÃO"},{"$f":"SUM(D13:O13)","v":0}]
[null,null,{"$f":"SUM('1.MONTES CLAROS'!N22:N27)","v":0},{"$nulls":12},{"$f":"SUM(D14:O14)","v":0},{"$f":"IF(P14=C14,\"OK\",\"\")","v":"OK"}]
[null,"AQUISIÇÃO E TRANSPORTE DE MATERIAL BETUMINOSO",{"$f":"SUM(D15:O15)","v":0}]
[null,null,{"$f":"SUM('1.MONTES CLAROS'!N29:N34)","v":0},{"$nulls":12},{"$f":"SUM(D16:O16)","v":0},{"$f":"IF(P16=C16,\"OK\",\"\")","v":"OK"}]
[null,{"$f":"'1.MONTES CLAROS'!E35","v":"SINALIZAÇÃO"},{"$f":"SUM(D17:O17)","v":0}]
[null,null,{"$f":"SUM('1.MONTES CLAROS'!N36:N39)","v":0},{"$nulls":12},{"$f":"SUM(D18:O18)","v":0},{"$f":"IF(P18=C18,\"OK\",\"\")","v":"OK"}]
[null,{"$f":"'1.MONTES CLAROS'!E40","v":"DRENAGEM"},{"$f":"SUM(D19:O19)","v":0}]
[null,null,{"$f":"SUM('1.MONTES CLAROS'!N41:N43)","v":0},{"$nulls":12},{"$f":"SUM(D20:O20)","v":0},{"$f":"IF(P20=C20,\"OK\",\"\")","v":"OK"}]
[null,{"$f":"'1.MONTES CLAROS'!E44","v":"SERVIÇOS COMPLEMENTARES"},{"$f":"SUM(D21:O21)","v":0}]
[null,null,{"$f":"SUM('1.MONTES CLAROS'!N45)","v":0},{"$nulls":12},{"$f":"SUM(D22:O22)","v":0},{"$f":"IF(P22=C22,\"OK\",\"\")","v":"OK"}]
[null,{"$f":"'1.MONTES CLAROS'!E46","v":"PROJETO EXECUTIVO"},{"$f":"SUM(D23:O23)","v":0}]
[null,null,{"$f":"'1.MONTES CLAROS'!N47","v":0},{"$nulls":12},{"$f":"SUM(D24:O24)","v":0},{"$f":"IF(P24=C24,\"OK\",\"\")","v":"OK"}]
[null,{"$f":"'1.MONTES CLAROS'!E48","v":"MOMENTO DE TRANSPORTE"},{"$f":"SUM(D25:O25)","v":0}]
[null,null,{"$f":"SUM('1.MONTES CLAROS'!N49:N57)","v":0},{"$nulls":12},{"$f":"SUM(D26:O26)","v":0},{"$f":"IF(P26=C26,\"OK\",\"\")","v":"OK"}]
[]
["Porcentagem",null,null,{"$f":"SUM(D6+D8+D10+D12+D14+D16+D18+D20+D22+D24+D26)/$O$33","v":{"$error":"#DIV/0!"}},{"$f":"SUM(E6+E8+E10+E12+E14+E16+E18+E20+E22+E24+E26)/$O$33","v":{"$error":"#DIV/0!"}},{"$error":"#DIV/0!"},{"$error":"#DIV/0!"},{"$error":"#DIV/0!"},{"$error":"#DIV/0!"},{"$error":"#DIV/0!"},{"$error":"#DIV/0!"},{"$error":"#DIV/0!"},{"$error":"#DIV/0!"},{"$error":"#DIV/0!"},{"$f":"SUM(O6+O8+O10+O12+O14+O16+O18+O20+O22+O24+O26)/$O$33","v":{"$error":"#DIV/0!"}}]
["Custo",null,null,{"$f":"$O$33*D28","v":{"$error":"#DIV/0!"}},{"$f":"$O$33*E28","v":{"$error":"#DIV/0!"}},{"$f":"$O$33*F28","v":{"$error":"#DIV/0!"}},{"$error":"#DIV/0!"},{"$error":"#DIV/0!"},{"$error":"#DIV/0!"},{"$error":"#DIV/0!"},{"$error":"#DIV/0!"},{"$error":"#DIV/0!"},{"$error":"#DIV/0!"},{"$error":"#DIV/0!"},{"$error":"#DIV/0!"}]
["Porcentagem Acumulado",null,null,{"$f":"D28","v":{"$error":"#DIV/0!"}},{"$f":"D30+E28","v":{"$error":"#DIV/0!"}},{"$f":"E30+F28","v":{"$error":"#DIV/0!"}},{"$error":"#DIV/0!"},{"$error":"#DIV/0!"},{"$error":"#DIV/0!"},{"$error":"#DIV/0!"},{"$error":"#DIV/0!"},{"$error":"#DIV/0!"},{"$error":"#DIV/0!"},{"$error":"#DIV/0!"},{"$f":"N30+O28","v":{"$error":"#DIV/0!"}}]
["Custo Acumulado",null,null,{"$f":"D29","v":{"$error":"#DIV/0!"}},{"$f":"D31+E29","v":{"$error":"#DIV/0!"}},{"$error":"#DIV/0!"},{"$error":"#DIV/0!"},{"$error":"#DIV/0!"},{"$error":"#DIV/0!"},{"$error":"#DIV/0!"},{"$error":"#DIV/0!"},{"$error":"#DIV/0!"},{"$error":"#DIV/0!"},{"$error":"#DIV/0!"},{"$error":"#DIV/0!"}]
[]
[null,null,null,"Total Geral",{"$nulls":9},"R$",{"$f":"C6+C8+C10+C12+C14+C16+C18+C20+C22+C24+C26","v":0}]
[]
[]
[{"$nulls":14},{"$f":"O31-O33","v":{"$error":"#DIV/0!"}}]

{"sheet":"CPU","index":9,"n_rows":67,"n_cols":9,"rows_kept":67,"cut":false,"hidden":false,"merged":[[7,0,7,7],[0,0,2,7],[3,0,3,7],[4,0,6,3],[4,6,4,7],[5,4,6,5],[8,0,9,0],[8,1,9,1],[8,2,9,2],[8,3,9,3],[8,4,9,4],[23,4,23,6],[26,5,26,6],[28,5,29,5],[28,6,29,6],[18,5,18,6],[8,7,9,7],[20,4,21,4],[20,5,21,5],[20,6,21,6],[20,7,21,7],[8,5,9,5],[8,6,9,6],[15,4,15,6],[20,0,21,0],[20,1,21,1],[20,2,21,2],[20,3,21,3],[28,0,29,0],[28,1,29,1],[28,2,29,2],[28,3,29,3],[36,0,37,0],[36,1,37,1],[36,2,37,2],[36,3,37,3],[36,4,37,4],[36,7,37,7],[39,4,39,6],[28,7,29,7],[31,4,31,6],[42,5,42,6],[34,5,34,6],[36,5,37,5],[36,6,37,6],[28,4,29,4],[52,0,53,0],[52,1,53,1],[52,2,53,2],[52,3,53,3],[52,4,53,4],[44,5,45,5],[44,6,45,6],[44,7,45,7],[47,4,47,6],[50,5,50,6],[44,0,45,0],[44,1,45,1],[44,2,45,2],[44,3,45,3],[44,4,45,4],[60,0,61,0],[60,1,61,1],[60,2,61,2],[60,3,61,3],[60,4,61,4],[60,7,61,7],[63,4,63,6],[66,5,66,6],[52,5,53,5],[52,6,53,6],[55,4,55,6],[58,5,58,6],[60,5,61,5],[60,6,61,6],[52,7,53,7]]}
["LOGOTIPO DA EMPRESA"]
[]
[]
["CONTRATAÇÃO DE SERVIÇOS DE PAVIMENTAÇÃO ASFÁLTICA COM CONCRETO BETUMINOSO USINADO A QUENTE (CBUQ) EM VIAS URBANAS E RURAIS INSERIDAS NA ÁREA DE ATUAÇÃO DA 1ª SUPERINTENDÊNCIA REGIONAL DA CODEVASF, NO ESTADO DE MINAS GERAIS - ITEM X: XXXXXXXXXXX/MG"]
[{"$nulls":5},"BDI %:",{"$f":"BDI!C17","v":0}]
[{"$nulls":4},"Encargos Sociais:",null,"Horista","Mensalista"]
[{"$nulls":6},{"$f":"'ENC.SOC.'!E51/100","v":0},{"$f":"'ENC.SOC.'!F51/100","v":0}]
["COMPOSIÇÕES DE CUSTO UNITARIO"]
["CPU-12","CODEVASF",null,"Correção de vazamentos no ramal na rua sem pavimento com fornecimento do material hidráulico","M","COEF.","PRECO UNITÁRIO (R$)","TOTAL (R$)"]
[]
["SICRO","SICRO","P9824","Servente","H",null,null,{"$f":"F11*G11","v":0}]
["SICRO","SICRO","P9807","Bombeiro hidráulico","H",null,null,0]
["INS. SINAPI","SINAPI",9867,"TUBO PVC, SOLDAVEL, DN 20 MM, AGUA FRIA (NBR-5648)","m",null,null,0]
["INSUMO","ORSE",10585,"Arco de serra","un",null,null,0]
["INS. SINAPI","SINAPI",3859,"LUVA SOLDAVEL COM ROSCA, PVC, 20 MM X 1/2\", PARA AGUA FRIA PREDIAL","un",null,null,0]
[{"$nulls":4},"Sub total:",null,null,{"$f":"SUM(H11:H15)","v":0}]
[{"$nulls":5},"BDI",0.2339,{"$f":"H16*G17","v":0}]
[{"$nulls":6},"Total Serviços:",{"$f":"H16+H17","v":0}]
[{"$nulls":4},{"$f":"A9","v":"CPU-12"},"PREÇO UNITÁRIO TOTAL:",null,{"$f":"H18","v":0},{"$f":"H16","v":0}]
[]
["CPU-13","CODEVASF",null,"AQUISIÇÃO DE CIMENTO ASFALTICO CAP 50/70","t","COEF.","PRECO UNITÁRIO (R$)","TOTAL (R$)"]
[]
[null,null,null,"CIMENTO ASFALTICO 50/70","t",null,null,{"$f":"F23*G23","v":0}]
[{"$nulls":4},"Sub total:",null,null,{"$f":"SUM(H23)","v":0}]
[{"$nulls":5},"BDI",0.15,{"$f":"H24*G25","v":0}]
[{"$nulls":6},"Total Serviços:",{"$f":"H24+H25","v":0}]
[{"$nulls":4},{"$f":"A21","v":"CPU-13"},"PREÇO UNITÁRIO TOTAL:",null,{"$f":"H26","v":0},{"$f":"H24","v":0}]
[]
["CPU-14","CODEVASF",null,"AQUISIÇÃO DE EAI","t","COEF.","PRECO UNITÁRIO (R$)","TOTAL (R$)"]
[]
[null,null,null,"EAI","t",null,null,{"$f":"F31*G31","v":0}]
[{"$nulls":4},"Sub total:",null,null,{"$f":"SUM(H31)","v":0}]
[{"$nulls":5},"BDI",0.15,{"$f":"H32*G33","v":0}]
[{"$nulls":6},"Total Serviços:",{"$f":"H32+H33","v":0}]
[{"$nulls":4},{"$f":"A29","v":"CPU-14"},"PREÇO UNITÁRIO TOTAL:",null,{"$f":"H34","v":0},{"$f":"H32","v":0}]
[]
["CPU-15","CODEVASF",null,"AQUISIÇÃO DE EMULSÃO ASFÁLTICA RR-1C","t","COEF.","PRECO UNITÁRIO (R$)","TOTAL (R$)"]
[]
[null,null,null,"EMULSÃO ASFÁLTICA RR-1C","t",null,null,{"$f":"F39*G39","v":0}]
[{"$nulls":4},"Sub total:",null,null,{"$f":"SUM(H39)","v":0}]
[{"$nulls":5},"BDI",0.15,{"$f":"ROUND(H40,2)*ROUND(G41,4)","v":0}]
[{"$nulls":6},"Total Serviços:",{"$f":"H40+H41","v":0}]
[{"$nulls":4},{"$f":"A37","v":"CPU-15"},"PREÇO UNITÁRIO TOTAL:",null,{"$f":"H42","v":0},{"$f":"H40","v":0}]
[]
["CPU-17","CODEVASF",null,"TRANSPORTE DE CIMENTO ASFALTICO CAP 50/70","t","COEF.","PRECO UNITÁRIO (R$)","TOTAL (R$)"]
[]
[null,null,null,"TRANSPORTE DE CIMENTO ASFALTICO 50/70","t",null,null,{"$f":"F47*G47","v":0}]
[{"$nulls":4},"Sub total:",null,null,{"$f":"SUM(H47)","v":0}]
[{"$nulls":5},"BDI",0.15,{"$f":"H48*G49","v":0}]
[{"$nulls":6},"Total Serviços:",{"$f":"H48+H49","v":0}]
[{"$nulls":4},{"$f":"A45","v":"CPU-17"},"PREÇO UNITÁRIO TOTAL:",null,{"$f":"H50","v":0},{"$f":"H48","v":0}]
[]
["CPU-18","CODEVASF",null,"TRANSPORTE DE EAI","t","COEF.","PRECO UNITÁRIO (R$)","TOTAL (R$)"]
[]
[null,null,null,"TRANSPORTE DE EAI","t",null,null,{"$f":"F55*G55","v":0}]
[{"$nulls":4},"Sub total:",null,null,{"$f":"SUM(H55)","v":0}]
[{"$nulls":5},"BDI",0.15,{"$f":"H56*G57","v":0}]
[{"$nulls":6},"Total Serviços:",{"$f":"H56+H57","v":0}]
[{"$nulls":4},{"$f":"A53","v":"CPU-18"},"PREÇO UNITÁRIO TOTAL:",null,{"$f":"H58","v":0},{"$f":"H56","v":0}]
[]
["CPU-19","CODEVASF",null,"TRANSPORTE DE EMULSÃO ASFÁLTICA RR-1C","t","COEF.","PRECO UNITÁRIO (R$)","TOTAL (R$)"]
[]
[null,null,null,"TRANSPORTE DE EMULSÃO ASFÁLTICA RR-1C","t",null,null,{"$f":"F63*G63","v":0}]
[{"$nulls":4},"Sub total:",null,null,{"$f":"SUM(H63)","v":0}]
[{"$nulls":5},"BDI",0.15,{"$f":"H64*G65","v":0}]
[{"$nulls":6},"Total Serviços:",{"$f":"H64+H65","v":0}]
[{"$nulls":4},{"$f":"A61","v":"CPU-19"},"PREÇO UNITÁRIO TOTAL:",null,{"$f":"H66","v":0},{"$f":"H64","v":0}]

{"sheet":"MOB","index":10,"n_rows":67,"n_cols":8,"rows_kept":67,"cut":false,"hidden":false,"merged":[[0,0,2,7],[10,6,10,7],[60,0,60,1],[10,0,11,0],[10,1,11,1],[10,2,11,2],[10,3,11,3],[10,4,11,4],[10,5,11,5],[3,0,3,7],[4,0,8,4],[4,5,4,6],[5,5,6,6],[5,7,6,7],[7,5,8,6],[7,7,8,7]]}
[]
[]
[]
["CONTRATAÇÃO DE SERVIÇOS DE PAVIMENTAÇÃO ASFÁLTICA COM CONCRETO BETUMINOSO USINADO A QUENTE (CBUQ) EM VIAS URBANAS E RURAIS INSERIDAS NA ÁREA DE ATUAÇÃO DA 1ª SUPERINTENDÊNCIA REGIONAL DA CODEVASF, NO ESTADO DE MINAS GERAIS - ITEM X: XXXXXXXXXXX/MG"]
["MOBILIZAÇÃO/DESMOBILIZAÇÃO (MOB)",{"$nulls":4},"Frentes de serviços"]
[{"$nulls":5},"Distância da Capital ao Canteiro:"]
[]
[{"$nulls":5},"Velocidade média de transporte (pavim.):"]
[]
["Transporte dos equipamentos"]
["CODIGO","EQUIPAMENTO","VEÍCULO TRANSPORTADOR","QTDE","K","FU","CUSTO DO TRANSPORTE"]
[{"$nulls":6},"(R$/h)","(R$)/km"]
["E9524","Motoniveladora - 93 kW","E9665",{"$nulls":4},{"$f":"((D13*E13*F13)/$H$8)*G13","v":{"$error":"#DIV/0!"}}]
["E9526","Retroescavadeira de pneus - capacidade da caçamba da pá-carregadeira de 0,76 m³ e da retroescavadeira de 0,29 m³ - 58 kW ","E9665",{"$nulls":4},{"$f":"((D14*E14*F14)/$H$8)*G14","v":{"$error":"#DIV/0!"}}]
["E9577","Trator agrícola sobre pneus - 77 kW","E9665",{"$nulls":4},{"$error":"#DIV/0!"}]
["E9518","Grade de 24 discos rebocável de D = 60 cm (24\")","Veículo(s) da própria frota.",{"$nulls":4},{"$error":"#DIV/0!"}]
["E9615","Usina misturadora de solos com capacidade de 300 t/h - 44 kW","E9018",{"$nulls":4},{"$error":"#DIV/0!"}]
["E9689","Usina de asfalto a quente gravimétrica com capacidade de 100/140 t/h - 260 kW","E9666",{"$nulls":4},{"$error":"#DIV/0!"}]
["E9530","Rolo compactador liso vibratório autopropelido por pneus de 11 t - 97 kW","E9666",{"$nulls":4},{"$error":"#DIV/0!"}]
["E9558","Tanque de estocagem de asfalto com capacidade de 30.000 l","E9665",{"$nulls":4},{"$error":"#DIV/0!"}]
["E9758","Vibroacabadora de asfalto sobre pneus - 82 kW","E9018",{"$nulls":4},{"$error":"#DIV/0!"}]
["E9685","Rolo compactador pé de carneiro vibratório autopropelido por pneus de 11,6 t - 82 kW","E9666",{"$nulls":4},{"$error":"#DIV/0!"}]
["E9605","Caminhão tanque com capacidade de 6.000 l - 136 kW","E9605",{"$nulls":4},{"$error":"#DIV/0!"}]
["E9579","Caminhão basculante com capacidade de 10 m³ - 210 kW","E9579",{"$nulls":4},{"$error":"#DIV/0!"}]
["E9509","Caminhão tanque distribuidor de asfalto com capacidade de 6.000 l - 7 kW/136 kW","E9509",{"$nulls":4},{"$error":"#DIV/0!"}]
["E9762","Rolo compactador de pneus autopropelido de 27 t - 85 kW","E9666",{"$nulls":4},{"$error":"#DIV/0!"}]
["E9681","Rolo compactador liso tandem vibratório autopropelido de 10,4 t - 82 kW","E9666",{"$nulls":4},{"$error":"#DIV/0!"}]
["E9545","Vibroacabadora de asfalto sobre esteiras - 82 kW","E9018",{"$nulls":4},{"$error":"#DIV/0!"}]
["E9571","Caminhão tanque com capacidade de 10.000 l - 188 kW","E9571",{"$nulls":4},{"$error":"#DIV/0!"}]
["E9514","Distribuidor de agregados sobre pneus autopropelido - 130 kW","E9665",{"$nulls":4},{"$error":"#DIV/0!"}]
["E9511","Carregadeira de pneus com capacidade de 3,40 m³ - 195 kW","E9665",{"$nulls":4},{"$error":"#DIV/0!"}]
["E9779","Grupo gerador - 113 kVA","Veículo(s) da própria frota.",{"$nulls":4},{"$error":"#DIV/0!"}]
["E9559","Aquecedor de fluido térmico - 12 kW","Veículo(s) da própria frota.",{"$nulls":4},{"$error":"#DIV/0!"}]
["E9584","Carregadeira de pneus com capacidade de 1,72 m³ - 113 kW","E9665",{"$nulls":4},{"$error":"#DIV/0!"}]
["E9021","Grupo gerador - 456 kVA","E9508",{"$nulls":4},{"$error":"#DIV/0!"}]
["E9687","Caminhão carroceria com capacidade de 5 t - 115 kW","E9687",{"$nulls":4},{"$error":"#DIV/0!"}]
["E9667","Caminhão basculante com capacidade de 14 m³ - 210 kW","E9667",{"$nulls":4},{"$error":"#DIV/0!"}]
["E9644","Caminhão demarcador de faixas com sistema de pintura a frio - 28 kW/115 kW","E9644",{"$nulls":4},{"$error":"#DIV/0!"}]
["E9592","Caminhão carroceria com capacidade de 15 t - 188 kW","E9592",{"$nulls":4},{"$error":"#DIV/0!"}]
["E9540","Trator sobre esteiras com lâmina - 127 kW","E9018",{"$nulls":4},{"$error":"#DIV/0!"}]
["E9515","Escavadeira hidráulica sobre esteiras com caçamba com capacidade de 1,56 m³ - 118 kW","E9666",{"$nulls":4},{"$error":"#DIV/0!"}]
["E9506","Caminhão basculante com capacidade de 6 m³ - 136 kW","E9506",{"$nulls":4},{"$error":"#DIV/0!"}]
["E9256","Equipamento para pintura com cal rebocável com dois bicos aplicadores e capacidade de 2.200 l","Veículo(s) da própria frota.",{"$nulls":4},{"$error":"#DIV/0!"}]
["E9156","Soprador de ar costal - 2,6 kW","Veículo(s) da própria frota.",{"$nulls":4},{"$error":"#DIV/0!"}]
["E9146","Caminhão silo com capacidade de 30 m³ - 265 kW","E9146",{"$nulls":4},{"$error":"#DIV/0!"}]
["E9010","Balança plataforma digital à bateria, com mesa de 75 x 75 cm e capacidade de 500 kg","Veículo(s) da própria frota.",{"$nulls":4},{"$error":"#DIV/0!"}]
["E9519","Betoneira com motor a gasolina com capacidade de 600 l - 10 kW","Veículo(s) da própria frota.",{"$nulls":4},{"$error":"#DIV/0!"}]
["E9071","Transportador manual carrinho de mão com capacidade de 80 l","Veículo(s) da própria frota.",{"$nulls":4},{"$error":"#DIV/0!"}]
["E9064","Transportador manual gerica com capacidade de 180 l","Veículo(s) da própria frota.",{"$nulls":4},{"$error":"#DIV/0!"}]
["E9066","Grupo gerador - 14 kVA","Veículo(s) da própria frota.",{"$nulls":4},{"$error":"#DIV/0!"}]
["E9535","Serra circular com bancada - D = 30 cm - 4 kW","Veículo(s) da própria frota.",{"$nulls":4},{"$error":"#DIV/0!"}]
["E9507","Plotadora de recorte com computador e programa computacional","Veículo(s) da própria frota.",{"$nulls":4},{"$error":"#DIV/0!"}]
["E9568","Furadeira de impacto de 12,5 mm - 0,80 kW","Veículo(s) da própria frota.",{"$nulls":4},{"$error":"#DIV/0!"}]
["E9753","Grupo gerador - 23 kVA","Veículo(s) da própria frota.",{"$nulls":4},{"$error":"#DIV/0!"}]
["E9623","Máquina de bancada guilhotina - 4,00 kW","Veículo(s) da própria frota.",{"$nulls":4},{"$error":"#DIV/0!"}]
["E9622","Máquina de bancada universal para corte de chapa - 1,50 kW","Veículo(s) da própria frota.",{"$nulls":4},{"$error":"#DIV/0!"}]
["E9678","Fresadora a frio - 455 kW","E9666",{"$nulls":4},{"$error":"#DIV/0!"}]
[{"$nulls":6},"TOTAL",{"$f":"SUM(H13:H57)","v":{"$error":"#DIV/0!"}}]
[]
[]
["CUSTO TOTAL MOBILIZAÇÃO E DESMOBILIZAÇÃO"]
["DESCRIÇÃO","VALOR"]
["Custo Mobilização (km)",{"$f":"H58","v":{"$error":"#DIV/0!"}}]
["BDI (%)",{"$f":"BDI!C17","v":0}]
["Custo Mobilização (R$/km) com BDI",{"$f":"B63+(B63*B64)","v":{"$error":"#DIV/0!"}}]
["Total de Frentes",{"$f":"#REF!","v":{"$error":"#REF!"}}]
["Custo Mobilização (frentes x distancia)",{"$f":"B65*H6*B66","v":{"$error":"#DIV/0!"}}]

{"sheet":"CANT","index":11,"n_rows":13,"n_cols":6,"rows_kept":13,"cut":false,"hidden":false,"merged":[[12,3,12,4],[0,0,2,5],[3,0,3,5],[3,9,4,9],[4,7,4,8],[9,3,9,4]]}
["LOGOTIPO DA EMPRESA"]
[]
[]
["CANTEIRO DE OBRAS PARA CONSTRUÇAO RODOVIÁRIA"]
["Descrição dos serviços","Tipo de container","Unidade","Quantidade","Preço unitário (R$)","Total (R$)"]
["Escritório e seção técnica"]
["LOCACAO DE CONTAINER 2,30 X 6,00 M, ALT. 2,50 M, PARA ESCRITORIO, SEM DIVISORIAS INTERNAS E SEM SANITARIO (NAO INCLUI MOBILIZACAO/DESMOBILIZACAO)                                                                                                                                                                                                                                                                                                                                                         ",10776,"und",1,null,{"$f":"TRUNC(D7*E7,2)","v":0}]
["Banheiro e vestiário"]
["LOCACAO DE CONTAINER 2,30 X 4,30 M, ALT. 2,50 M, PARA SANITARIO, COM 3 BACIAS, 4 CHUVEIROS, 1 LAVATORIO E 1 MICTORIO (NAO INCLUI MOBILIZACAO/DESMOBILIZACAO)                                                                                                                                                                                                                                                                                                                                              ",10777,"und",1,null,{"$f":"TRUNC(D9*E9,2)","v":0}]
[null,null,null,"TOTAL DO CANTEIRO",null,{"$f":"SUM(F7:F9)","v":0}]
[null,null,null,"DURAÇÃO (MESES)",null,{"$f":"F10*E11","v":0}]
[null,null,null,"BDI",null,{"$f":"BDI!C17","v":0}]
[null,null,null,"TOTAL DO CANTEIRO (com BDI)",null,{"$f":"F11+(F11*F12)","v":0}]

{"sheet":"ADM.LOC.","index":12,"n_rows":252,"n_cols":10,"rows_kept":252,"cut":false,"hidden":false,"merged":[[0,0,0,8],[1,0,1,8],[2,3,2,4],[2,5,2,6],[2,7,2,8],[3,3,3,4],[3,5,3,6],[3,7,3,8],[6,3,6,4],[6,5,6,6],[6,7,6,8],[7,3,7,4],[7,5,7,6],[7,7,7,8],[4,3,4,4],[4,5,4,6],[4,7,4,8],[5,3,5,4],[5,5,5,6],[5,7,5,8],[10,3,10,4],[10,5,10,6],[10,7,10,8],[11,3,11,4],[11,5,11,6],[11,7,11,8],[8,3,8,4],[8,5,8,6],[8,7,8,8],[9,3,9,4],[9,5,9,6],[9,7,9,8],[14,3,14,4],[14,5,14,6],[14,7,14,8],[15,3,15,4],[15,5,15,6],[15,7,15,8],[12,3,12,4],[12,5,12,6],[12,7,12,8],[13,3,13,4],[13,5,13,6],[13,7,13,8],[18,3,18,4],[18,5,18,6],[18,7,18,8],[19,3,19,4],[19,5,19,6],[19,7,19,8],[16,3,16,4],[16,5,16,6],[16,7,16,8],[17,3,17,4],[17,5,17,6],[17,7,17,8],[22,3,22,4],[22,5,22,6],[22,7,22,8],[23,3,23,4],[23,5,23,6],[23,7,23,8],[20,3,20,4],[20,5,20,6],[20,7,20,8],[21,3,21,4],[21,5,21,6],[21,7,21,8],[26,3,26,4],[26,5,26,6],[26,7,26,8],[27,3,27,4],[27,5,27,6],[27,7,27,8],[24,3,24,4],[24,5,24,6],[24,7,24,8],[25,3,25,4],[25,5,25,6],[25,7,25,8],[49,3,49,4],[49,5,49,6],[49,7,49,8],[50,3,50,4],[50,5,50,6],[50,7,50,8],[30,0,30,8],[46,0,46,8],[47,3,47,4],[47,5,47,6],[47,7,47,8],[48,3,48,4],[48,5,48,6],[48,7,48,8],[60,3,60,4],[60,5,60,6],[60,7,60,8],[61,3,61,4],[61,5,61,6],[61,7,61,8],[51,5,51,6],[51,7,51,8],[58,0,58,8],[59,3,59,4],[59,5,59,6],[59,7,59,8],[95,3,95,4],[95,5,95,6],[95,7,95,8],[96,3,96,4],[96,5,96,6],[96,7,96,8],[62,3,62,4],[62,5,62,6],[62,7,62,8],[63,5,63,6],[63,7,63,8],[94,0,94,8],[70,0,70,8],[71,3,71,4],[71,5,71,6],[71,7,71,8],[72,3,72,4],[72,5,72,6],[72,7,72,8],[73,3,73,4],[73,5,73,6],[73,7,73,8],[74,3,74,4],[74,5,74,6],[99,3,99,4],[99,5,99,6],[99,7,99,8],[100,5,100,6],[100,7,100,8],[107,0,107,8],[97,3,97,4],[97,5,97,6],[97,7,97,8],[98,3,98,4],[98,5,98,6],[98,7,98,8],[110,3,110,4],[110,5,110,6],[110,7,110,8],[111,3,111,4],[111,5,111,6],[111,7,111,8],[108,3,108,4],[108,5,108,6],[108,7,108,8],[109,3,109,4],[109,5,109,6],[109,7,109,8],[114,5,114,6],[114,7,114,8],[116,0,116,8],[117,3,117,4],[117,5,117,6],[117,7,117,8],[112,3,112,4],[112,5,112,6],[112,7,112,8],[113,3,113,4],[113,5,113,6],[113,7,113,8],[120,3,120,4],[120,5,120,6],[120,7,120,8],[121,5,121,6],[121,7,121,8],[123,0,123,8],[118,3,118,4],[118,5,118,6],[118,7,118,8],[119,3,119,4],[119,5,119,6],[119,7,119,8],[128,3,128,4],[128,5,128,6],[128,7,128,8],[124,3,124,4],[124,5,124,6],[124,7,124,8],[125,3,125,4],[125,5,125,6],[125,7,125,8],[126,3,126,4],[126,5,126,6],[126,7,126,8],[127,3,127,4],[127,5,127,6],[127,7,127,8],[133,3,133,4],[133,5,133,6],[133,7,133,8],[134,3,134,4],[134,5,134,6],[134,7,134,8],[129,5,129,6],[129,7,129,8],[131,0,131,8],[132,3,132,4],[132,5,132,6],[132,7,132,8],[137,3,137,4],[137,5,137,6],[137,7,137,8],[138,3,138,4],[138,5,138,6],[138,7,138,8],[135,3,135,4],[135,5,135,6],[135,7,135,8],[136,3,136,4],[136,5,136,6],[136,7,136,8],[143,3,143,4],[143,5,143,6],[143,7,143,8],[144,3,144,4],[144,5,144,6],[144,7,144,8],[139,3,139,4],[139,5,139,6],[139,7,139,8],[140,5,140,6],[140,7,140,8],[142,0,142,8],[150,3,150,4],[150,5,150,6],[150,7,150,8],[151,3,151,4],[151,5,151,6],[151,7,151,8],[145,3,145,4],[145,5,145,6],[145,7,145,8],[147,5,147,6],[147,7,147,8],[149,0,149,8],[146,3,146,4],[146,5,146,6],[146,7,146,8],[155,3,155,4],[155,5,155,6],[155,7,155,8],[156,5,156,6],[156,7,156,8],[202,0,202,8],[152,3,152,4],[152,5,152,6],[152,7,152,8],[154,3,154,4],[154,5,154,6],[154,7,154,8],[195,0,195,8],[196,1,196,4],[199,1,199,4],[197,1,197,4],[198,1,198,4],[192,1,192,4],[158,0,158,8],[160,1,160,4],[159,0,159,8],[173,0,173,8],[174,0,174,8],[175,1,175,4],[205,3,205,4],[205,5,205,6],[205,7,205,8],[206,3,206,4],[206,5,206,6],[206,7,206,8],[203,3,203,4],[203,5,203,6],[203,7,203,8],[204,3,204,4],[204,5,204,6],[204,7,204,8],[208,7,208,8],[215,3,215,4],[215,5,215,6],[215,7,215,8],[212,3,212,4],[212,5,212,6],[212,7,212,8],[213,3,213,4],[213,5,213,6],[213,7,213,8],[209,3,209,4],[209,5,209,6],[209,7,209,8],[211,3,211,4],[211,5,211,6],[211,7,211,8],[207,3,207,4],[207,5,207,6],[207,7,207,8],[208,3,208,4],[208,5,208,6],[228,3,228,4],[228,5,228,6],[228,7,228,8],[229,3,229,4],[229,5,229,6],[229,7,229,8],[222,3,222,4],[222,5,222,6],[222,7,222,8],[223,3,223,4],[223,5,223,6],[223,7,223,8],[216,3,216,4],[216,5,216,6],[216,7,216,8],[217,7,217,8],[214,3,214,4],[214,5,214,6],[214,7,214,8],[230,7,230,8],[224,3,224,4],[224,5,224,6],[224,7,224,8],[225,3,225,4],[225,5,225,6],[225,7,225,8],[238,3,238,4],[238,5,238,6],[238,7,238,8],[231,3,231,4],[231,5,231,6],[231,7,231,8],[239,3,239,4],[239,5,239,6],[239,7,239,8],[240,3,240,4],[240,5,240,6],[232,3,232,4],[232,5,232,6],[232,7,232,8],[233,3,233,4],[233,5,233,6],[233,7,233,8],[237,7,237,8],[234,3,234,4],[234,5,234,6],[234,7,234,8],[235,3,235,4],[235,5,235,6],[235,7,235,8],[236,3,236,4],[236,5,236,6],[236,7,236,8],[237,3,237,4],[237,5,237,6],[240,7,240,8],[250,3,250,4],[250,5,250,6],[251,3,251,4],[251,5,251,6],[247,7,247,8],[248,3,248,4],[248,5,248,6],[248,7,248,8],[249,3,249,4],[249,5,249,6],[249,7,249,8],[245,3,245,4],[245,5,245,6],[245,7,245,8],[246,3,246,4],[246,5,246,6],[246,7,246,8],[243,3,243,4],[243,5,243,6],[241,3,241,4],[241,5,241,6],[241,7,241,8],[242,3,242,4],[242,5,242,6],[242,7,242,8],[243,7,243,8],[244,3,244,4],[244,5,244,6],[244,7,244,8],[74,7,74,8],[75,5,75,6],[75,7,75,8],[82,0,82,8],[83,3,83,4],[83,5,83,6],[83,7,83,8],[84,3,84,4],[84,5,84,6],[84,7,84,8],[85,3,85,4],[85,5,85,6],[85,7,85,8],[86,3,86,4],[86,5,86,6],[86,7,86,8],[87,5,87,6],[87,7,87,8],[230,3,230,4],[230,5,230,6],[153,3,153,4],[153,5,153,6],[153,7,153,8],[191,1,191,4],[226,3,226,4],[226,5,226,6],[226,7,226,8],[227,3,227,4],[227,5,227,6],[227,7,227,8],[189,1,189,4],[188,0,188,8],[190,1,190,4],[221,0,221,8]]}
["LOGOTIPO DA EMPRESA"]
["parcela fixa da administração local \n(mão de obra)"]
["Código","Discriminação ","Unidade"," Quantidade ",null,"Custo Unitário (R$)",null," Custo Total (R$)"]
[null,"Mão de Obra"]
[null,"Gerência Técnica"]
[null,"Geral"]
["P9955","Engenheiro chefe","mês",{"$nulls":4},{"$f":"F7*D7","v":0}]
["P9840","Encarregado geral","mês",{"$nulls":4},{"$f":"F8*D8","v":0}]
["P9897","Técnico de meio ambiente","mês",{"$nulls":4},{"$f":"F9*D9","v":0}]
["P9948","Motorista","mês",{"$nulls":4},{"$f":"F10*D10","v":0}]
["P9878","Secretária","mês",{"$nulls":4},{"$f":"F11*D11","v":0}]
[{"$nulls":5},"Subtotal do Item 1.1",null,{"$f":"SUM(H7:I11)","v":0}]
[null,"Auxiliar"]
["P9946","Engenheiro auxiliar","mês",{"$nulls":4},{"$f":"D14*F14","v":0}]
["P9903","Auxiliar técnico","mês",{"$nulls":4},{"$f":"D15*F15","v":0}]
[{"$nulls":5},"Subtotal do Item 1.2",null,{"$f":"SUM(H14:I15)","v":0}]
[null,"Gerência Administrativa"]
[null,"Geral"]
["P9883","Chefe do setor administrativo","mês",{"$nulls":4},{"$f":"F19*D19","v":0}]
["P9809","Encarregado administrativo","mês",{"$nulls":4},{"$f":"F20*D20","v":0}]
["P9896","Porteiro","mês",{"$nulls":4},{"$f":"F21*D21","v":0}]
["P9827","Vigia","mês",{"$nulls":4},{"$f":"F22*D22","v":0}]
["P9948","Motorista","mês",{"$nulls":4},{"$f":"F23*D23","v":0}]
[{"$nulls":5},"Subtotal do Item 1.3",null,{"$f":"SUM(H19:I23)","v":0}]
[null,"Auxiliar"]
["P9806","Auxiliar administrativo","mês",{"$nulls":4},{"$f":"F26*D26","v":0}]
["P9842","Faxineiro","mês",{"$nulls":4},{"$f":"F27*D27","v":0}]
[{"$nulls":5},"Subtotal do Item 1.4",null,{"$f":"SUM(H26:I27)","v":0}]
[{"$nulls":7},"Total da Mão de Obra da Parcela Fixa",{"$f":"H28+H24+H16+H12","v":0}]
[]
["parcela fixa da administração local \n(veículos)"]
["Código","Discriminação ","Unidade"," Quantidade ","Utilização Produtiva","Utilização Improdutiva","Custo Horário \nProdutivo (R$)","Custo Horário Improdutivo (R$)","Custo Total (R$)"]
[2,"Veículos"]
[null,"Gerência Técnica"]
["2.1","Geral"]
["E9093","Veículo Leve 53 kw","mês",{"$nulls":5},{"$f":"((E36*G36)+(F36*H36))*D36","v":0}]
["E9560","Ônibus coletivo - 175 kw","mês",{"$nulls":5},{"$f":"((E37*G37)+(F37*H37))*D37","v":0}]
[{"$nulls":7},"Subtotal do Item 2",{"$f":"SUM(I36:I37)","v":0}]
["2.2","Auxiliar"]
["E9093","Veículo Leve 53 kw","mês",null,null,null,{"$f":"G36","v":0},{"$f":"H36","v":0},{"$f":"((E40*G40)+(F40*H40))*D40","v":0}]
[{"$nulls":7},"Subtotal do Item 2",{"$f":"SUM(I40)","v":0}]
["2.3","Gerência Administrativa"]
["E9093","Veículo Leve 53 kw","mês",null,null,null,{"$f":"G36","v":0},{"$f":"H36","v":0},{"$f":"((E43*G43)+(F43*H43))*D43","v":0}]
[{"$nulls":7},"Subtotal do Item 2",{"$f":"I43","v":0}]
[{"$nulls":7},"Total dos Veículos da Parcela Fixa",{"$f":"I44+I41+I38","v":0}]
[]
["Composição de custo da equipe de produção de terraplenagem"]
["Código","Discriminação ","Unidade"," Quantidade ",null,"Custo Unitário (R$)",null," Custo Total (R$)"]
[null,"Equipe de Produção de Terraplenagem"]
["3.1","Mão de Obra"]
["P9884","Encarregado de produção ","mês",{"$nulls":4},{"$f":"F51*D51","v":0}]
[{"$nulls":5},"Subtotal do Item 3.1",null,{"$f":"SUM(H51:H51)","v":0}]
["Código","Discriminação ","Unidade"," Quantidade ","Utilização Produtiva","Utilização Improdutiva","Custo Horário \nProdutivo (R$)","Custo Horário Improdutivo (R$)","Custo Total (R$)"]
["3.2","Veículos"]
[null,"Veículo Leve 53 kw","mês",null,null,null,{"$f":"G36","v":0},{"$f":"H36","v":0},{"$f":"((E55*G55)+(F55*H55))*D55","v":0}]
[{"$nulls":7},"Subtotal do Item 3.2",{"$f":"SUM(I55:I55)","v":0}]
[{"$nulls":7},"Total da Equipe de Produção de Terraplenagem",{"$f":"I56+H52","v":0}]
[]
["Composição de custo da equipe de produção de pavimentação"]
["Código","Discriminação ","Unidade"," Quantidade ",null,"Custo Unitário (R$)",null," Custo Total (R$)"]
[null,"Equipe de Produção de Pavimentação"]
["3.1","Mão de Obra"]
["P9893","Encarregado de produção ","mês",{"$nulls":4},{"$f":"F63*D63","v":0}]
[{"$nulls":5},"Subtotal do Item 3.1",null,{"$f":"SUM(H63:H63)","v":0}]
["Código","Discriminação ","Unidade"," Quantidade ","Utilização Produtiva","Utilização Improdutiva","Custo Horário \nProdutivo (R$)","Custo Horário Improdutivo (R$)","Custo Total (R$)"]
["3.2","Veículos"]
[null,"Veículo Leve 53 kw","mês",null,null,null,{"$f":"$G$36","v":0},{"$f":"$H$36","v":0},{"$f":"((E67*G67)+(F67*H67))*D67","v":0}]
[{"$nulls":7},"Subtotal do Item 3.2",{"$f":"SUM(I67:I67)","v":0}]
[{"$nulls":7},"Total da Equipe de Produção de Pavimentação",{"$f":"I68+H64","v":0}]
[]
["Composição de custo da equipe de produção de drenagem"]
["Código","Discriminação ","Unidade"," Quantidade ",null,"Custo Unitário (R$)",null," Custo Total (R$)"]
[null,"Equipe de Produção de Pavimentação"]
["3.1","Mão de Obra"]
["P9893","Encarregado de produção ","mês",{"$nulls":4},{"$f":"F75*D75","v":0}]
[{"$nulls":5},"Subtotal do Item 3.1",null,{"$f":"SUM(H75:H75)","v":0}]
["Código","Discriminação ","Unidade"," Quantidade ","Utilização Produtiva","Utilização Improdutiva","Custo Horário \nProdutivo (R$)","Custo Horário Improdutivo (R$)","Custo Total (R$)"]
["3.2","Veículos"]
[null,"Veículo Leve 53 kw","mês",null,null,null,{"$f":"$G$36","v":0},{"$f":"$H$36","v":0},{"$f":"((E79*G79)+(F79*H79))*D79","v":0}]
[{"$nulls":7},"Subtotal do Item 3.2",{"$f":"SUM(I79:I79)","v":0}]
[{"$nulls":7},"Total da Equipe de Produção de Pavimentação",{"$f":"I80+H76","v":0}]
[]
["Composição de custo da equipe de produção de sinalização"]
["Código","Discriminação ","Unidade"," Quantidade ",null,"Custo Unitário (R$)",null," Custo Total (R$)"]
[null,"Equipe de Produção de Pavimentação"]
["3.1","Mão de Obra"]
["P9893","Encarregado de produção ","mês",{"$nulls":4},{"$f":"F87*D87","v":0}]
[{"$nulls":5},"Subtotal do Item 3.1",null,{"$f":"SUM(H87:H87)","v":0}]
["Código","Discriminação ","Unidade"," Quantidade ","Utilização Produtiva","Utilização Improdutiva","Custo Horário \nProdutivo (R$)","Custo Horário Improdutivo (R$)","Custo Total (R$)"]
["3.2","Veículos"]
[null,"Veículo Leve 53 kw","mês",null,null,null,{"$f":"$G$36","v":0},{"$f":"$H$36","v":0},{"$f":"((E91*G91)+(F91*H91))*D91","v":0}]
[{"$nulls":7},"Subtotal do Item 3.2",{"$f":"SUM(I91:I91)","v":0}]
[{"$nulls":7},"Total da Equipe de Produção de Pavimentação",{"$f":"I92+H88","v":0}]
[]
["Composição de custo da equipe topografia"]
["Código","Discriminação ","Unidade"," Quantidade ",null,"Custo Unitário (R$)",null," Custo Total (R$)"]
[null,"Equipe de Topografia"]
["3.1","Mão de Obra"]
["P9949","Topográfo","mês",{"$nulls":4},{"$f":"F99*D99","v":0}]
["P9950","Auxiliar de topografia","mês",{"$nulls":4},{"$f":"F100*D100","v":0}]
[{"$nulls":5},"Subtotal do Item 3.1",null,{"$f":"SUM(H99:I100)","v":0}]
["Código","Discriminação ","Unidade"," Quantidade ","Utilização Produtiva","Utilização Improdutiva","Custo Horário \nProdutivo (R$)","Custo Horário Improdutivo (R$)","Custo Total (R$)"]
["3.2","Veículos"]
[null,"Veículo Leve 53 kw","mês",null,null,null,{"$f":"G36","v":0},{"$f":"H36","v":0},{"$f":"((E104*G104)+(F104*H104))*D104","v":0}]
[{"$nulls":7},"Subtotal do Item 3.2",{"$f":"SUM(I104:I104)","v":0}]
[{"$nulls":7},"Total da Equipe de Produção de Topografia",{"$f":"I105+H101","v":0}]
[]
["Composição de custo do setor de medicina e segurança do trabalho"]
["Código","Discriminação ","Unidade"," Quantidade ",null,"Custo Unitário (R$)",null," Custo Total (R$)"]
[4,"Setor de Medicina e Segurança do Trabalho"]
["P9876","Técnico de segurança do trabalho","mês",{"$nulls":4},{"$f":"F111*D111","v":0}]
["P9864","Engenheiro de segurança do trabalho","mês",{"$nulls":4},{"$f":"F112*D112","v":0}]
["P9851","Médico do trabalho","mês",{"$nulls":4},{"$f":"F113*D113","v":0}]
["P9951","Médico de câmara hiperbárica","mês",{"$nulls":4},{"$f":"F114*D114","v":0}]
[{"$nulls":5},"Subtotal do Item 4",null,{"$f":"SUM(H111:I114)","v":0}]
[]
["Parcela Variável - Composição de custo da equipe de frente de serviço"]
["Código","Discriminação ","Unidade"," Quantidade ",null,"Custo Unitário (R$)",null," Custo Total (R$)"]
[5,"Equipe de Frente de Serviço","equipexmês"]
["P9875","Encarregado de Turma","mês",{"$nulls":4},{"$f":"F120*D120","v":0}]
["P9804","Apontador","mês",{"$nulls":4},{"$f":"F121*D121","v":0}]
[{"$nulls":5},"Subtotal do Item 5",null,{"$f":"SUM(H120:I121)","v":0}]
[]
["Parcela Variável - Composição de custo da equipe de frente de serviço (Terraplenagem) - Somente Compactação "]
["Código","Discriminação ","Unidade"," Quantidade ",null,"Produção Horária \n(und/h)",null,"Efs"]
["5.1","Equipe de Frente de Serviço","equipexmês"]
[null,null,"mês",{"$nulls":4},{"$f":"(D127)/(F127*182.49)","v":{"$error":"#DIV/0!"}}]
[null,null,"mês",{"$nulls":4},{"$f":"(D128)/(F128*182.49)","v":{"$error":"#DIV/0!"}}]
[null,null,"mês",{"$nulls":4},{"$f":"(D129)/(F129*182.49)","v":{"$error":"#DIV/0!"}}]
[{"$nulls":5},"Total de Equipes para Terraplenagem",null,{"$f":"SUM(H129:I129)","v":{"$error":"#DIV/0!"}}]
[]
["Parcela Variável - Composição de custo da acompanhamento das frentes de serviço de pavimentação"]
["Código","Discriminação ","Unidade"," Quantidade ",null,"Produção Horária \n(und/h)",null,"Efs"]
["5.2","Equipe de Frente de Serviço","equipe x mês"]
[4011463,"Concreto asfáltico - faixa C - areia e brita comerciais","m²",{"$f":"'1.MONTES CLAROS'!J22","v":10080},null,null,null,{"$f":"(D135)/(F135*182.49)","v":{"$error":"#DIV/0!"}}]
[4011351,"Imprimação com asfalto diluído","m²",{"$f":"'1.MONTES CLAROS'!J23","v":84000},null,null,null,{"$error":"#DIV/0!"}]
[4011353,"Pintura de ligação","m²",{"$f":"'1.MONTES CLAROS'!J24","v":84000},null,null,null,{"$error":"#DIV/0!"}]
[4011268,"Base estabilizada granulometricamente com mistura solo brita (70% - 30%) em usina com material de jazida e brita comercial","m³",{"$f":"'1.MONTES CLAROS'!J25","v":12600},null,null,null,{"$error":"#DIV/0!"}]
[4011228,"Sub-base estabilizada granulometricamente com mistura de solos na pista com material de jazida","m³",{"$f":"'1.MONTES CLAROS'!J26","v":12600},null,null,null,{"$error":"#DIV/0!"}]
[4011209,"Regularização do subleito","m²",{"$f":"'1.MONTES CLAROS'!J27","v":84000},null,null,null,{"$error":"#DIV/0!"}]
[{"$nulls":5},"Total de Equipes para Pavimentação",null,{"$f":"SUM(H135:I140)","v":{"$error":"#DIV/0!"}}]
[]
["Parcela Variável - Composição de custo da acompanhamento das frentes de serviço de drenagem"]
["Código","Discriminação ","Unidade"," Quantidade ",null,"Efsdu",null,"Efs"]
["5.3","Frentes de Serviço para Drenagem","equipe x mês"]
[{"$f":"'1.MONTES CLAROS'!D41","v":94273},"ASSENTAMENTO DE GUIA (MEIO-FIO) EM TRECHO RETO, CONFECCIONADA EM CONCRETO PRÉ-FABRICADO, DIMENSÕES 100X15X13X30 CM (COMPRIMENTO X BASE INFERIOR X BASE SUPERIOR X ALTURA)","m",{"$f":"'1.MONTES CLAROS'!J41","v":24000},null,null,null,{"$f":"D146*F146","v":0}]
[{"$f":"'1.MONTES CLAROS'!D42","v":94287},"EXECUÇÃO DE SARJETA DE CONCRETO USINADO, MOLDADA  IN LOCO  EM TRECHO RETO, 30 CM BASE X 10 CM ALTURA","m",{"$f":"'1.MONTES CLAROS'!J42","v":24000},null,null,null,{"$f":"D147*F147","v":0}]
[{"$nulls":5},"Total de Equipes para Drenagem",null,{"$f":"H146+H147","v":0}]
[]
["Parcela Variável - Composição de custo da acompanhamento das frentes de serviço de sinalização"]
["Código","Discriminação ","Unidade"," Quantidade ",null,"Produção Horária (und/h)",null,"Efs"]
["5.4","Frentes de Serviço para Sinalização","equipe x mês"]
[{"$f":"'1.MONTES CLAROS'!D36","v":5213440},"Placa de regulamentação em aço D = 0,60 m - película retrorrefletiva tipo I + SI - fornecimento e implantação","Unidade",{"$f":"'1.MONTES CLAROS'!J36","v":36},null,null,null,{"$f":"0.2*((D153)/(F153*182.49))","v":{"$error":"#DIV/0!"}}]
[{"$f":"'1.MONTES CLAROS'!D37","v":5213464},"Placa de advertência em aço, lado de 0,60 m - película retrorrefletiva tipo I + SI - fornecimento e implantação","Unidade",{"$f":"'1.MONTES CLAROS'!J37","v":36},null,null,null,{"$f":"0.2*((D154)/(F154*182.49))","v":{"$error":"#DIV/0!"}}]
[{"$f":"'1.MONTES CLAROS'!D38","v":5213863},"Suporte metálico galvanizado para placa de advertência ou regulamentação - lado ou diâmetro de 0,60 m - fornecimento e implantação","Unidade",{"$f":"'1.MONTES CLAROS'!J38","v":72},null,null,null,{"$f":"0.2*((D155)/(F155*182.49))","v":{"$error":"#DIV/0!"}}]
[{"$f":"'1.MONTES CLAROS'!D39","v":5213400},"Pintura de faixa com tinta acrílica - espessura de 0,4 mm","m²",{"$f":"'1.MONTES CLAROS'!J39","v":3360},null,null,null,{"$error":"#DIV/0!"}]
[{"$nulls":5},"Total de Equipes para Sinalização",null,{"$f":"SUM(H153:I156)","v":{"$error":"#DIV/0!"}},null,{"$f":"H157+H148","v":{"$error":"#DIV/0!"}}]
[]
["3. PARCELA VARIÁVEL - EQUIPE DE CONTROLE TECNOLÓGICO"]
["LABORATÓRIO DE SOLOS"]
["Item","Discriminação",null,null,null,"Unidade","Quantidade","Custo Unitário (R$)","Custo Total (R$)"]
[null,"Laboratório de Solos (equipe x mês)"]
[null,"Mão de Obra"]
["P9858","Laboratorista",null,null,null,"func./mês",null,null,{"$f":"TRUNC(G164*H164,2)","v":0}]
["P9833","Auxiliar de laboratório",null,null,null,"func./mês",null,null,{"$f":"TRUNC(G165*H165,2)","v":0}]
[{"$nulls":7},"Subtotal do Item",{"$f":"SUM(I164:I165)","v":0}]
["Item","Discriminação","Und","Quant","Utilização Produtiva","Utilização Improdutiva","Horário Produtivo (R$)","Horário Improdutivo (R$)","Total (R$)"]
[null,"Equipe de Controle Tecnológico"]
[null,"Veículos"]
["E9125","Van furgão a diesel - 93 kW","veic./mês",{"$nulls":5},{"$f":"D170*((E170*G170)+(F170*H170))","v":0}]
[{"$nulls":7},"Subtotal do Item",{"$f":"SUM(I170:I170)","v":0}]
[{"$nulls":7},"Total da Equipe do Laboratório de Solos",{"$f":"I166+I171","v":0}]
[]
["3. PARCELA VARIÁVEL - EQUIPE DE CONTROLE TECNOLÓGICO"]
["LABORATÓRIO DE ASFALTOS"]
["Item","Discriminação",null,null,null,"Unidade","Quantidade","Custo Unitário (R$)","Custo Total (R$)"]
[null,"Laboratório de Solos (equipe x mês)"]
[null,"Mão de Obra"]
["P9858","Laboratorista",null,null,null,"func./mês",null,null,{"$f":"TRUNC(G179*H179,2)","v":0}]
["P9833","Auxiliar de laboratório",null,null,null,"func./mês",null,null,{"$f":"TRUNC(G180*H180,2)","v":0}]
[{"$nulls":7},"Subtotal do Item",{"$f":"SUM(I179:I180)","v":0}]
["Item","Discriminação","Und","Quant","Utilização Produtiva","Utilização Improdutiva","Horário Produtivo (R$)","Horário Improdutivo (R$)","Total (R$)"]
[null,"Equipe de Controle Tecnológico"]
[null,"Veículos"]
["E9125","Van furgão a diesel - 93 kW","veic./mês",{"$nulls":5},{"$f":"D185*((E185*G185)+(F185*H185))","v":0}]
[{"$nulls":7},"Subtotal do Item",{"$f":"SUM(I185:I185)","v":0}]
[{"$nulls":7},"Total da Equipe do Laboratório de Asfaltos",{"$f":"I181+I186","v":0}]
[]
["Equipes de laboratório de solos para pavimentação"]
["Item","Discriminação",null,null,null,"Und","Quant","QE","Els"]
[{"$f":"'1.MONTES CLAROS'!D25","v":4011268},"Base estabilizada granulometricamente com mistura solo brita (70% - 30%) em usina com material de jazida e brita comercial",null,null,null,"m³",{"$f":"'1.MONTES CLAROS'!J25","v":12600},null,{"$f":"G191/H191","v":{"$error":"#DIV/0!"}}]
[{"$f":"'1.MONTES CLAROS'!D26","v":4011228},"Sub-base estabilizada granulometricamente com mistura de solos na pista com material de jazida",null,null,null,"m³",{"$f":"'1.MONTES CLAROS'!J26","v":12600},null,{"$f":"G192/H192","v":{"$error":"#DIV/0!"}}]
[{"$f":"'1.MONTES CLAROS'!D27","v":4011209},"Regularização do subleito",null,null,null,"m²",{"$f":"'1.MONTES CLAROS'!J27","v":84000},null,{"$f":"G193/H193","v":{"$error":"#DIV/0!"}}]
[{"$nulls":7},"Total de equipes de Laboratório de Solos para Pavimentação",{"$f":"SUM(I191:I193)","v":{"$error":"#DIV/0!"}}]
[]
["Equipes de laboratório de Asfalto"]
["Item","Discriminação",null,null,null,"Und","Quant","QE","Ela"]
[{"$f":"'1.MONTES CLAROS'!D22","v":4011463},"Concreto asfáltico - faixa C - areia e brita comerciais",null,null,null,"t",{"$f":"'1.MONTES CLAROS'!J22","v":10080},null,{"$f":"G198/H198","v":{"$error":"#DIV/0!"}}]
[{"$f":"'1.MONTES CLAROS'!D23","v":4011352},"Imprimação com emulsão asfáltica",null,null,null,"m²",{"$f":"'1.MONTES CLAROS'!J23","v":84000},null,{"$f":"G199/H199","v":{"$error":"#DIV/0!"}}]
[{"$f":"'1.MONTES CLAROS'!D24","v":4011353},"Pintura de ligação",null,null,null,"m²",{"$f":"'1.MONTES CLAROS'!J24","v":84000},null,{"$f":"G200/H200","v":{"$error":"#DIV/0!"}}]
[{"$nulls":7},"Total de equipes de Laboratório de Asfaltos",{"$f":"SUM(I198:I200)","v":{"$error":"#DIV/0!"}}]
[]
["manutenção do canteiro de obras e acampamentos"]
["Código","Discriminação ","Unidade"," Quantidade ",null,"Custo Unitário (R$)",null," Custo Total (R$)"]
[null,"Manutenção do Canteiro de Obras e Acampamentos"]
["6.1","Mão de Obra"]
["P9952","Pedreiro","mês",{"$nulls":4},{"$f":"F207*D207","v":0}]
["P9954","Servente","mês",{"$nulls":4},{"$f":"F208*D208","v":0}]
["P9953","Eletricista","mês",{"$nulls":4},{"$f":"F209*D209","v":0}]
[{"$nulls":5},"Subtotal do Item 6.1",null,{"$f":"SUM(H207:I209)","v":0}]
[]
["Código","Discriminação ","Unidade"," Quantidade ",null,"Custo Produtivo (R$)",null," Custo Total (R$)"]
["6.2","Equipamentos"]
[null,"Caminhão guindauto de 6 toneladas","h/mês",{"$nulls":4},{"$f":"F214*D214","v":0}]
[null,"Caminhão tanque de 8.000 litros","h/mês",{"$nulls":4},{"$f":"F215*D215","v":0}]
["E9524","Motoniveladora","h/mês",{"$nulls":4},{"$f":"F216*D216","v":0}]
[{"$nulls":5},"Subtotal do Item 6.2",null,{"$f":"SUM(H214:I216)","v":0}]
[{"$nulls":6},"Total da Manutenção do Canteiro de Obras e Acampamentos",{"$f":"H217+H210","v":0}]
[]
[]
[]
["Resumo das parcelas de administração local"]
["Código","Discriminação ","Unidade"," Quantidade ",null,"Custo Unitário (R$)",null," Custo Total (R$)"]
[null,"Parcela Fixa"]
[null,"Mão de Obra","mês",null,null,{"$f":"H12+H16+H24+H28","v":0},null,{"$f":"F225*D225","v":0}]
[null,"Veículos","mês",null,null,{"$f":"I45","v":0},null,{"$f":"F226*D226","v":0}]
[{"$nulls":5},"Subtotal do Item 1",null,{"$f":"SUM(H225:I226)","v":0}]
[null,"Parcela Vinculada"]
[null,"Equipe de produção de terraplenagem","mês",null,null,{"$f":"I57","v":0},null,{"$f":"F229*D229","v":0}]
[null,"Equipe de produção de pavimentação","mês",null,null,{"$f":"I69","v":0},null,0]
[null,"Equipe de produção de drenagem","mês",null,null,{"$f":"I81","v":0},null,0]
[null,"Equipe de produção de sinalização","mês",null,null,{"$f":"I93","v":0},null,0]
[null,"Equipe de topografia","mês",null,null,{"$f":"I106","v":0},null,0]
[null,"Equipe de medicina e segurança do trabalho","mês",null,null,{"$f":"H115","v":0},null,0]
[null,"Técnicos especializados","mês",{"$nulls":4},0]
[{"$nulls":5},"Subtotal do Item 2",null,{"$f":"SUM(H229:I235)","v":0}]
[null,"Parcela Variável"]
[null,"Acompanhamento da Terraplenagem","equipe x mês","-",null,{"$f":"$H$122","v":0},null,"-"]
[null,"Acompanhamento da Pavimentação","equipe x mês",{"$f":"H141","v":{"$error":"#DIV/0!"}},null,{"$f":"$H$122","v":0},null,{"$f":"F239*D239","v":{"$error":"#DIV/0!"}}]
[null,"Acompanhamento da Drenagem","equipe x mês",{"$f":"H148","v":0},null,0,null,{"$f":"F240*D240","v":0}]
[null,"Acompanhamento da Sinalização","equipe x mês",{"$f":"H157","v":{"$error":"#DIV/0!"}},null,0,null,{"$f":"F241*D241","v":{"$error":"#DIV/0!"}}]
[null,"Laboratório de Solos","equipe x mês",{"$f":"I194","v":{"$error":"#DIV/0!"}},null,{"$f":"I172","v":0},null,{"$f":"F242*D242","v":{"$error":"#DIV/0!"}}]
[null,"Laboratório de asfaltos","equipe x mês",{"$f":"I201","v":{"$error":"#DIV/0!"}},null,{"$f":"I187","v":0},null,{"$f":"F243*D243","v":{"$error":"#DIV/0!"}}]
[{"$nulls":5},"Subtotal do Item 3",null,{"$f":"SUM(H238:I243)","v":{"$error":"#DIV/0!"}}]
[null,"Manutenção dos Canteiros de Obras e Acampamentos"]
[null,"Equipe de manutenção","mês",null,null,{"$f":"H218","v":0},null,{"$f":"F246*D246","v":0}]
[{"$nulls":5},"Subtotal do Item 4",null,{"$f":"SUM(H246:I246)","v":0}]
[{"$nulls":6},"Subtotal",{"$f":"H247+H244+H236+H227","v":{"$error":"#DIV/0!"}}]
[null,"Despesas Diversas","%",null,null,"-",null,{"$f":"D249*H248","v":{"$error":"#DIV/0!"}}]
[{"$nulls":5},"TOTAL",null,{"$f":"H248+H249","v":{"$error":"#DIV/0!"}},null,{"$f":"H250","v":{"$error":"#DIV/0!"}}]
[{"$nulls":5},"BDI",null,null,{"$f":"H250*BDI!C17","v":{"$error":"#DIV/0!"}}]
[{"$nulls":5},"TOTAL COM BDI",null,null,{"$f":"I251+H250","v":{"$error":"#DIV/0!"}}]

{"sheet":"PROJ.EXEC.","index":13,"n_rows":27,"n_cols":7,"rows_kept":27,"cut":false,"hidden":false,"merged":[[0,0,0,6],[3,0,3,1],[1,0,1,6],[2,2,4,4],[25,0,25,1],[14,0,14,1],[23,0,23,1],[24,0,24,1],[18,0,18,1]]}
["LOGOTIPO DA EMPRESA"]
["COMPOSIÇAO PREÇO PROJETO EXECUTIVO"]
[]
["DISCRIMINAÇAO",{"$nulls":4},"Pr. Unit.","Pr. Total"]
[]
["A· EOUIPE TECNICA",{"$nulls":5},{"$f":"G7+G10","v":0}]
[null,"A. 1 - Pessoal de Nível Superior","Unidade","Quantitativo","SICRO e Rel.Custos Gerais",null,{"$f":"G8+G9","v":0}]
[null,"Engenheiro","mês",null,"P9812",null,{"$f":"F8*D8","v":0}]
[null,"Topógrafo","mês",null,"P9949",null,{"$f":"F9*D9","v":0}]
[null,"A.2 - Pessoal de Nível Técnico e Aux.",{"$nulls":4},{"$f":"G11+G12","v":0}]
[null,"Auxiliar de topógrafo","mês",null,"P9950",null,{"$f":"F11*D11","v":0}]
[null,"Auxiliar Técnico/Assistente de Engenharia ","mês",null,"P9903",null,{"$f":"F12*D12","v":0}]
["B - ENCARGOS SOCIAIS",{"$nulls":5},{"$f":"G14","v":0}]
[null,{"$f":"CONCATENATE(\"Taxas \",'ENC.SOC.'!E51,\"%\")","v":"Taxas 0%"},"JÁ INCLUSAS EM \"A\""]
["C - DESPESAS GERAIS",{"$nulls":5},{"$f":"G16+G18+G17","v":0}]
[null,"C.1 - MATERIAIS DE CONSUMO","Estimativa % como referência de equipe técnica com encargos sociais ",null,null,null,{"$f":"F16*D16","v":0}]
[null,"C.2 - VEÍCULOS (Veículo leve picape 4 x 4 com capacidade de 1,10 t - 147 kW)","h",null,"E9684",null,{"$f":"F17*D17","v":0}]
[null,"C.3 - Estação total eletrônica com alcance máximo de 3.000 m","h",null,"E9553",null,{"$f":"F18*D18","v":0}]
["D - ENSAIOS",{"$nulls":5},{"$f":"SUM(G20:G23)","v":0}]
[null,"Laboratorista","mês",null,"P9858",null,{"$f":"F20*D20","v":0}]
[null,"Auxiliar de Laboratório","mês",null,"P9833",null,{"$f":"F21*D21","v":0}]
[null,"Laboratório de solos","mês",null,"B8957",null,{"$f":"F22*D22","v":0}]
[null,"Laboratório de asfalto","mês",null,"B8955",null,{"$f":"F23*D23","v":0}]
["I - SOMA (A+B+C+D)",{"$nulls":5},{"$f":"G6+G13+G15+G19","v":0}]
["II - CUSTOS ADMINISTRATIVOS",null,null,{"$f":"BDI!C17","v":0},null,null,{"$f":"D25*G24","v":0}]
[" TOTAL",{"$nulls":5},{"$f":"G24+G25","v":0}]
[{"$nulls":5},"Por m²:"]

{"sheet":"BDI","index":14,"n_rows":33,"n_cols":3,"rows_kept":33,"cut":false,"hidden":false,"merged":[[5,0,5,2],[4,0,4,2],[34,0,34,1],[35,0,35,1],[37,0,37,2],[21,1,21,2],[19,0,19,3],[20,0,20,3],[17,0,17,2],[33,0,33,2]]}
[]
["OBRA:"]
["LOCAL: "]
["DATA BASE: "]
["DETALHAMENTO DO BDI  - SEM DESONERAÇÃO"]
["CONTRATAÇÃO DE SERVIÇOS DE PAVIMENTAÇÃO ASFÁLTICA COM CONCRETO BETUMINOSO USINADO A QUENTE (CBUQ) EM VIAS URBANAS E RURAIS INSERIDAS NA ÁREA DE ATUAÇÃO DA 1ª SUPERINTENDÊNCIA REGIONAL DA CODEVASF, NO ESTADO DE MINAS GERAIS - ITEM X: XXXXXXXXXX/MG"]
["DESCRIÇÃO DOS SERVIÇOS","PREÇO DE VENDA (%)","CUSTO DIRETO (%)"]
["ADMINISTRAÇÃO CENTRAL"]
["DESPESA FINANCEIRAS"]
["SEGUROS E GARANTIAS CONTRATUAIS"]
["RISCOS"]
["LUCRO OPERACIONAL"]
["PIS"]
["COFINS"]
["ISSQN"]
["Contribuição Previdenciaria"]
[null,"BDI",{"$f":"ROUND((1+(C8+C12))/(1-(B9+B10+B11+B13+B14+B15+B16))-1,4)","v":0}]
[]
[]
["DETALHAMENTO DO BDI DIFERENCIADO  - SEM DESONERAÇÃO"]
["CONTRATAÇÃO DE SERVIÇOS DE PAVIMENTAÇÃO ASFÁLTICA COM CONCRETO BETUMINOSO USINADO A QUENTE (CBUQ) EM VIAS URBANAS E RURAIS INSERIDAS NA ÁREA DE ATUAÇÃO DA 1ª SUPERINTENDÊNCIA REGIONAL DA CODEVASF, NO ESTADO DE MINAS GERAIS - ITEM X: XXXXXXXXXX/MG"]
[]
["DESCRIÇÃO DOS SERVIÇOS","PREÇO DE VENDA (%)","CUSTO DIRETO (%)"]
["ADMINISTRAÇÃO CENTRAL"]
["DESPESA FINANCEIRAS"]
["SEGUROS E GARANTIAS CONTRATUAIS"]
["RISCOS"]
["LUCRO OPERACIONAL"]
["PIS"]
["COFINS"]
["ISSQN"]
["Contribuição Previdenciaria"]
[null,"BDI",{"$f":"ROUND((1+(C24+C28))/(1-(B25+B26+B27+B29+B30+B31+B32))-1,4)","v":0}]

{"sheet":"ENC.SOC.","index":15,"n_rows":51,"n_cols":8,"rows_kept":51,"cut":false,"hidden":false,"merged":[[49,0,49,5],[0,0,4,5],[8,0,9,5],[50,0,50,1],[10,0,10,5],[11,2,11,3],[11,4,11,5],[12,0,12,5],[13,0,14,1],[13,2,14,2],[13,3,14,3],[13,4,14,4],[13,5,14,5],[15,0,15,5],[26,0,26,5],[38,0,38,5],[45,0,45,5]]}
["LOGOTIPO DA EMPRESA"]
[]
[]
[]
[]
["NOME DA CONCORRENTE:"]
["EDITAL:"]
["FOLHA:"]
["CONTRATAÇÃO DE SERVIÇOS DE PAVIMENTAÇÃO ASFÁLTICA COM CONCRETO BETUMINOSO USINADO A QUENTE (CBUQ) EM VIAS URBANAS E RURAIS INSERIDAS NA ÁREA DE ATUAÇÃO DA 1ª SUPERINTENDÊNCIA REGIONAL DA CODEVASF, NO ESTADO DE MINAS GERAIS - ITEM X: XXXXXXXXXXXXXXX/MG"]
[]
["DETALHAMENTO DOS ENCARGOS SOCIAIS (%)"]
["VIGÊNCIA A PARTIR DE 12/2023",null,"COM DESONERAÇÃO",null,"SEM DESONERAÇÃO"]
[]
[null,null,"HORISTA","MENSALISTA","HORISTA","MENSALISTA"]
[]
["GRUPO A"]
["A1","INSS",0,0]
["A2","SESI",1.5,1.5]
["A3","SENAI",1,1]
["A4","INCRA",0.2,0.2]
["A5","SEBRAE",0.6,0.6]
["A6","Salário Educação",2.5,2.5]
["A7","Seguro Contra Acidentes de Trabalho",3,3]
["A8","FGTS",8,8]
["A9","SECONCI",1,1]
["A","Total",{"$f":"SUM(C17:C25)","v":17.8},{"$f":"SUM(D17:D25)","v":17.8},{"$f":"SUM(E17:E25)","v":0},{"$f":"SUM(F17:F25)","v":0}]
["GRUPO B"]
["B1","Repouso Semanal Remunerado",17.88,"-"]
["B2","Feriados",3.94,"-"]
["B3","Auxílio-enfermidade",0.91,0.69]
["B4","13° salário",10.98,8.33]
["B5","Licença-paternidade",7.0000000000000007E-2,0.06]
["B6","Faltas Justificadas",0.73,0.56000000000000005]
["B7","Dias de chuva",1.45,"-"]
["B8","Auxílio Acidente de Trabalho",0.11,0.09]
["B9","Férias Gozadas",11.35,8.6199999999999992]
["B10","Salário Maternidade",0.03,0.03]
["B","Total ",{"$f":"SUM(C28:C37)","v":47.45},{"$f":"SUM(D28:D37)","v":18.380000000000003},{"$f":"SUM(E28:E37)","v":0},{"$f":"SUM(F28:F37)","v":0}]
["GRUPO C"]
["C1","Aviso Prévio Indenizado",6.76,5.14]
["C2","Aviso Prévio Trabalhado",0.16,0.12]
["C3","Férias Indenizadas",2.2799999999999998,1.73]
["C4","Depósito Rescisão Sem Justa Causa",3.81,2.89]
["C5","Indenização Adicional",0.56999999999999995,0.43]
["C","Total ",{"$f":"SUM(C40:C44)","v":13.58},{"$f":"SUM(D40:D44)","v":10.31},{"$f":"SUM(E40:E44)","v":0},{"$f":"SUM(F40:F44)","v":0}]
["GRUPO D"]
["D1","Reincidência de A sobre B",8.4499999999999993,3.27]
["D2","Reincidência de Grupo A sobre Aviso Prévio Trabalhado e Reincidência do FGTS sobre Aviso Prévio Indenizado",0.56999999999999995,0.43]
["D","Total",{"$f":"SUM(C47:C48)","v":9.02},{"$f":"SUM(D47:D48)","v":3.7},{"$f":"SUM(E47:E48)","v":0},{"$f":"SUM(F47:F48)","v":0},null,"Fonte: Sinapi Cálculos e Parâmetros 5ª Edição - Atualizada em Agosto 2023"]
[]
["T O T A L (%)",null,{"$f":"C26+C38+C45+C49","v":87.85},{"$f":"D26+D38+D45+D49","v":50.190000000000012},{"$f":"E26+E38+E45+E49","v":0},{"$f":"F26+F38+F45+F49","v":0}]