{"text_format":"2","workbook":"xlsx","n_sheets":14,"sheets":["1.JANUARIA","2.SALINAS","3.ARAÇUAI","4.CAPELINHA","5.ALMENARA","CRONOG","MOB","CANT","ADM","PROJ","CPU","CPU SINAPI","BDI","ENC. SOCIAIS"],"not_rendered":{"charts":0,"images":5,"macros":1,"external_links":201,"defined_names":30877,"comments":0,"pivot_tables":0},"unopened":[],"bounds":{"document_bytes":16777216,"sheet_cells":100000,"run_cost":"one","rows_first":2000,"rows_last":500,"rows_between":2000,"halvings":0,"cell_chars":16384,"cell_head_chars":4096},"cells_cut":0,"cells_raw":0,"read":"whole","date_system":"1900"}

{"sheet":"1.JANUARIA","index":0,"n_rows":57,"n_cols":33,"rows_kept":57,"cut":false,"hidden":false,"merged":[[9,18,9,19],[10,4,10,7],[13,4,13,7],[14,4,14,7],[22,4,22,7],[21,4,21,7],[16,4,16,7],[11,4,11,7],[18,4,18,7],[19,4,19,7],[5,4,8,7],[6,9,7,9],[4,1,4,13],[5,1,8,1],[5,2,8,2],[5,3,8,3],[6,12,8,12],[6,13,8,13],[1,1,3,11],[25,4,25,7],[23,4,23,7],[24,4,24,7],[26,4,26,7],[32,4,32,7],[27,4,27,7],[28,4,28,7],[48,1,48,12],[29,4,29,7],[31,4,31,7],[38,4,38,7],[40,4,40,7],[42,4,42,7],[43,4,43,7],[44,4,44,7],[45,4,45,7],[46,4,46,7],[47,4,47,7],[36,4,36,7],[30,4,30,7],[34,4,34,7],[35,4,35,7]]}
[{"$nulls":13},"xxxxxxx"]
[null,"LOGOTIPO DA EMPRESA"]
[]
[{"$nulls":12},"Data base orçamento:","2024-08-01"]
[null,"EXECUÇÃO DE SERVIÇOS DE IMPLANTAÇÃO DE PAVIMENTAÇÃO EM BLOCO DE CONCRETO INTERTRAVADO (BLOQUETES), EM VIAS DE MUNICÍPIOS DIVERSOS INSERIDOS NA ÁREA DE ATUAÇÃO DA 1ª SUPERINTENDÊNCIA REGIONAL DA CODEVASF, NO ESTADO DE MINAS GERAIS - ITEM 1 - REGIÃO: JANUÁRIA/MG"]
[null,"ITEM","ORIGEM\nCOMPOSIÇÃO","CÓDIGO\nCOMPOSIÇÃO","DISCRIMINAÇÃO DOS SERVIÇOS",null,null,null,"BDI % =",{"$f":"BDI!C17","v":0},"BDI  DIFERENCIADO% =",{"$f":"BDI!C65","v":0},"R$/m² =",{"$f":"N49/I8","v":0}]
[{"$nulls":8},"Total de m²","Encargos Sociais:","Horista (%)","Mensalista (%)","PREÇO UNITÁRIO COM BDI","PREÇO TOTAL COM BDI "]
[{"$nulls":8},42000,null,{"$f":"'ENC. SOCIAIS'!$E$51","v":0},{"$f":"'ENC. SOCIAIS'!$F$51","v":0}]
[{"$nulls":8},"UND","QTDE.","BDI","PREÇO UNITÁRIO",{"$nulls":15},"TOTAL"]
[{"$nulls":4},"MOBILIZAÇÃO/DESMOBILIZAÇÃO"]
[null,1,"Codevasf","Mob","Mobilização",null,null,null,"kmxfrente",450,{"$f":"(M11/L11-1)","v":{"$error":"#DIV/0!"}},null,{"$f":"L11*(1+$J$6)","v":0},{"$f":"ROUND(ROUND(J11,2)*ROUND(M11,6),2)","v":0},{"$f":"N11/$N$49","v":{"$error":"#DIV/0!"}},{"$nulls":11},57163.47]
[null,2,"Codevasf","Mob","Desmobilização",null,null,null,"kmxfrente",450,{"$f":"(M12/L12-1)","v":{"$error":"#DIV/0!"}},null,{"$f":"L12*(1+$J$6)","v":0},{"$f":"ROUND(ROUND(J12,2)*ROUND(M12,6),2)","v":0},{"$f":"N12/$N$49","v":{"$error":"#DIV/0!"}},{"$nulls":11},57163.47]
[{"$nulls":4},"INSTALAÇÃO DE CANTEIRO"]
[null,3,"Codevasf","Canteiro","Canteiro de Obras e Almoxarifado",null,null,null,"frente",5,{"$f":"(M14/L14-1)","v":{"$error":"#DIV/0!"}},null,{"$f":"L14*(1+$J$6)","v":0},{"$f":"ROUND(ROUND(J14,2)*ROUND(M14,6),2)","v":0},{"$nulls":12},190291.53]
[null,4,"SINAPI",103689,"FORNECIMENTO E INSTALAÇÃO DE PLACA DE OBRA COM CHAPA GALVANIZADA E ESTRUTURA DE MADEIRA",null,null,null,"m²",80,{"$f":"(M15/L15-1)","v":{"$error":"#DIV/0!"}},null,0,{"$f":"ROUND(ROUND(J15,2)*ROUND(M15,6),2)","v":0}]
[{"$nulls":4},"ADMINISTRAÇÃO LOCAL DA OBRA"]
[null,5,"Codevasf","Adm Local","Administração Local da Obra",null,null,null,"und",1,{"$f":"(M17/L17-1)","v":{"$error":"#DIV/0!"}},null,{"$f":"L17*(1+$J$6)","v":0},{"$f":"ROUND(ROUND(J17,2)*ROUND(M17,6),2)","v":0},{"$f":"N17/N49","v":{"$error":"#DIV/0!"}}]
[{"$nulls":4},"TERRAPLANAGEM"]
[null,6,"SICRO",5502114,"Escavação, carga e transporte de material de 1ª categoria - DMT de 1.000 a 1.200 m - caminho de serviço em leito natural - com escavadeira e caminhão basculante de 14 m³",null,null,null,"m³",11339.999999999998,{"$f":"M19/L19-1","v":{"$error":"#DIV/0!"}},null,{"$f":"L19*(1+$J$6)","v":0},{"$f":"ROUND(ROUND(J19,2)*ROUND(M19,6),2)","v":0},{"$nulls":13},366912]
[null,7,"SICRO",4413942,"Espalhamento de material em bota-fora",null,null,null,"m³",4200,{"$error":"#DIV/0!"},null,0,0,{"$nulls":13},84084,{"$nulls":4},1]
[{"$nulls":4},"PAVIMENTAÇÃO"]
[null,8,"SINAPI",36170,"Bloquete/piso intertravado de concreto - modelo hexagonal/onda/16 faces/retangular/t ijolinho/paver/holandes/paralelepipedo, *22 cm x 11* cm, e = 8 cm, resistencia de 35 mpa (nbr 9781), cor natural - fornecimento",null,null,null,"m²",42168,{"$f":"M22/L22-1","v":{"$error":"#DIV/0!"}},null,{"$f":"L22*(1+$J$6)","v":0},{"$f":"ROUND(ROUND(J22,2)*ROUND(M22,6),2)","v":0}]
[null,9,"SINAPI","92404 ADAPTADA","Execução de pavimento em piso intertravado, com blocos pré-moldados, espessura 8 cm - exclusive fornecimento de bloquete",null,null,null,"m²",42000,{"$error":"#DIV/0!"},null,0,0,{"$nulls":13},13037300.310000001]
[null,10,"SICRO",5915014,"Transporte com caminhão carroceria com capacidade de 11 t e com guindauto de 45 t.m - rodovia pavimentada",null,null,null,"tkm",516096.00000000006,{"$error":"#DIV/0!"},null,0,0]
[null,11,"SICRO",5915321,"Transporte com caminhão basculante de 14 m³ - rodovia pavimentada (colchão de areia)",null,null,null,"tkm",143136,{"$f":"M25/L25-1","v":{"$error":"#DIV/0!"}},null,0,{"$f":"ROUND(ROUND(J25,2)*ROUND(M25,6),2)","v":0}]
[null,12,"SICRO",5915321,"Transporte com caminhão basculante de 14 m³ - rodovia pavimentada (pó de pedra)",null,null,null,"tkm",37044,{"$f":"M26/L26-1","v":{"$error":"#DIV/0!"}},null,0,{"$f":"ROUND(ROUND(J26,2)*ROUND(M26,6),2)","v":0}]
[null,13,"SICRO",4011221,"Base estabilizada granulometricamente com mistura de solos na pista com material de jazida",null,null,null,"m³",6300,{"$error":"#DIV/0!"},null,0,0,{"$nulls":13},15919722]
[null,14,"SICRO",4011209,"Regularização do subleito",null,null,null,"m²",42000,{"$error":"#DIV/0!"},null,0,0,{"$nulls":13},540540]
[{"$nulls":4},"SINALIZAÇÃO"]
[null,15,"SICRO",5213440,"Fornecimento e implantação de placa de regulamentação em aço D = 0,60 m - película retrorrefletiva tipo I + SI",null,null,null,"und",30,{"$f":"M30/L30-1","v":{"$error":"#DIV/0!"}},null,{"$f":"L30*(1+$J$6)","v":0},{"$f":"ROUND(ROUND(J30,2)*ROUND(M30,6),2)","v":0},{"$nulls":13},9985.9500000000007]
[null,16,"SICRO",5213464,"Placa de advertência em aço, lado de 0,60 m - película retrorrefletiva tipo I + SI - fornecimento e implantação",null,null,null,"und",30,{"$error":"#DIV/0!"},null,0,0]
[null,17,"SICRO",5213863,"Suporte metálico galvanizado para placa de advertência ou regulamentação - lado ou diâmetro de 0,60 m - fornecimento e implantação",null,null,null,"und",60,{"$error":"#DIV/0!"},null,0,0,{"$nulls":13},13086.06]
[null,18,"SICRO",5213400,"Pintura de faixa com tinta acrílica - espessura de 0,4 mm",null,null,null,"m²",1400,{"$error":"#DIV/0!"},null,0,0]
[{"$nulls":4},"DRENAGEM"]
[null,19,"SINAPI",94273,"ASSENTAMENTO DE GUIA (MEIO-FIO) CONFECCIONADA EM CONCRETO PRÉ-FABRICADO, DIMENSÕES 100X15X13X30 CM (COMPRIMENTO X BASE INFERIOR X BASE SUPERIOR X ALTURA)",null,null,null,"m",12000,{"$f":"M35/L35-1","v":{"$error":"#DIV/0!"}},null,{"$f":"L35*(1+$J$6)","v":0},{"$f":"ROUND(ROUND(J35,2)*ROUND(M35,6),2)","v":0},{"$nulls":13},4514640]
[null,20,"SINAPI",94287,"EXECUÇÃO DE SARJETA DE CONCRETO USINADO, MOLDADA  IN LOCO, 30 CM BASE X 10 CM ALTURA",null,null,null,"m",12000,{"$f":"M36/L36-1","v":{"$error":"#DIV/0!"}},null,0,0]
[null,21,"SICRO",4915724,"Caiação mecanizada com fixador de cal",null,null,null,"m²",3480.0000000000005,{"$f":"(M37/L37-1)","v":{"$error":"#DIV/0!"}},null,0,{"$f":"ROUND(ROUND(J37,2)*ROUND(M37,6),2)","v":0},{"$nulls":10},4514640]
[{"$nulls":4},"SERVIÇOS COMPLEMENTARES"]
[null,22,"Codevasf","CPU-02","Conserto de quebra no ramal na rua sem pavimento com fornecimento de material hidráulico",null,null,null,"m",600,{"$f":"M39/L39-1","v":{"$error":"#DIV/0!"}},null,{"$f":"L39*(1+$J$6)","v":0},{"$f":"ROUND(ROUND(J39,2)*ROUND(M39,6),2)","v":0},{"$nulls":13},139854]
[{"$nulls":4},"PROJETO EXECUTIVO"]
[null,23,"Codevasf","Composição Própria","Projeto Executivo",null,null,null,"m²",42000,{"$f":"M41/L41-1","v":{"$error":"#DIV/0!"}},null,{"$f":"L41*(1+$J$6)","v":0},{"$f":"ROUND(ROUND(J41,2)*ROUND(M41,6),2)","v":0},{"$nulls":13},763671.38]
[{"$nulls":4},"MOMENTO DE TRANSPORTE"]
[null,24,"SICRO",5914359,"Transporte com caminhão basculante de 10 m³ - rodovia em leito natural",null,null,null,"tkm",45290.048796000003,{"$f":"M43/L43-1","v":{"$error":"#DIV/0!"}},null,{"$f":"L43*(1+$J$6)","v":0},{"$f":"ROUND(ROUND(J43,2)*ROUND(M43,6),2)","v":0}]
[null,25,"SICRO",5914374,"Transporte com caminhão basculante de 10 m³ - rodovia em revestimento primário",null,null,null,"tkm",45290.048796000003,{"$error":"#DIV/0!"},null,0,0]
[null,26,"SICRO",5914389,"Transporte com caminhão basculante de 10 m³ - rodovia pavimentada",null,null,null,"tkm",99143.299296000012,{"$error":"#DIV/0!"},null,0,0]
[null,27,"SICRO",5914449,"Transporte com caminhão carroceria de 15 t - rodovia em leito natural",null,null,null,"tkm",509.53113600000012,{"$error":"#DIV/0!"},null,0,0]
[null,28,"SICRO",5914464,"Transporte com caminhão carroceria de 15 t - rodovia em revestimento primário",null,null,null,"tkm",509.53113600000012,{"$error":"#DIV/0!"},null,0,0]
[null,29,"SICRO",5914479,"Transporte com caminhão carroceria de 15 t - rodovia pavimentada",null,null,null,"tkm",509.53113600000012,{"$error":"#DIV/0!"},null,0,0]
[null,"VALOR TOTAL DO SRP",{"$nulls":11},{"$f":"SUM(N10:N48)","v":0},{"$f":"N49/J14","v":0},{"$nulls":12},{"$f":"SUM(AB18:AB41)","v":35389795.700000003}]
[null,"Obs.: Os valores estão apresentados com apenas 2 casas decimais, mas os valores da presente planilha foram calculados utilizando a precisão de 6 casa decimais. "]
[]
[]
[]
[]
[]
[]
[null,null,null," "]

{"sheet":"2.SALINAS","index":1,"n_rows":57,"n_cols":33,"rows_kept":57,"cut":false,"hidden":false,"merged":[[47,4,47,7],[48,1,48,12],[40,4,40,7],[42,4,42,7],[43,4,43,7],[44,4,44,7],[45,4,45,7],[46,4,46,7],[31,4,31,7],[32,4,32,7],[34,4,34,7],[35,4,35,7],[36,4,36,7],[38,4,38,7],[25,4,25,7],[26,4,26,7],[27,4,27,7],[28,4,28,7],[29,4,29,7],[30,4,30,7],[18,4,18,7],[19,4,19,7],[21,4,21,7],[22,4,22,7],[23,4,23,7],[24,4,24,7],[9,18,9,19],[10,4,10,7],[11,4,11,7],[13,4,13,7],[14,4,14,7],[16,4,16,7],[1,1,3,11],[4,1,4,13],[5,1,8,1],[5,2,8,2],[5,3,8,3],[5,4,8,7],[6,9,7,9],[6,12,8,12],[6,13,8,13]]}
[{"$nulls":13},"xxxxxxx"]
[null,"LOGOTIPO DA EMPRESA"]
[]
[{"$nulls":12},"Data base orçamento:","2024-08-01"]
[null,"EXECUÇÃO DE SERVIÇOS DE IMPLANTAÇÃO DE PAVIMENTAÇÃO EM BLOCO DE CONCRETO INTERTRAVADO (BLOQUETES), EM VIAS DE MUNICÍPIOS DIVERSOS INSERIDOS NA ÁREA DE ATUAÇÃO DA 1ª SUPERINTENDÊNCIA REGIONAL DA CODEVASF, NO ESTADO DE MINAS GERAIS - ITEM 2 - REGIÃO: SALINAS/MG"]
[null,"ITEM","ORIGEM\nCOMPOSIÇÃO","CÓDIGO\nCOMPOSIÇÃO","DISCRIMINAÇÃO DOS SERVIÇOS",null,null,null,"BDI % =",{"$f":"BDI!C17","v":0},"BDI  DIFERENCIADO% =",{"$f":"BDI!C65","v":0},"R$/m² =",{"$f":"N49/I8","v":0}]
[{"$nulls":8},"Total de m²","Encargos Sociais:","Horista (%)","Mensalista (%)","PREÇO UNITÁRIO COM BDI","PREÇO TOTAL COM BDI "]
[{"$nulls":8},42000,null,{"$f":"'ENC. SOCIAIS'!$E$51","v":0},{"$f":"'ENC. SOCIAIS'!$F$51","v":0}]
[{"$nulls":8},"UND","QTDE.","BDI","PREÇO UNITÁRIO",{"$nulls":15},"TOTAL"]
[{"$nulls":4},"MOBILIZAÇÃO/DESMOBILIZAÇÃO"]
[null,1,"Codevasf","Mob","Mobilização",null,null,null,"kmxfrente",400,{"$f":"(M11/L11-1)","v":{"$error":"#DIV/0!"}},null,{"$f":"L11*(1+$J$6)","v":0},{"$f":"ROUND(ROUND(J11,2)*ROUND(M11,6),2)","v":0},{"$f":"N11/$N$49","v":{"$error":"#DIV/0!"}},{"$nulls":11},57163.47]
[null,2,"Codevasf","Mob","Desmobilização",null,null,null,"kmxfrente",400,{"$f":"(M12/L12-1)","v":{"$error":"#DIV/0!"}},null,{"$f":"L12*(1+$J$6)","v":0},{"$f":"ROUND(ROUND(J12,2)*ROUND(M12,6),2)","v":0},{"$f":"N12/$N$49","v":{"$error":"#DIV/0!"}},{"$nulls":11},57163.47]
[{"$nulls":4},"INSTALAÇÃO DE CANTEIRO"]
[null,3,"Codevasf","Canteiro","Canteiro de Obras e Almoxarifado",null,null,null,"frente",5,{"$f":"(M14/L14-1)","v":{"$error":"#DIV/0!"}},null,{"$f":"L14*(1+$J$6)","v":0},{"$f":"ROUND(ROUND(J14,2)*ROUND(M14,6),2)","v":0},{"$nulls":12},190291.53]
[null,4,"SINAPI",103689,"FORNECIMENTO E INSTALAÇÃO DE PLACA DE OBRA COM CHAPA GALVANIZADA E ESTRUTURA DE MADEIRA",null,null,null,"m²",80,{"$f":"(M15/L15-1)","v":{"$error":"#DIV/0!"}},null,0,{"$f":"ROUND(ROUND(J15,2)*ROUND(M15,6),2)","v":0}]
[{"$nulls":4},"ADMINISTRAÇÃO LOCAL DA OBRA"]
[null,5,"Codevasf","Adm Local","Administração Local da Obra",null,null,null,"und",1,{"$f":"(M17/L17-1)","v":{"$error":"#DIV/0!"}},null,{"$f":"L17*(1+$J$6)","v":0},{"$f":"ROUND(ROUND(J17,2)*ROUND(M17,6),2)","v":0},{"$f":"N17/N49","v":{"$error":"#DIV/0!"}}]
[{"$nulls":4},"TERRAPLANAGEM"]
[null,6,"SICRO",5502114,"Escavação, carga e transporte de material de 1ª categoria - DMT de 1.000 a 1.200 m - caminho de serviço em leito natural - com escavadeira e caminhão basculante de 14 m³",null,null,null,"m³",11339.999999999998,{"$f":"M19/L19-1","v":{"$error":"#DIV/0!"}},null,{"$f":"L19*(1+$J$6)","v":0},{"$f":"ROUND(ROUND(J19,2)*ROUND(M19,6),2)","v":0},{"$nulls":13},366912]
[null,7,"SICRO",4413942,"Espalhamento de material em bota-fora",null,null,null,"m³",4200,{"$error":"#DIV/0!"},null,0,0,{"$nulls":13},84084,{"$nulls":4},1]
[{"$nulls":4},"PAVIMENTAÇÃO"]
[null,8,"SINAPI",36170,"Bloquete/piso intertravado de concreto - modelo hexagonal/onda/16 faces/retangular/t ijolinho/paver/holandes/paralelepipedo, *22 cm x 11* cm, e = 8 cm, resistencia de 35 mpa (nbr 9781), cor natural - fornecimento",null,null,null,"m²",42168,{"$f":"M22/L22-1","v":{"$error":"#DIV/0!"}},null,{"$f":"L22*(1+$J$6)","v":0},{"$f":"ROUND(ROUND(J22,2)*ROUND(M22,6),2)","v":0}]
[null,9,"SINAPI","92404 ADAPTADA","Execução de pavimento em piso intertravado, com blocos pré-moldados, espessura 8 cm - exclusive fornecimento de bloquete",null,null,null,"m²",42000,{"$error":"#DIV/0!"},null,0,0,{"$nulls":13},13037300.310000001]
[null,10,"SICRO",5915014,"Transporte com caminhão carroceria com capacidade de 11 t e com guindauto de 45 t.m - rodovia pavimentada",null,null,null,"tkm",516096.00000000006,{"$error":"#DIV/0!"},null,0,0]
[null,11,"SICRO",5915321,"Transporte com caminhão basculante de 14 m³ - rodovia pavimentada (colchão de areia)",null,null,null,"tkm",143136,{"$error":"#DIV/0!"},null,0,0]
[null,12,"SICRO",5915321,"Transporte com caminhão basculante de 14 m³ - rodovia pavimentada (pó de pedra)",null,null,null,"tkm",24696,{"$error":"#DIV/0!"},null,0,0]
[null,13,"SICRO",4011221,"Base estabilizada granulometricamente com mistura de solos na pista com material de jazida",null,null,null,"m³",6300,{"$error":"#DIV/0!"},null,0,0,{"$nulls":13},15919722]
[null,14,"SICRO",4011209,"Regularização do subleito",null,null,null,"m²",42000,{"$error":"#DIV/0!"},null,0,0,{"$nulls":13},540540]
[{"$nulls":4},"SINALIZAÇÃO"]
[null,15,"SICRO",5213440,"Fornecimento e implantação de placa de regulamentação em aço D = 0,60 m - película retrorrefletiva tipo I + SI",null,null,null,"und",30,{"$f":"M30/L30-1","v":{"$error":"#DIV/0!"}},null,{"$f":"L30*(1+$J$6)","v":0},{"$f":"ROUND(ROUND(J30,2)*ROUND(M30,6),2)","v":0},{"$nulls":13},9985.9500000000007]
[null,16,"SICRO",5213464,"Placa de advertência em aço, lado de 0,60 m - película retrorrefletiva tipo I + SI - fornecimento e implantação",null,null,null,"und",30,{"$error":"#DIV/0!"},null,0,0]
[null,17,"SICRO",5213863,"Suporte metálico galvanizado para placa de advertência ou regulamentação - lado ou diâmetro de 0,60 m - fornecimento e implantação",null,null,null,"und",60,{"$error":"#DIV/0!"},null,0,0,{"$nulls":13},13086.06]
[null,18,"SICRO",5213400,"Pintura de faixa com tinta acrílica - espessura de 0,4 mm",null,null,null,"m²",1400,{"$error":"#DIV/0!"},null,0,0]
[{"$nulls":4},"DRENAGEM"]
[null,19,"SINAPI",94273,"ASSENTAMENTO DE GUIA (MEIO-FIO) CONFECCIONADA EM CONCRETO PRÉ-FABRICADO, DIMENSÕES 100X15X13X30 CM (COMPRIMENTO X BASE INFERIOR X BASE SUPERIOR X ALTURA)",null,null,null,"m",12000,{"$f":"M35/L35-1","v":{"$error":"#DIV/0!"}},null,{"$f":"L35*(1+$J$6)","v":0},{"$f":"ROUND(ROUND(J35,2)*ROUND(M35,6),2)","v":0},{"$nulls":13},4514640]
[null,20,"SINAPI",94287,"EXECUÇÃO DE SARJETA DE CONCRETO USINADO, MOLDADA  IN LOCO, 30 CM BASE X 10 CM ALTURA",null,null,null,"m",12000,{"$f":"M36/L36-1","v":{"$error":"#DIV/0!"}},null,0,0]
[null,21,"SICRO",4915724,"Caiação mecanizada com fixador de cal",null,null,null,"m²",3480.0000000000005,{"$f":"(M37/L37-1)","v":{"$error":"#DIV/0!"}},null,0,0,{"$nulls":10},4514640]
[{"$nulls":4},"SERVIÇOS COMPLEMENTARES"]
[null,22,"Codevasf","CPU-02","Conserto de quebra no ramal na rua sem pavimento com fornecimento de material hidráulico",null,null,null,"m",600,{"$f":"M39/L39-1","v":{"$error":"#DIV/0!"}},null,{"$f":"L39*(1+$J$6)","v":0},{"$f":"ROUND(ROUND(J39,2)*ROUND(M39,6),2)","v":0},{"$nulls":13},139854]
[{"$nulls":4},"PROJETO EXECUTIVO"]
[null,23,"Codevasf","Composição Própria","Projeto Executivo",null,null,null,"m²",42000,{"$f":"M41/L41-1","v":{"$error":"#DIV/0!"}},null,{"$f":"L41*(1+$J$6)","v":0},{"$f":"ROUND(ROUND(J41,2)*ROUND(M41,6),2)","v":0},{"$nulls":13},763671.38]
[{"$nulls":4},"MOMENTO DE TRANSPORTE"]
[null,24,"SICRO",5914359,"Transporte com caminhão basculante de 10 m³ - rodovia em leito natural",null,null,null,"tkm",37330.014492000002,{"$f":"M43/L43-1","v":{"$error":"#DIV/0!"}},null,{"$f":"L43*(1+$J$6)","v":0},{"$f":"ROUND(ROUND(J43,2)*ROUND(M43,6),2)","v":0}]
[null,25,"SICRO",5914374,"Transporte com caminhão basculante de 10 m³ - rodovia em revestimento primário",null,null,null,"tkm",37330.014492000002,{"$error":"#DIV/0!"},null,0,0]
[null,26,"SICRO",5914389,"Transporte com caminhão basculante de 10 m³ - rodovia pavimentada",null,null,null,"tkm",91183.264992000011,{"$error":"#DIV/0!"},null,0,0]
[null,27,"SICRO",5914449,"Transporte com caminhão carroceria de 15 t - rodovia em leito natural",null,null,null,"tkm",509.53113600000012,{"$error":"#DIV/0!"},null,0,0]
[null,28,"SICRO",5914464,"Transporte com caminhão carroceria de 15 t - rodovia em revestimento primário",null,null,null,"tkm",509.53113600000012,{"$error":"#DIV/0!"},null,0,0]
[null,29,"SICRO",5914479,"Transporte com caminhão carroceria de 15 t - rodovia pavimentada",null,null,null,"tkm",509.53113600000012,{"$error":"#DIV/0!"},null,0,0]
[null,"VALOR TOTAL DO SRP",{"$nulls":11},{"$f":"SUM(N10:N48)","v":0},{"$f":"N49/J14","v":0},{"$nulls":12},{"$f":"SUM(AB18:AB41)","v":35389795.700000003}]
[null,"Obs.: Os valores estão apresentados com apenas 2 casas decimais, mas os valores da presente planilha foram calculados utilizando a precisão de 6 casa decimais. "]
[]
[]
[]
[]
[]
[]
[null,null,null," "]

{"sheet":"3.ARAÇUAI","index":2,"n_rows":57,"n_cols":33,"rows_kept":57,"cut":false,"hidden":false,"merged":[[47,4,47,7],[48,1,48,12],[40,4,40,7],[42,4,42,7],[43,4,43,7],[44,4,44,7],[45,4,45,7],[46,4,46,7],[31,4,31,7],[32,4,32,7],[34,4,34,7],[35,4,35,7],[36,4,36,7],[38,4,38,7],[25,4,25,7],[26,4,26,7],[27,4,27,7],[28,4,28,7],[29,4,29,7],[30,4,30,7],[18,4,18,7],[19,4,19,7],[21,4,21,7],[22,4,22,7],[23,4,23,7],[24,4,24,7],[9,18,9,19],[10,4,10,7],[11,4,11,7],[13,4,13,7],[14,4,14,7],[16,4,16,7],[1,1,3,11],[4,1,4,13],[5,1,8,1],[5,2,8,2],[5,3,8,3],[5,4,8,7],[6,9,7,9],[6,12,8,12],[6,13,8,13]]}
[{"$nulls":13},"xxxxxxx"]
[null,"LOGOTIPO DA EMPRESA"]
[]
[{"$nulls":12},"Data base orçamento:","2024-08-01"]
[null,"EXECUÇÃO DE SERVIÇOS DE IMPLANTAÇÃO DE PAVIMENTAÇÃO EM BLOCO DE CONCRETO INTERTRAVADO (BLOQUETES), EM VIAS DE MUNICÍPIOS DIVERSOS INSERIDOS NA ÁREA DE ATUAÇÃO DA 1ª SUPERINTENDÊNCIA REGIONAL DA CODEVASF, NO ESTADO DE MINAS GERAIS - ITEM 3 - REGIÃO: ARAÇUAÍ/MG"]
[null,"ITEM","ORIGEM\nCOMPOSIÇÃO","CÓDIGO\nCOMPOSIÇÃO","DISCRIMINAÇÃO DOS SERVIÇOS",null,null,null,"BDI % =",{"$f":"BDI!C17","v":0},"BDI  DIFERENCIADO% =",{"$f":"BDI!C65","v":0},"R$/m² =",{"$f":"N49/I8","v":0}]
[{"$nulls":8},"Total de m²","Encargos Sociais:","Horista (%)","Mensalista (%)","PREÇO UNITÁRIO COM BDI","PREÇO TOTAL COM BDI "]
[{"$nulls":8},42000,null,{"$f":"'ENC. SOCIAIS'!$E$51","v":0},{"$f":"'ENC. SOCIAIS'!$F$51","v":0}]
[{"$nulls":8},"UND","QTDE.","BDI","PREÇO UNITÁRIO",{"$nulls":15},"TOTAL"]
[{"$nulls":4},"MOBILIZAÇÃO/DESMOBILIZAÇÃO"]
[null,1,"Codevasf","Mob","Mobilização",null,null,null,"kmxfrente",450,{"$f":"(M11/L11-1)","v":{"$error":"#DIV/0!"}},null,{"$f":"L11*(1+$J$6)","v":0},{"$f":"ROUND(ROUND(J11,2)*ROUND(M11,6),2)","v":0},{"$f":"N11/$N$49","v":{"$error":"#DIV/0!"}},{"$nulls":11},57163.47]
[null,2,"Codevasf","Mob","Desmobilização",null,null,null,"kmxfrente",450,{"$f":"(M12/L12-1)","v":{"$error":"#DIV/0!"}},null,{"$f":"L12*(1+$J$6)","v":0},{"$f":"ROUND(ROUND(J12,2)*ROUND(M12,6),2)","v":0},{"$f":"N12/$N$49","v":{"$error":"#DIV/0!"}},{"$nulls":11},57163.47]
[{"$nulls":4},"INSTALAÇÃO DE CANTEIRO"]
[null,3,"Codevasf","Canteiro","Canteiro de Obras e Almoxarifado",null,null,null,"frente",5,{"$f":"(M14/L14-1)","v":{"$error":"#DIV/0!"}},null,{"$f":"L14*(1+$J$6)","v":0},{"$f":"ROUND(ROUND(J14,2)*ROUND(M14,6),2)","v":0},{"$nulls":12},190291.53]
[null,4,"SINAPI",103689,"FORNECIMENTO E INSTALAÇÃO DE PLACA DE OBRA COM CHAPA GALVANIZADA E ESTRUTURA DE MADEIRA",null,null,null,"m²",80,{"$f":"(M15/L15-1)","v":{"$error":"#DIV/0!"}},null,0,{"$f":"ROUND(ROUND(J15,2)*ROUND(M15,6),2)","v":0}]
[{"$nulls":4},"ADMINISTRAÇÃO LOCAL DA OBRA"]
[null,5,"Codevasf","Adm Local","Administração Local da Obra",null,null,null,"und",1,{"$f":"(M17/L17-1)","v":{"$error":"#DIV/0!"}},null,{"$f":"L17*(1+$J$6)","v":0},{"$f":"ROUND(ROUND(J17,2)*ROUND(M17,6),2)","v":0},{"$f":"N17/N49","v":{"$error":"#DIV/0!"}}]
[{"$nulls":4},"TERRAPLANAGEM"]
[null,6,"SICRO",5502114,"Escavação, carga e transporte de material de 1ª categoria - DMT de 1.000 a 1.200 m - caminho de serviço em leito natural - com escavadeira e caminhão basculante de 14 m³",null,null,null,"m³",11339.999999999998,{"$f":"M19/L19-1","v":{"$error":"#DIV/0!"}},null,{"$f":"L19*(1+$J$6)","v":0},{"$f":"ROUND(ROUND(J19,2)*ROUND(M19,6),2)","v":0},{"$nulls":13},366912]
[null,7,"SICRO",4413942,"Espalhamento de material em bota-fora",null,null,null,"m³",4200,{"$error":"#DIV/0!"},null,0,0,{"$nulls":13},84084,{"$nulls":4},1]
[{"$nulls":4},"PAVIMENTAÇÃO"]
[null,8,"SINAPI",36170,"Bloquete/piso intertravado de concreto - modelo hexagonal/onda/16 faces/retangular/t ijolinho/paver/holandes/paralelepipedo, *22 cm x 11* cm, e = 8 cm, resistencia de 35 mpa (nbr 9781), cor natural - fornecimento",null,null,null,"m²",42168,{"$f":"M22/L22-1","v":{"$error":"#DIV/0!"}},null,{"$f":"L22*(1+$J$6)","v":0},{"$f":"ROUND(ROUND(J22,2)*ROUND(M22,6),2)","v":0}]
[null,9,"SINAPI","92404 ADAPTADA","Execução de pavimento em piso intertravado, com blocos pré-moldados, espessura 8 cm - exclusive fornecimento de bloquete",null,null,null,"m²",42000,{"$error":"#DIV/0!"},null,0,0,{"$nulls":13},13037300.310000001]
[null,10,"SICRO",5915014,"Transporte com caminhão carroceria com capacidade de 11 t e com guindauto de 45 t.m - rodovia pavimentada",null,null,null,"tkm",602112.00000000012,{"$error":"#DIV/0!"},null,0,0]
[null,11,"SICRO",5915321,"Transporte com caminhão basculante de 14 m³ - rodovia pavimentada (colchão de areia)",null,null,null,"tkm",143136,{"$error":"#DIV/0!"},null,0,0]
[null,12,"SICRO",5915321,"Transporte com caminhão basculante de 14 m³ - rodovia pavimentada (pó de pedra)",null,null,null,"tkm",37044,{"$error":"#DIV/0!"},null,0,0]
[null,13,"SICRO",4011221,"Base estabilizada granulometricamente com mistura de solos na pista com material de jazida",null,null,null,"m³",6300,{"$error":"#DIV/0!"},null,0,0,{"$nulls":13},15919722]
[null,14,"SICRO",4011209,"Regularização do subleito",null,null,null,"m²",42000,{"$error":"#DIV/0!"},null,0,0,{"$nulls":13},540540]
[{"$nulls":4},"SINALIZAÇÃO"]
[null,15,"SICRO",5213440,"Fornecimento e implantação de placa de regulamentação em aço D = 0,60 m - película retrorrefletiva tipo I + SI",null,null,null,"und",30,{"$f":"M30/L30-1","v":{"$error":"#DIV/0!"}},null,{"$f":"L30*(1+$J$6)","v":0},{"$f":"ROUND(ROUND(J30,2)*ROUND(M30,6),2)","v":0},{"$nulls":13},9985.9500000000007]
[null,16,"SICRO",5213464,"Placa de advertência em aço, lado de 0,60 m - película retrorrefletiva tipo I + SI - fornecimento e implantação",null,null,null,"und",30,{"$error":"#DIV/0!"},null,0,0]
[null,17,"SICRO",5213863,"Suporte metálico galvanizado para placa de advertência ou regulamentação - lado ou diâmetro de 0,60 m - fornecimento e implantação",null,null,null,"und",60,{"$error":"#DIV/0!"},null,0,0,{"$nulls":13},13086.06]
[null,18,"SICRO",5213400,"Pintura de faixa com tinta acrílica - espessura de 0,4 mm",null,null,null,"m²",1400,{"$error":"#DIV/0!"},null,0,0]
[{"$nulls":4},"DRENAGEM"]
[null,19,"SINAPI",94273,"ASSENTAMENTO DE GUIA (MEIO-FIO) CONFECCIONADA EM CONCRETO PRÉ-FABRICADO, DIMENSÕES 100X15X13X30 CM (COMPRIMENTO X BASE INFERIOR X BASE SUPERIOR X ALTURA)",null,null,null,"m",12000,{"$f":"M35/L35-1","v":{"$error":"#DIV/0!"}},null,{"$f":"L35*(1+$J$6)","v":0},{"$f":"ROUND(ROUND(J35,2)*ROUND(M35,6),2)","v":0},{"$nulls":13},4514640]
[null,20,"SINAPI",94287,"EXECUÇÃO DE SARJETA DE CONCRETO USINADO, MOLDADA  IN LOCO, 30 CM BASE X 10 CM ALTURA",null,null,null,"m",12000,{"$f":"M36/L36-1","v":{"$error":"#DIV/0!"}},null,0,0]
[null,21,"SICRO",4915724,"Caiação mecanizada com fixador de cal",null,null,null,"m²",3480.0000000000005,{"$f":"(M37/L37-1)","v":{"$error":"#DIV/0!"}},null,0,0,{"$nulls":10},4514640]
[{"$nulls":4},"SERVIÇOS COMPLEMENTARES"]
[null,22,"Codevasf","CPU-02","Conserto de quebra no ramal na rua sem pavimento com fornecimento de material hidráulico",null,null,null,"m",600,{"$f":"M39/L39-1","v":{"$error":"#DIV/0!"}},null,{"$f":"L39*(1+$J$6)","v":0},{"$f":"ROUND(ROUND(J39,2)*ROUND(M39,6),2)","v":0},{"$nulls":13},139854]
[{"$nulls":4},"PROJETO EXECUTIVO"]
[null,23,"Codevasf","Composição Própria","Projeto Executivo",null,null,null,"m²",42000,{"$f":"M41/L41-1","v":{"$error":"#DIV/0!"}},null,{"$f":"L41*(1+$J$6)","v":0},{"$f":"ROUND(ROUND(J41,2)*ROUND(M41,6),2)","v":0},{"$nulls":13},763671.38]
[{"$nulls":4},"MOMENTO DE TRANSPORTE"]
[null,24,"SICRO",5914359,"Transporte com caminhão basculante de 10 m³ - rodovia em leito natural",null,null,null,"tkm",45290.048796000003,{"$f":"M43/L43-1","v":{"$error":"#DIV/0!"}},null,{"$f":"L43*(1+$J$6)","v":0},{"$f":"ROUND(ROUND(J43,2)*ROUND(M43,6),2)","v":0}]
[null,25,"SICRO",5914374,"Transporte com caminhão basculante de 10 m³ - rodovia em revestimento primário",null,null,null,"tkm",45290.048796000003,{"$error":"#DIV/0!"},null,0,0]
[null,26,"SICRO",5914389,"Transporte com caminhão basculante de 10 m³ - rodovia pavimentada",null,null,null,"tkm",99143.299296000012,{"$error":"#DIV/0!"},null,0,0]
[null,27,"SICRO",5914449,"Transporte com caminhão carroceria de 15 t - rodovia em leito natural",null,null,null,"tkm",509.53113600000012,{"$error":"#DIV/0!"},null,0,0]
[null,28,"SICRO",5914464,"Transporte com caminhão carroceria de 15 t - rodovia em revestimento primário",null,null,null,"tkm",509.53113600000012,{"$error":"#DIV/0!"},null,0,0]
[null,29,"SICRO",5914479,"Transporte com caminhão carroceria de 15 t - rodovia pavimentada",null,null,null,"tkm",509.53113600000012,{"$error":"#DIV/0!"},null,0,0]
[null,"VALOR TOTAL DO SRP",{"$nulls":11},{"$f":"SUM(N10:N48)","v":0},{"$f":"N49/J14","v":0},{"$nulls":12},{"$f":"SUM(AB18:AB41)","v":35389795.700000003}]
[null,"Obs.: Os valores estão apresentados com apenas 2 casas decimais, mas os valores da presente planilha foram calculados utilizando a precisão de 6 casa decimais. "]
[]
[]
[]
[]
[]
[]
[null,null,null," "]

{"sheet":"4.CAPELINHA","index":3,"n_rows":57,"n_cols":33,"rows_kept":57,"cut":false,"hidden":false,"merged":[[47,4,47,7],[48,1,48,12],[40,4,40,7],[42,4,42,7],[43,4,43,7],[44,4,44,7],[45,4,45,7],[46,4,46,7],[31,4,31,7],[32,4,32,7],[34,4,34,7],[35,4,35,7],[36,4,36,7],[38,4,38,7],[25,4,25,7],[26,4,26,7],[27,4,27,7],[28,4,28,7],[29,4,29,7],[30,4,30,7],[18,4,18,7],[19,4,19,7],[21,4,21,7],[22,4,22,7],[23,4,23,7],[24,4,24,7],[9,18,9,19],[10,4,10,7],[11,4,11,7],[13,4,13,7],[14,4,14,7],[16,4,16,7],[1,1,3,11],[4,1,4,13],[5,1,8,1],[5,2,8,2],[5,3,8,3],[5,4,8,7],[6,9,7,9],[6,12,8,12],[6,13,8,13]]}
[{"$nulls":13},"xxxxxxx"]
[null,"LOGOTIPO DA EMPRESA"]
[]
[{"$nulls":12},"Data base orçamento:","2024-08-01"]
[null,"EXECUÇÃO DE SERVIÇOS DE IMPLANTAÇÃO DE PAVIMENTAÇÃO EM BLOCO DE CONCRETO INTERTRAVADO (BLOQUETES), EM VIAS DE MUNICÍPIOS DIVERSOS INSERIDOS NA ÁREA DE ATUAÇÃO DA 1ª SUPERINTENDÊNCIA REGIONAL DA CODEVASF, NO ESTADO DE MINAS GERAIS - ITEM 4 - REGIÃO: CAPELINHA/MG"]
[null,"ITEM","ORIGEM\nCOMPOSIÇÃO","CÓDIGO\nCOMPOSIÇÃO","DISCRIMINAÇÃO DOS SERVIÇOS",null,null,null,"BDI % =",{"$f":"BDI!C17","v":0},"BDI  DIFERENCIADO% =",{"$f":"BDI!C65","v":0},"R$/m² =",{"$f":"N49/I8","v":0}]
[{"$nulls":8},"Total de m²","Encargos Sociais:","Horista (%)","Mensalista (%)","PREÇO UNITÁRIO COM BDI","PREÇO TOTAL COM BDI "]
[{"$nulls":8},42000,null,{"$f":"'ENC. SOCIAIS'!$E$51","v":0},{"$f":"'ENC. SOCIAIS'!$F$51","v":0}]
[{"$nulls":8},"UND","QTDE.","BDI","PREÇO UNITÁRIO",{"$nulls":15},"TOTAL"]
[{"$nulls":4},"MOBILIZAÇÃO/DESMOBILIZAÇÃO"]
[null,1,"Codevasf","Mob","Mobilização",null,null,null,"kmxfrente",600,{"$f":"(M11/L11-1)","v":{"$error":"#DIV/0!"}},null,{"$f":"L11*(1+$J$6)","v":0},{"$f":"ROUND(ROUND(J11,2)*ROUND(M11,6),2)","v":0},{"$f":"N11/$N$49","v":{"$error":"#DIV/0!"}},{"$nulls":11},57163.47]
[null,2,"Codevasf","Mob","Desmobilização",null,null,null,"kmxfrente",600,{"$f":"(M12/L12-1)","v":{"$error":"#DIV/0!"}},null,{"$f":"L12*(1+$J$6)","v":0},{"$f":"ROUND(ROUND(J12,2)*ROUND(M12,6),2)","v":0},{"$f":"N12/$N$49","v":{"$error":"#DIV/0!"}},{"$nulls":11},57163.47]
[{"$nulls":4},"INSTALAÇÃO DE CANTEIRO"]
[null,3,"Codevasf","Canteiro","Canteiro de Obras e Almoxarifado",null,null,null,"frente",5,{"$f":"(M14/L14-1)","v":{"$error":"#DIV/0!"}},null,{"$f":"L14*(1+$J$6)","v":0},{"$f":"ROUND(ROUND(J14,2)*ROUND(M14,6),2)","v":0},{"$nulls":12},190291.53]
[null,4,"SINAPI",103689,"FORNECIMENTO E INSTALAÇÃO DE PLACA DE OBRA COM CHAPA GALVANIZADA E ESTRUTURA DE MADEIRA",null,null,null,"m²",80,{"$f":"(M15/L15-1)","v":{"$error":"#DIV/0!"}},null,0,{"$f":"ROUND(ROUND(J15,2)*ROUND(M15,6),2)","v":0}]
[{"$nulls":4},"ADMINISTRAÇÃO LOCAL DA OBRA"]
[null,5,"Codevasf","Adm Local","Administração Local da Obra",null,null,null,"und",1,{"$f":"(M17/L17-1)","v":{"$error":"#DIV/0!"}},null,{"$f":"L17*(1+$J$6)","v":0},{"$f":"ROUND(ROUND(J17,2)*ROUND(M17,6),2)","v":0},{"$f":"N17/N49","v":{"$error":"#DIV/0!"}}]
[{"$nulls":4},"TERRAPLANAGEM"]
[null,6,"SICRO",5502114,"Escavação, carga e transporte de material de 1ª categoria - DMT de 1.000 a 1.200 m - caminho de serviço em leito natural - com escavadeira e caminhão basculante de 14 m³",null,null,null,"m³",11339.999999999998,{"$f":"M19/L19-1","v":{"$error":"#DIV/0!"}},null,{"$f":"L19*(1+$J$6)","v":0},{"$f":"ROUND(ROUND(J19,2)*ROUND(M19,6),2)","v":0},{"$nulls":13},366912]
[null,7,"SICRO",4413942,"Espalhamento de material em bota-fora",null,null,null,"m³",4200,{"$error":"#DIV/0!"},null,0,0,{"$nulls":13},84084,{"$nulls":4},1]
[{"$nulls":4},"PAVIMENTAÇÃO"]
[null,8,"SINAPI",36170,"Bloquete/piso intertravado de concreto - modelo hexagonal/onda/16 faces/retangular/t ijolinho/paver/holandes/paralelepipedo, *22 cm x 11* cm, e = 8 cm, resistencia de 35 mpa (nbr 9781), cor natural - fornecimento",null,null,null,"m²",42168,{"$f":"M22/L22-1","v":{"$error":"#DIV/0!"}},null,{"$f":"L22*(1+$J$6)","v":0},{"$f":"ROUND(ROUND(J22,2)*ROUND(M22,6),2)","v":0}]
[null,9,"SINAPI","92404 ADAPTADA","Execução de pavimento em piso intertravado, com blocos pré-moldados, espessura 8 cm - exclusive fornecimento de bloquete",null,null,null,"m²",42000,{"$error":"#DIV/0!"},null,0,0,{"$nulls":13},13037300.310000001]
[null,10,"SICRO",5915014,"Transporte com caminhão carroceria com capacidade de 11 t e com guindauto de 45 t.m - rodovia pavimentada",null,null,null,"tkm",688128.00000000012,{"$error":"#DIV/0!"},null,0,0]
[null,11,"SICRO",5915321,"Transporte com caminhão basculante de 14 m³ - rodovia pavimentada (colchão de areia)",null,null,null,"tkm",143136,{"$error":"#DIV/0!"},null,0,0]
[null,12,"SICRO",5915321,"Transporte com caminhão basculante de 14 m³ - rodovia pavimentada (pó de pedra)",null,null,null,"tkm",37044,{"$error":"#DIV/0!"},null,0,0]
[null,13,"SICRO",4011221,"Base estabilizada granulometricamente com mistura de solos na pista com material de jazida",null,null,null,"m³",6300,{"$error":"#DIV/0!"},null,0,0,{"$nulls":13},15919722]
[null,14,"SICRO",4011209,"Regularização do subleito",null,null,null,"m²",42000,{"$error":"#DIV/0!"},null,0,0,{"$nulls":13},540540]
[{"$nulls":4},"SINALIZAÇÃO"]
[null,15,"SICRO",5213440,"Fornecimento e implantação de placa de regulamentação em aço D = 0,60 m - película retrorrefletiva tipo I + SI",null,null,null,"und",30,{"$f":"M30/L30-1","v":{"$error":"#DIV/0!"}},null,{"$f":"L30*(1+$J$6)","v":0},{"$f":"ROUND(ROUND(J30,2)*ROUND(M30,6),2)","v":0},{"$nulls":13},9985.9500000000007]
[null,16,"SICRO",5213464,"Placa de advertência em aço, lado de 0,60 m - película retrorrefletiva tipo I + SI - fornecimento e implantação",null,null,null,"und",30,{"$error":"#DIV/0!"},null,0,0]
[null,17,"SICRO",5213863,"Suporte metálico galvanizado para placa de advertência ou regulamentação - lado ou diâmetro de 0,60 m - fornecimento e implantação",null,null,null,"und",60,{"$error":"#DIV/0!"},null,0,0,{"$nulls":13},13086.06]
[null,18,"SICRO",5213400,"Pintura de faixa com tinta acrílica - espessura de 0,4 mm",null,null,null,"m²",1400,{"$error":"#DIV/0!"},null,0,0]
[{"$nulls":4},"DRENAGEM"]
[null,19,"SINAPI",94273,"ASSENTAMENTO DE GUIA (MEIO-FIO) CONFECCIONADA EM CONCRETO PRÉ-FABRICADO, DIMENSÕES 100X15X13X30 CM (COMPRIMENTO X BASE INFERIOR X BASE SUPERIOR X ALTURA)",null,null,null,"m",12000,{"$f":"M35/L35-1","v":{"$error":"#DIV/0!"}},null,{"$f":"L35*(1+$J$6)","v":0},{"$f":"ROUND(ROUND(J35,2)*ROUND(M35,6),2)","v":0},{"$nulls":13},4514640]
[null,20,"SINAPI",94287,"EXECUÇÃO DE SARJETA DE CONCRETO USINADO, MOLDADA  IN LOCO, 30 CM BASE X 10 CM ALTURA",null,null,null,"m",12000,{"$f":"M36/L36-1","v":{"$error":"#DIV/0!"}},null,0,0]
[null,21,"SICRO",4915724,"Caiação mecanizada com fixador de cal",null,null,null,"m²",3480.0000000000005,{"$f":"(M37/L37-1)","v":{"$error":"#DIV/0!"}},null,0,0,{"$nulls":10},4514640]
[{"$nulls":4},"SERVIÇOS COMPLEMENTARES"]
[null,22,"Codevasf","CPU-02","Conserto de quebra no ramal na rua sem pavimento com fornecimento de material hidráulico",null,null,null,"m",600,{"$f":"M39/L39-1","v":{"$error":"#DIV/0!"}},null,{"$f":"L39*(1+$J$6)","v":0},{"$f":"ROUND(ROUND(J39,2)*ROUND(M39,6),2)","v":0},{"$nulls":13},139854]
[{"$nulls":4},"PROJETO EXECUTIVO"]
[null,23,"Codevasf","Composição Própria","Projeto Executivo",null,null,null,"m²",42000,{"$f":"M41/L41-1","v":{"$error":"#DIV/0!"}},null,{"$f":"L41*(1+$J$6)","v":0},{"$f":"ROUND(ROUND(J41,2)*ROUND(M41,6),2)","v":0},{"$nulls":13},763671.38]
[{"$nulls":4},"MOMENTO DE TRANSPORTE"]
[null,24,"SICRO",5914359,"Transporte com caminhão basculante de 10 m³ - rodovia em leito natural",null,null,null,"tkm",45290.048796000003,{"$f":"M43/L43-1","v":{"$error":"#DIV/0!"}},null,{"$f":"L43*(1+$J$6)","v":0},{"$f":"ROUND(ROUND(J43,2)*ROUND(M43,6),2)","v":0}]
[null,25,"SICRO",5914374,"Transporte com caminhão basculante de 10 m³ - rodovia em revestimento primário",null,null,null,"tkm",45290.048796000003,{"$error":"#DIV/0!"},null,0,0]
[null,26,"SICRO",5914389,"Transporte com caminhão basculante de 10 m³ - rodovia pavimentada",null,null,null,"tkm",99143.299296000012,{"$error":"#DIV/0!"},null,0,0]
[null,27,"SICRO",5914449,"Transporte com caminhão carroceria de 15 t - rodovia em leito natural",null,null,null,"tkm",509.53113600000012,{"$error":"#DIV/0!"},null,0,0]
[null,28,"SICRO",5914464,"Transporte com caminhão carroceria de 15 t - rodovia em revestimento primário",null,null,null,"tkm",509.53113600000012,{"$error":"#DIV/0!"},null,0,0]
[null,29,"SICRO",5914479,"Transporte com caminhão carroceria de 15 t - rodovia pavimentada",null,null,null,"tkm",509.53113600000012,{"$error":"#DIV/0!"},null,0,0]
[null,"VALOR TOTAL DO SRP",{"$nulls":11},{"$f":"SUM(N10:N48)","v":0},{"$f":"N49/J14","v":0},{"$nulls":12},{"$f":"SUM(AB18:AB41)","v":35389795.700000003}]
[null,"Obs.: Os valores estão apresentados com apenas 2 casas decimais, mas os valores da presente planilha foram calculados utilizando a precisão de 6 casa decimais. "]
[]
[]
[]
[]
[]
[]
[null,null,null," "]

{"sheet":"5.ALMENARA","index":4,"n_rows":57,"n_cols":33,"rows_kept":57,"cut":false,"hidden":false,"merged":[[47,4,47,7],[48,1,48,12],[40,4,40,7],[42,4,42,7],[43,4,43,7],[44,4,44,7],[45,4,45,7],[46,4,46,7],[31,4,31,7],[32,4,32,7],[34,4,34,7],[35,4,35,7],[36,4,36,7],[38,4,38,7],[25,4,25,7],[26,4,26,7],[27,4,27,7],[28,4,28,7],[29,4,29,7],[30,4,30,7],[18,4,18,7],[19,4,19,7],[21,4,21,7],[22,4,22,7],[23,4,23,7],[24,4,24,7],[9,18,9,19],[10,4,10,7],[11,4,11,7],[13,4,13,7],[14,4,14,7],[16,4,16,7],[1,1,3,11],[4,1,4,13],[5,1,8,1],[5,2,8,2],[5,3,8,3],[5,4,8,7],[6,9,7,9],[6,12,8,12],[6,13,8,13]]}
[{"$nulls":13},"xxxxxxx"]
[null,"LOGOTIPO DA EMPRESA"]
[]
[{"$nulls":12},"Data base orçamento:","2024-08-01"]
[null,"EXECUÇÃO DE SERVIÇOS DE IMPLANTAÇÃO DE PAVIMENTAÇÃO EM BLOCO DE CONCRETO INTERTRAVADO (BLOQUETES), EM VIAS DE MUNICÍPIOS DIVERSOS INSERIDOS NA ÁREA DE ATUAÇÃO DA 1ª SUPERINTENDÊNCIA REGIONAL DA CODEVASF, NO ESTADO DE MINAS GERAIS - ITEM 5 - REGIÃO: ALMENARA/MG"]
[null,"ITEM","ORIGEM\nCOMPOSIÇÃO","CÓDIGO\nCOMPOSIÇÃO","DISCRIMINAÇÃO DOS SERVIÇOS",null,null,null,"BDI % =",{"$f":"BDI!C17","v":0},"BDI  DIFERENCIADO% =",{"$f":"BDI!C65","v":0},"R$/m² =",{"$f":"N49/I8","v":0}]
[{"$nulls":8},"Total de m²","Encargos Sociais:","Horista (%)","Mensalista (%)","PREÇO UNITÁRIO COM BDI","PREÇO TOTAL COM BDI "]
[{"$nulls":8},42000,null,{"$f":"'ENC. SOCIAIS'!$E$51","v":0},{"$f":"'ENC. SOCIAIS'!$F$51","v":0}]
[{"$nulls":8},"UND","QTDE.","BDI","PREÇO UNITÁRIO",{"$nulls":15},"TOTAL"]
[{"$nulls":4},"MOBILIZAÇÃO/DESMOBILIZAÇÃO"]
[null,1,"Codevasf","Mob","Mobilização",null,null,null,"kmxfrente",450,{"$f":"(M11/L11-1)","v":{"$error":"#DIV/0!"}},null,{"$f":"L11*(1+$J$6)","v":0},{"$f":"ROUND(ROUND(J11,2)*ROUND(M11,6),2)","v":0},{"$f":"N11/$N$49","v":{"$error":"#DIV/0!"}},{"$nulls":11},57163.47]
[null,2,"Codevasf","Mob","Desmobilização",null,null,null,"kmxfrente",450,{"$f":"(M12/L12-1)","v":{"$error":"#DIV/0!"}},null,{"$f":"L12*(1+$J$6)","v":0},{"$f":"ROUND(ROUND(J12,2)*ROUND(M12,6),2)","v":0},{"$f":"N12/$N$49","v":{"$error":"#DIV/0!"}},{"$nulls":11},57163.47]
[{"$nulls":4},"INSTALAÇÃO DE CANTEIRO"]
[null,3,"Codevasf","Canteiro","Canteiro de Obras e Almoxarifado",null,null,null,"frente",5,{"$f":"(M14/L14-1)","v":{"$error":"#DIV/0!"}},null,{"$f":"L14*(1+$J$6)","v":0},{"$f":"ROUND(ROUND(J14,2)*ROUND(M14,6),2)","v":0},{"$nulls":12},190291.53]
[null,4,"SINAPI",103689,"FORNECIMENTO E INSTALAÇÃO DE PLACA DE OBRA COM CHAPA GALVANIZADA E ESTRUTURA DE MADEIRA",null,null,null,"m²",80,{"$f":"(M15/L15-1)","v":{"$error":"#DIV/0!"}},null,0,{"$f":"ROUND(ROUND(J15,2)*ROUND(M15,6),2)","v":0}]
[{"$nulls":4},"ADMINISTRAÇÃO LOCAL DA OBRA"]
[null,5,"Codevasf","Adm Local","Administração Local da Obra",null,null,null,"und",1,{"$f":"(M17/L17-1)","v":{"$error":"#DIV/0!"}},null,{"$f":"L17*(1+$J$6)","v":0},{"$f":"ROUND(ROUND(J17,2)*ROUND(M17,6),2)","v":0},{"$f":"N17/N49","v":{"$error":"#DIV/0!"}}]
[{"$nulls":4},"TERRAPLANAGEM"]
[null,6,"SICRO",5502114,"Escavação, carga e transporte de material de 1ª categoria - DMT de 1.000 a 1.200 m - caminho de serviço em leito natural - com escavadeira e caminhão basculante de 14 m³",null,null,null,"m³",11339.999999999998,{"$f":"M19/L19-1","v":{"$error":"#DIV/0!"}},null,{"$f":"L19*(1+$J$6)","v":0},{"$f":"ROUND(ROUND(J19,2)*ROUND(M19,6),2)","v":0},{"$nulls":13},366912]
[null,7,"SICRO",4413942,"Espalhamento de material em bota-fora",null,null,null,"m³",4200,{"$error":"#DIV/0!"},null,0,0,{"$nulls":13},84084,{"$nulls":4},1]
[{"$nulls":4},"PAVIMENTAÇÃO"]
[null,8,"SINAPI",36170,"Bloquete/piso intertravado de concreto - modelo hexagonal/onda/16 faces/retangular/t ijolinho/paver/holandes/paralelepipedo, *22 cm x 11* cm, e = 8 cm, resistencia de 35 mpa (nbr 9781), cor natural - fornecimento",null,null,null,"m²",42168,{"$f":"M22/L22-1","v":{"$error":"#DIV/0!"}},null,{"$f":"L22*(1+$J$6)","v":0},{"$f":"ROUND(ROUND(J22,2)*ROUND(M22,6),2)","v":0}]
[null,9,"SINAPI","92404 ADAPTADA","Execução de pavimento em piso intertravado, com blocos pré-moldados, espessura 8 cm - exclusive fornecimento de bloquete",null,null,null,"m²",42000,{"$error":"#DIV/0!"},null,0,0,{"$nulls":13},13037300.310000001]
[null,10,"SICRO",5915014,"Transporte com caminhão carroceria com capacidade de 11 t e com guindauto de 45 t.m - rodovia pavimentada",null,null,null,"tkm",645120.00000000012,{"$error":"#DIV/0!"},null,0,0]
[null,11,"SICRO",5915321,"Transporte com caminhão basculante de 14 m³ - rodovia pavimentada (colchão de areia)",null,null,null,"tkm",143136,{"$error":"#DIV/0!"},null,0,0]
[null,12,"SICRO",5915321,"Transporte com caminhão basculante de 14 m³ - rodovia pavimentada (pó de pedra)",null,null,null,"tkm",37044,{"$error":"#DIV/0!"},null,0,0]
[null,13,"SICRO",4011221,"Base estabilizada granulometricamente com mistura de solos na pista com material de jazida",null,null,null,"m³",6300,{"$error":"#DIV/0!"},null,0,0,{"$nulls":13},15919722]
[null,14,"SICRO",4011209,"Regularização do subleito",null,null,null,"m²",42000,{"$error":"#DIV/0!"},null,0,0,{"$nulls":13},540540]
[{"$nulls":4},"SINALIZAÇÃO"]
[null,15,"SICRO",5213440,"Fornecimento e implantação de placa de regulamentação em aço D = 0,60 m - película retrorrefletiva tipo I + SI",null,null,null,"und",30,{"$f":"M30/L30-1","v":{"$error":"#DIV/0!"}},null,{"$f":"L30*(1+$J$6)","v":0},{"$f":"ROUND(ROUND(J30,2)*ROUND(M30,6),2)","v":0},{"$nulls":13},9985.9500000000007]
[null,16,"SICRO",5213464,"Placa de advertência em aço, lado de 0,60 m - película retrorrefletiva tipo I + SI - fornecimento e implantação",null,null,null,"und",30,{"$error":"#DIV/0!"},null,0,0]
[null,17,"SICRO",5213863,"Suporte metálico galvanizado para placa de advertência ou regulamentação - lado ou diâmetro de 0,60 m - fornecimento e implantação",null,null,null,"und",60,{"$error":"#DIV/0!"},null,0,0,{"$nulls":13},13086.06]
[null,18,"SICRO",5213400,"Pintura de faixa com tinta acrílica - espessura de 0,4 mm",null,null,null,"m²",1400,{"$error":"#DIV/0!"},null,0,0]
[{"$nulls":4},"DRENAGEM"]
[null,19,"SINAPI",94273,"ASSENTAMENTO DE GUIA (MEIO-FIO) CONFECCIONADA EM CONCRETO PRÉ-FABRICADO, DIMENSÕES 100X15X13X30 CM (COMPRIMENTO X BASE INFERIOR X BASE SUPERIOR X ALTURA)",null,null,null,"m",12000,{"$f":"M35/L35-1","v":{"$error":"#DIV/0!"}},null,{"$f":"L35*(1+$J$6)","v":0},{"$f":"ROUND(ROUND(J35,2)*ROUND(M35,6),2)","v":0},{"$nulls":13},4514640]
[null,20,"SINAPI",94287,"EXECUÇÃO DE SARJETA DE CONCRETO USINADO, MOLDADA  IN LOCO, 30 CM BASE X 10 CM ALTURA",null,null,null,"m",12000,{"$f":"M36/L36-1","v":{"$error":"#DIV/0!"}},null,0,0]
[null,21,"SICRO",4915724,"Caiação mecanizada com fixador de cal",null,null,null,"m²",3480.0000000000005,{"$f":"(M37/L37-1)","v":{"$error":"#DIV/0!"}},null,0,0,{"$nulls":10},4514640]
[{"$nulls":4},"SERVIÇOS COMPLEMENTARES"]
[null,22,"Codevasf","CPU-02","Conserto de quebra no ramal na rua sem pavimento com fornecimento de material hidráulico",null,null,null,"m",600,{"$f":"M39/L39-1","v":{"$error":"#DIV/0!"}},null,{"$f":"L39*(1+$J$6)","v":0},{"$f":"ROUND(ROUND(J39,2)*ROUND(M39,6),2)","v":0},{"$nulls":13},139854]
[{"$nulls":4},"PROJETO EXECUTIVO"]
[null,23,"Codevasf","Composição Própria","Projeto Executivo",null,null,null,"m²",42000,{"$f":"M41/L41-1","v":{"$error":"#DIV/0!"}},null,{"$f":"L41*(1+$J$6)","v":0},{"$f":"ROUND(ROUND(J41,2)*ROUND(M41,6),2)","v":0},{"$nulls":13},763671.38]
[{"$nulls":4},"MOMENTO DE TRANSPORTE"]
[null,24,"SICRO",5914359,"Transporte com caminhão basculante de 10 m³ - rodovia em leito natural",null,null,null,"tkm",45290.048796000003,{"$f":"M43/L43-1","v":{"$error":"#DIV/0!"}},null,{"$f":"L43*(1+$J$6)","v":0},{"$f":"ROUND(ROUND(J43,2)*ROUND(M43,6),2)","v":0}]
[null,25,"SICRO",5914374,"Transporte com caminhão basculante de 10 m³ - rodovia em revestimento primário",null,null,null,"tkm",45290.048796000003,{"$error":"#DIV/0!"},null,0,0]
[null,26,"SICRO",5914389,"Transporte com caminhão basculante de 10 m³ - rodovia pavimentada",null,null,null,"tkm",99143.299296000012,{"$error":"#DIV/0!"},null,0,0]
[null,27,"SICRO",5914449,"Transporte com caminhão carroceria de 15 t - rodovia em leito natural",null,null,null,"tkm",509.53113600000012,{"$error":"#DIV/0!"},null,0,0]
[null,28,"SICRO",5914464,"Transporte com caminhão carroceria de 15 t - rodovia em revestimento primário",null,null,null,"tkm",509.53113600000012,{"$error":"#DIV/0!"},null,0,0]
[null,29,"SICRO",5914479,"Transporte com caminhão carroceria de 15 t - rodovia pavimentada",null,null,null,"tkm",509.53113600000012,{"$error":"#DIV/0!"},null,0,0]
[null,"VALOR TOTAL DO SRP",{"$nulls":11},{"$f":"SUM(N10:N48)","v":0},{"$f":"N49/J14","v":0},{"$nulls":12},{"$f":"SUM(AB18:AB41)","v":35389795.700000003}]
[null,"Obs.: Os valores estão apresentados com apenas 2 casas decimais, mas os valores da presente planilha foram calculados utilizando a precisão de 6 casa decimais. "]
[]
[]
[]
[]
[]
[]
[null,null,null," "]

{"sheet":"CRONOG","index":5,"n_rows":36,"n_cols":17,"rows_kept":36,"cut":false,"hidden":false,"merged":[[0,0,0,14],[28,0,28,1],[1,0,1,14],[2,0,2,14],[25,0,25,1],[26,0,26,1],[27,0,27,1]]}
["LOGOTIPO DA EMPRESA"]
["EXECUÇÃO DE SERVIÇOS DE IMPLANTAÇÃO DE PAVIMENTAÇÃO EM BLOCO DE CONCRETO INTERTRAVADO (BLOQUETES), EM VIAS DE MUNICÍPIOS DIVERSOS INSERIDOS NA ÁREA DE ATUAÇÃO DA 1ª SUPERINTENDÊNCIA REGIONAL DA CODEVASF, NO ESTADO DE MINAS GERAIS - ITEM x - REGIÃO: xxxxxxxxxxxx/MG"]
["Cronograma Físico e Financeiro "]
["Item","Descrição","Total Por Etapa","30 DIAS","60 DIAS","90 DIAS","120 DIAS","150 DIAS","180 DIAS","210 DIAS","240 DIAS","270 DIAS","300 DIAS","330 DIAS","360 DIAS"]
[null,{"$f":"'1.JANUARIA'!E10","v":"MOBILIZAÇÃO/DESMOBILIZAÇÃO"},{"$f":"SUM(D5:O5)","v":0}]
[null,null,{"$f":"SUM('1.JANUARIA'!N11:N12)","v":0},{"$nulls":12},{"$f":"SUM(D6:O6)","v":0},{"$f":"IF(P6=C6,\"OK\",\"\")","v":"OK"}]
[null,{"$f":"'1.JANUARIA'!E13","v":"INSTALAÇÃO DE CANTEIRO"},{"$f":"SUM(D7:O7)","v":0}]
[null,null,{"$f":"SUM('1.JANUARIA'!N14:N15)","v":0},{"$nulls":12},{"$f":"SUM(D8:O8)","v":0},{"$f":"IF(P8=C8,\"OK\",\"\")","v":"OK"}]
[null,{"$f":"'1.JANUARIA'!E16","v":"ADMINISTRAÇÃO LOCAL DA OBRA"},{"$f":"SUM(D9:O9)","v":0}]
[null,null,{"$f":"SUM('1.JANUARIA'!N17)","v":0},{"$nulls":12},{"$f":"SUM(D10:O10)","v":0},{"$f":"IF(P10=C10,\"OK\",\"\")","v":"OK"}]
[null,{"$f":"'1.JANUARIA'!E18","v":"TERRAPLANAGEM"},{"$f":"SUM(D11:O11)","v":0}]
[null,null,{"$f":"SUM('1.JANUARIA'!N19:N20)","v":0},{"$nulls":12},{"$f":"SUM(D12:O12)","v":0},{"$f":"IF(P12=C12,\"OK\",\"\")","v":"OK"}]
[null,{"$f":"'1.JANUARIA'!E21","v":"PAVIMENTAÇÃO"},{"$f":"SUM(D13:O13)","v":0}]
[null,null,{"$f":"SUM('1.JANUARIA'!N22:N28)","v":0},{"$nulls":12},{"$f":"SUM(D14:O14)","v":0},{"$f":"IF(P14=C14,\"OK\",\"\")","v":"OK"}]
[null,{"$f":"'1.JANUARIA'!E29","v":"SINALIZAÇÃO"},{"$f":"SUM(D15:O15)","v":0}]
[null,null,{"$f":"SUM('1.JANUARIA'!N30:N33)","v":0},{"$nulls":12},{"$f":"SUM(D16:O16)","v":0},{"$f":"IF(P16=C16,\"OK\",\"\")","v":"OK"}]
[null,{"$f":"'1.JANUARIA'!E34","v":"DRENAGEM"},{"$f":"SUM(D17:O17)","v":0}]
[null,null,{"$f":"SUM('1.JANUARIA'!N35:N37)","v":0},{"$nulls":12},{"$f":"SUM(D18:O18)","v":0},{"$f":"IF(P18=C18,\"OK\",\"\")","v":"OK"}]
[null,{"$f":"'1.JANUARIA'!E38","v":"SERVIÇOS COMPLEMENTARES"},{"$f":"SUM(D19:O19)","v":0}]
[null,null,{"$f":"SUM('1.JANUARIA'!N39)","v":0},{"$nulls":12},{"$f":"SUM(D20:O20)","v":0},{"$f":"IF(P20=C20,\"OK\",\"\")","v":"OK"}]
[null,{"$f":"'1.JANUARIA'!E40","v":"PROJETO EXECUTIVO"},{"$f":"SUM(D21:O21)","v":0}]
[null,null,{"$f":"SUM('1.JANUARIA'!N41)","v":0},{"$nulls":12},{"$f":"SUM(D22:O22)","v":0},{"$f":"IF(P22=C22,\"OK\",\"\")","v":"OK"}]
[null,{"$f":"'1.JANUARIA'!E42","v":"MOMENTO DE TRANSPORTE"},{"$f":"SUM(D23:O23)","v":0}]
[null,null,{"$f":"SUM('1.JANUARIA'!N43:N48)","v":0},{"$nulls":12},{"$f":"SUM(D24:O24)","v":0},{"$f":"IF(P24=C24,\"OK\",\"\")","v":"OK"}]
[]
["Porcentagem",null,null,{"$f":"SUM(D6+D8+D10+D12+D14+D16+D18+D20+D22+D24)/$O$31","v":{"$error":"#DIV/0!"}},{"$f":"SUM(E6+E8+E10+E12+E14+E16+E18+E20+E22+E24)/$O$31","v":{"$error":"#DIV/0!"}},{"$error":"#DIV/0!"},{"$error":"#DIV/0!"},{"$error":"#DIV/0!"},{"$error":"#DIV/0!"},{"$error":"#DIV/0!"},{"$error":"#DIV/0!"},{"$error":"#DIV/0!"},{"$error":"#DIV/0!"},{"$error":"#DIV/0!"},{"$error":"#DIV/0!"}]
["Custo",null,null,{"$f":"$O$31*D26","v":{"$error":"#DIV/0!"}},{"$f":"$O$31*E26","v":{"$error":"#DIV/0!"}},{"$f":"$O$31*F26","v":{"$error":"#DIV/0!"}},{"$error":"#DIV/0!"},{"$error":"#DIV/0!"},{"$error":"#DIV/0!"},{"$error":"#DIV/0!"},{"$error":"#DIV/0!"},{"$error":"#DIV/0!"},{"$error":"#DIV/0!"},{"$error":"#DIV/0!"},{"$error":"#DIV/0!"}]
["Porcentagem Acumulado",null,null,{"$f":"D26","v":{"$error":"#DIV/0!"}},{"$f":"D28+E26","v":{"$error":"#DIV/0!"}},{"$f":"E28+F26","v":{"$error":"#DIV/0!"}},{"$error":"#DIV/0!"},{"$error":"#DIV/0!"},{"$error":"#DIV/0!"},{"$error":"#DIV/0!"},{"$error":"#DIV/0!"},{"$error":"#DIV/0!"},{"$error":"#DIV/0!"},{"$error":"#DIV/0!"},{"$f":"N28+O26","v":{"$error":"#DIV/0!"}}]
["Custo Acumulado",null,null,{"$f":"D27","v":{"$error":"#DIV/0!"}},{"$f":"D29+E27","v":{"$error":"#DIV/0!"}},{"$error":"#DIV/0!"},{"$error":"#DIV/0!"},{"$error":"#DIV/0!"},{"$error":"#DIV/0!"},{"$error":"#DIV/0!"},{"$error":"#DIV/0!"},{"$error":"#DIV/0!"},{"$error":"#DIV/0!"},{"$error":"#DIV/0!"},{"$error":"#DIV/0!"}]
[]
[null,null,null,"Total Geral",{"$nulls":9},"R$",{"$f":"C6+C8+C10+C12+C14+C16+C18+C20+C22+C24","v":0}]
[]
[]
[{"$nulls":14},{"$f":"O29-O31","v":{"$error":"#DIV/0!"}}]
[]
[{"$nulls":14},{"$f":"'1.JANUARIA'!N49","v":0}]

{"sheet":"MOB","index":6,"n_rows":67,"n_cols":9,"rows_kept":67,"cut":false,"hidden":false,"merged":[[0,0,2,7],[3,0,3,7],[4,0,8,4],[4,5,4,6],[5,5,6,6],[5,7,6,7],[7,5,8,6],[7,7,8,7],[10,6,10,7],[60,0,60,1],[10,0,11,0],[10,1,11,1],[10,2,11,2],[10,3,11,3],[10,4,11,4],[10,5,11,5]]}
["LOGOTIPO DA EMPRESA"]
[]
[]
["EXECUÇÃO DE SERVIÇOS DE IMPLANTAÇÃO DE PAVIMENTAÇÃO EM BLOCO DE CONCRETO INTERTRAVADO (BLOQUETES), EM VIAS DE MUNICÍPIOS DIVERSOS INSERIDOS NA ÁREA DE ATUAÇÃO DA 1ª SUPERINTENDÊNCIA REGIONAL DA CODEVASF, NO ESTADO DE MINAS GERAIS - ITEM x - REGIÃO: xxxxxxxxxxxx/MG"]
["MOBILIZAÇÃO/DESMOBILIZAÇÃO (MOB)",{"$nulls":4},"Frentes de serviços"]
[{"$nulls":5},"Distância da Capital ao Canteiro:",null,null,"Fica a cargo de cada SR colocar a distancia adequada de acordo com o historico de mobilização"]
[]
[{"$nulls":5},"Velocidade média de transporte (pavim.):"]
[]
["Transporte dos equipamentos"]
["CODIGO","EQUIPAMENTO","VEÍCULO TRANSPORTADOR","QTDE","K","FU","CUSTO DO TRANSPORTE"]
[{"$nulls":6},"(R$/h)","(R$)/km"]
["E9524",{"$f":"VLOOKUP(A13,#REF!,2,FALSE)","v":{"$error":"#REF!"}},{"$f":"IFERROR(INDEX(#REF!,MATCH(A13,#REF!,0),9),\"ERRO\")","v":"ERRO"},{"$nulls":4},{"$f":"((D13*E13*F13)/$H$8)*G13","v":{"$error":"#DIV/0!"}}]
["E9526",{"$f":"VLOOKUP(A14,#REF!,2,FALSE)","v":{"$error":"#REF!"}},{"$f":"IFERROR(INDEX(#REF!,MATCH(A14,#REF!,0),9),\"ERRO\")","v":"ERRO"},{"$nulls":4},{"$f":"((D14*E14*F14)/$H$8)*G14","v":{"$error":"#DIV/0!"}}]
["E9577",{"$f":"VLOOKUP(A15,#REF!,2,FALSE)","v":{"$error":"#REF!"}},{"$f":"IFERROR(INDEX(#REF!,MATCH(A15,#REF!,0),9),\"ERRO\")","v":"ERRO"},{"$nulls":4},{"$error":"#DIV/0!"}]
["E9518",{"$f":"VLOOKUP(A16,#REF!,2,FALSE)","v":{"$error":"#REF!"}},{"$f":"IFERROR(INDEX(#REF!,MATCH(A16,#REF!,0),9),\"ERRO\")","v":"ERRO"},{"$nulls":4},{"$error":"#DIV/0!"}]
["E9615",{"$f":"VLOOKUP(A17,#REF!,2,FALSE)","v":{"$error":"#REF!"}},{"$f":"IFERROR(INDEX(#REF!,MATCH(A17,#REF!,0),9),\"ERRO\")","v":"ERRO"},{"$nulls":4},{"$error":"#DIV/0!"}]
["E9689",{"$f":"VLOOKUP(A18,#REF!,2,FALSE)","v":{"$error":"#REF!"}},{"$f":"IFERROR(INDEX(#REF!,MATCH(A18,#REF!,0),9),\"ERRO\")","v":"ERRO"},{"$nulls":4},{"$error":"#DIV/0!"}]
["E9530",{"$f":"VLOOKUP(A19,#REF!,2,FALSE)","v":{"$error":"#REF!"}},{"$f":"IFERROR(INDEX(#REF!,MATCH(A19,#REF!,0),9),\"ERRO\")","v":"ERRO"},{"$nulls":4},{"$error":"#DIV/0!"}]
["E9558",{"$f":"VLOOKUP(A20,#REF!,2,FALSE)","v":{"$error":"#REF!"}},{"$f":"IFERROR(INDEX(#REF!,MATCH(A20,#REF!,0),9),\"ERRO\")","v":"ERRO"},{"$nulls":4},{"$error":"#DIV/0!"}]
["E9758",{"$f":"VLOOKUP(A21,#REF!,2,FALSE)","v":{"$error":"#REF!"}},{"$f":"IFERROR(INDEX(#REF!,MATCH(A21,#REF!,0),9),\"ERRO\")","v":"ERRO"},{"$nulls":4},{"$error":"#DIV/0!"}]
["E9685",{"$f":"VLOOKUP(A22,#REF!,2,FALSE)","v":{"$error":"#REF!"}},{"$f":"IFERROR(INDEX(#REF!,MATCH(A22,#REF!,0),9),\"ERRO\")","v":"ERRO"},{"$nulls":4},{"$error":"#DIV/0!"}]
["E9605",{"$f":"VLOOKUP(A23,#REF!,2,FALSE)","v":{"$error":"#REF!"}},{"$f":"IFERROR(INDEX(#REF!,MATCH(A23,#REF!,0),9),\"ERRO\")","v":"ERRO"},{"$nulls":4},{"$error":"#DIV/0!"}]
["E9579",{"$f":"VLOOKUP(A24,#REF!,2,FALSE)","v":{"$error":"#REF!"}},{"$f":"IFERROR(INDEX(#REF!,MATCH(A24,#REF!,0),9),\"ERRO\")","v":"ERRO"},{"$nulls":4},{"$error":"#DIV/0!"}]
["E9509",{"$f":"VLOOKUP(A25,#REF!,2,FALSE)","v":{"$error":"#REF!"}},{"$f":"IFERROR(INDEX(#REF!,MATCH(A25,#REF!,0),9),\"ERRO\")","v":"ERRO"},{"$nulls":4},{"$error":"#DIV/0!"}]
["E9762",{"$f":"VLOOKUP(A26,#REF!,2,FALSE)","v":{"$error":"#REF!"}},{"$f":"IFERROR(INDEX(#REF!,MATCH(A26,#REF!,0),9),\"ERRO\")","v":"ERRO"},{"$nulls":4},{"$error":"#DIV/0!"}]
["E9681",{"$f":"VLOOKUP(A27,#REF!,2,FALSE)","v":{"$error":"#REF!"}},{"$f":"IFERROR(INDEX(#REF!,MATCH(A27,#REF!,0),9),\"ERRO\")","v":"ERRO"},{"$nulls":4},{"$error":"#DIV/0!"}]
["E9545",{"$f":"VLOOKUP(A28,#REF!,2,FALSE)","v":{"$error":"#REF!"}},{"$f":"IFERROR(INDEX(#REF!,MATCH(A28,#REF!,0),9),\"ERRO\")","v":"ERRO"},{"$nulls":4},{"$error":"#DIV/0!"}]
["E9571",{"$f":"VLOOKUP(A29,#REF!,2,FALSE)","v":{"$error":"#REF!"}},{"$f":"IFERROR(INDEX(#REF!,MATCH(A29,#REF!,0),9),\"ERRO\")","v":"ERRO"},{"$nulls":4},{"$error":"#DIV/0!"}]
["E9514",{"$f":"VLOOKUP(A30,#REF!,2,FALSE)","v":{"$error":"#REF!"}},{"$f":"IFERROR(INDEX(#REF!,MATCH(A30,#REF!,0),9),\"ERRO\")","v":"ERRO"},{"$nulls":4},{"$error":"#DIV/0!"}]
["E9511",{"$f":"VLOOKUP(A31,#REF!,2,FALSE)","v":{"$error":"#REF!"}},{"$f":"IFERROR(INDEX(#REF!,MATCH(A31,#REF!,0),9),\"ERRO\")","v":"ERRO"},{"$nulls":4},{"$error":"#DIV/0!"}]
["E9779",{"$f":"VLOOKUP(A32,#REF!,2,FALSE)","v":{"$error":"#REF!"}},{"$f":"IFERROR(INDEX(#REF!,MATCH(A32,#REF!,0),9),\"ERRO\")","v":"ERRO"},{"$nulls":4},{"$error":"#DIV/0!"}]
["E9559",{"$f":"VLOOKUP(A33,#REF!,2,FALSE)","v":{"$error":"#REF!"}},{"$f":"IFERROR(INDEX(#REF!,MATCH(A33,#REF!,0),9),\"ERRO\")","v":"ERRO"},{"$nulls":4},{"$error":"#DIV/0!"}]
["E9584",{"$f":"VLOOKUP(A34,#REF!,2,FALSE)","v":{"$error":"#REF!"}},{"$f":"IFERROR(INDEX(#REF!,MATCH(A34,#REF!,0),9),\"ERRO\")","v":"ERRO"},{"$nulls":4},{"$error":"#DIV/0!"}]
["E9021",{"$f":"VLOOKUP(A35,#REF!,2,FALSE)","v":{"$error":"#REF!"}},{"$f":"IFERROR(INDEX(#REF!,MATCH(A35,#REF!,0),9),\"ERRO\")","v":"ERRO"},{"$nulls":4},{"$error":"#DIV/0!"}]
["E9687",{"$f":"VLOOKUP(A36,#REF!,2,FALSE)","v":{"$error":"#REF!"}},{"$f":"IFERROR(INDEX(#REF!,MATCH(A36,#REF!,0),9),\"ERRO\")","v":"ERRO"},{"$nulls":4},{"$error":"#DIV/0!"}]
["E9667",{"$f":"VLOOKUP(A37,#REF!,2,FALSE)","v":{"$error":"#REF!"}},{"$f":"IFERROR(INDEX(#REF!,MATCH(A37,#REF!,0),9),\"ERRO\")","v":"ERRO"},{"$nulls":4},{"$error":"#DIV/0!"}]
["E9644",{"$f":"VLOOKUP(A38,#REF!,2,FALSE)","v":{"$error":"#REF!"}},{"$f":"IFERROR(INDEX(#REF!,MATCH(A38,#REF!,0),9),\"ERRO\")","v":"ERRO"},{"$nulls":4},{"$error":"#DIV/0!"}]
["E9592",{"$f":"VLOOKUP(A39,#REF!,2,FALSE)","v":{"$error":"#REF!"}},{"$f":"IFERROR(INDEX(#REF!,MATCH(A39,#REF!,0),9),\"ERRO\")","v":"ERRO"},{"$nulls":4},{"$error":"#DIV/0!"}]
["E9540",{"$f":"VLOOKUP(A40,#REF!,2,FALSE)","v":{"$error":"#REF!"}},{"$f":"IFERROR(INDEX(#REF!,MATCH(A40,#REF!,0),9),\"ERRO\")","v":"ERRO"},{"$nulls":4},{"$error":"#DIV/0!"}]
["E9515",{"$f":"VLOOKUP(A41,#REF!,2,FALSE)","v":{"$error":"#REF!"}},{"$f":"IFERROR(INDEX(#REF!,MATCH(A41,#REF!,0),9),\"ERRO\")","v":"ERRO"},{"$nulls":4},{"$error":"#DIV/0!"}]
["E9506",{"$f":"VLOOKUP(A42,#REF!,2,FALSE)","v":{"$error":"#REF!"}},{"$f":"IFERROR(INDEX(#REF!,MATCH(A42,#REF!,0),9),\"ERRO\")","v":"ERRO"},{"$nulls":4},{"$error":"#DIV/0!"}]
["E9256",{"$f":"VLOOKUP(A43,#REF!,2,FALSE)","v":{"$error":"#REF!"}},{"$f":"IFERROR(INDEX(#REF!,MATCH(A43,#REF!,0),9),\"ERRO\")","v":"ERRO"},{"$nulls":4},{"$error":"#DIV/0!"}]
["E9156",{"$f":"VLOOKUP(A44,#REF!,2,FALSE)","v":{"$error":"#REF!"}},{"$f":"IFERROR(INDEX(#REF!,MATCH(A44,#REF!,0),9),\"ERRO\")","v":"ERRO"},{"$nulls":4},{"$error":"#DIV/0!"}]
["E9146",{"$f":"VLOOKUP(A45,#REF!,2,FALSE)","v":{"$error":"#REF!"}},{"$f":"IFERROR(INDEX(#REF!,MATCH(A45,#REF!,0),9),\"ERRO\")","v":"ERRO"},{"$nulls":4},{"$error":"#DIV/0!"}]
["E9010",{"$f":"VLOOKUP(A46,#REF!,2,FALSE)","v":{"$error":"#REF!"}},{"$f":"IFERROR(INDEX(#REF!,MATCH(A46,#REF!,0),9),\"ERRO\")","v":"ERRO"},{"$nulls":4},{"$error":"#DIV/0!"}]
["E9519",{"$f":"VLOOKUP(A47,#REF!,2,FALSE)","v":{"$error":"#REF!"}},{"$f":"IFERROR(INDEX(#REF!,MATCH(A47,#REF!,0),9),\"ERRO\")","v":"ERRO"},{"$nulls":4},{"$error":"#DIV/0!"}]
["E9071",{"$f":"VLOOKUP(A48,#REF!,2,FALSE)","v":{"$error":"#REF!"}},{"$f":"IFERROR(INDEX(#REF!,MATCH(A48,#REF!,0),9),\"ERRO\")","v":"ERRO"},{"$nulls":4},{"$error":"#DIV/0!"}]
["E9064",{"$f":"VLOOKUP(A49,#REF!,2,FALSE)","v":{"$error":"#REF!"}},{"$f":"IFERROR(INDEX(#REF!,MATCH(A49,#REF!,0),9),\"ERRO\")","v":"ERRO"},{"$nulls":4},{"$error":"#DIV/0!"}]
["E9066",{"$f":"VLOOKUP(A50,#REF!,2,FALSE)","v":{"$error":"#REF!"}},{"$f":"IFERROR(INDEX(#REF!,MATCH(A50,#REF!,0),9),\"ERRO\")","v":"ERRO"},{"$nulls":4},{"$error":"#DIV/0!"}]
["E9535",{"$f":"VLOOKUP(A51,#REF!,2,FALSE)","v":{"$error":"#REF!"}},{"$f":"IFERROR(INDEX(#REF!,MATCH(A51,#REF!,0),9),\"ERRO\")","v":"ERRO"},{"$nulls":4},{"$error":"#DIV/0!"}]
["E9507",{"$f":"VLOOKUP(A52,#REF!,2,FALSE)","v":{"$error":"#REF!"}},{"$f":"IFERROR(INDEX(#REF!,MATCH(A52,#REF!,0),9),\"ERRO\")","v":"ERRO"},{"$nulls":4},{"$error":"#DIV/0!"}]
["E9568",{"$f":"VLOOKUP(A53,#REF!,2,FALSE)","v":{"$error":"#REF!"}},{"$f":"IFERROR(INDEX(#REF!,MATCH(A53,#REF!,0),9),\"ERRO\")","v":"ERRO"},{"$nulls":4},{"$error":"#DIV/0!"}]
["E9753",{"$f":"VLOOKUP(A54,#REF!,2,FALSE)","v":{"$error":"#REF!"}},{"$f":"IFERROR(INDEX(#REF!,MATCH(A54,#REF!,0),9),\"ERRO\")","v":"ERRO"},{"$nulls":4},{"$error":"#DIV/0!"}]
["E9623",{"$f":"VLOOKUP(A55,#REF!,2,FALSE)","v":{"$error":"#REF!"}},{"$f":"IFERROR(INDEX(#REF!,MATCH(A55,#REF!,0),9),\"ERRO\")","v":"ERRO"},{"$nulls":4},{"$error":"#DIV/0!"}]
["E9622",{"$f":"VLOOKUP(A56,#REF!,2,FALSE)","v":{"$error":"#REF!"}},{"$f":"IFERROR(INDEX(#REF!,MATCH(A56,#REF!,0),9),\"ERRO\")","v":"ERRO"},{"$nulls":4},{"$error":"#DIV/0!"}]
["E9678",{"$f":"VLOOKUP(A57,#REF!,2,FALSE)","v":{"$error":"#REF!"}},{"$f":"IFERROR(INDEX(#REF!,MATCH(A57,#REF!,0),9),\"ERRO\")","v":"ERRO"},{"$nulls":4},{"$error":"#DIV/0!"}]
[{"$nulls":6},"TOTAL",{"$f":"SUM(H13:H57)","v":{"$error":"#DIV/0!"}}]
[]
[]
["CUSTO TOTAL MOBILIZAÇÃO E DESMOBILIZAÇÃO"]
["DESCRIÇÃO","VALOR"]
["Custo Mobilização (km)",{"$f":"H58","v":{"$error":"#DIV/0!"}}]
["BDI (%)",{"$f":"BDI!C17","v":0}]
["Custo Mobilização (R$/km) com BDI",{"$f":"B63+(B63*B64)","v":{"$error":"#DIV/0!"}}]
["Total de Frentes",{"$f":"#REF!","v":{"$error":"#REF!"}}]
["Custo Mobilização (frentes x distancia)",{"$f":"B65*H6*B66","v":{"$error":"#DIV/0!"}}]

{"sheet":"CANT","index":7,"n_rows":13,"n_cols":6,"rows_kept":13,"cut":false,"hidden":false,"merged":[[0,0,2,5],[3,0,3,5],[3,9,4,9],[4,7,4,8],[9,3,9,4],[12,3,12,4]]}
["LOGOTIPO DA EMPRESA"]
[]
[]
["CANTEIRO DE OBRAS PARA CONSTRUÇAO RODOVIÁRIA"]
["Descrição dos serviços","Tipo de container","Unidade","Quantidade","Preço unitário (R$)","Total (R$)"]
["Escritório e seção técnica"]
["LOCACAO DE CONTAINER 2,30 X 6,00 M, ALT. 2,50 M, PARA ESCRITORIO, SEM DIVISORIAS INTERNAS E SEM SANITARIO (NAO INCLUI MOBILIZACAO/DESMOBILIZACAO)                                                                                                                                                                                                                                                                                                                                                         ",10776,"und",null,null,{"$f":"TRUNC(D7*E7,2)","v":0}]
["Banheiro e vestiário"]
["LOCACAO DE CONTAINER 2,30 X 4,30 M, ALT. 2,50 M, PARA SANITARIO, COM 3 BACIAS, 4 CHUVEIROS, 1 LAVATORIO E 1 MICTORIO (NAO INCLUI MOBILIZACAO/DESMOBILIZACAO)                                                                                                                                                                                                                                                                                                                                              ",10777,"und",null,null,{"$f":"TRUNC(D9*E9,2)","v":0}]
[null,null,null,"TOTAL DO CANTEIRO",null,{"$f":"SUM(F7:F9)","v":0}]
[null,null,null,"DURAÇÃO (MESES)",null,{"$f":"F10*E11","v":0}]
[null,null,null,"BDI",null,{"$f":"BDI!C17","v":0}]
[null,null,null,"TOTAL DO CANTEIRO (com BDI)",null,{"$f":"F11+(F11*F12)","v":0}]

{"sheet":"ADM","index":8,"n_rows":252,"n_cols":9,"rows_kept":252,"cut":false,"hidden":false,"merged":[[194,1,194,4],[250,3,250,4],[250,5,250,6],[251,3,251,4],[251,5,251,6],[139,3,139,4],[139,5,139,6],[156,3,156,4],[156,5,156,6],[243,3,243,4],[243,5,243,6],[239,3,239,4],[239,5,239,6],[235,3,235,4],[235,5,235,6],[229,3,229,4],[229,5,229,6],[225,3,225,4],[225,5,225,6],[216,3,216,4],[216,5,216,6],[212,3,212,4],[212,5,212,6],[207,3,207,4],[247,7,247,8],[248,3,248,4],[248,5,248,6],[248,7,248,8],[249,3,249,4],[249,5,249,6],[249,7,249,8],[245,3,245,4],[245,5,245,6],[245,7,245,8],[246,3,246,4],[246,5,246,6],[246,7,246,8],[243,7,243,8],[244,3,244,4],[244,5,244,6],[244,7,244,8],[241,3,241,4],[241,5,241,6],[241,7,241,8],[242,3,242,4],[242,5,242,6],[242,7,242,8],[239,7,239,8],[240,3,240,4],[240,5,240,6],[240,7,240,8],[237,3,237,4],[237,5,237,6],[237,7,237,8],[238,3,238,4],[238,5,238,6],[238,7,238,8],[235,7,235,8],[236,3,236,4],[236,5,236,6],[236,7,236,8],[233,3,233,4],[233,5,233,6],[233,7,233,8],[234,3,234,4],[234,5,234,6],[234,7,234,8],[229,7,229,8],[232,3,232,4],[232,5,232,6],[232,7,232,8],[227,3,227,4],[227,5,227,6],[227,7,227,8],[228,3,228,4],[228,5,228,6],[228,7,228,8],[231,3,231,4],[231,5,231,6],[231,7,231,8],[225,7,225,8],[226,3,226,4],[226,5,226,6],[226,7,226,8],[223,3,223,4],[223,5,223,6],[223,7,223,8],[224,3,224,4],[224,5,224,6],[224,7,224,8],[216,7,216,8],[217,7,217,8],[221,0,221,8],[222,3,222,4],[222,5,222,6],[222,7,222,8],[214,3,214,4],[214,5,214,6],[214,7,214,8],[215,3,215,4],[215,5,215,6],[215,7,215,8],[212,7,212,8],[213,3,213,4],[213,5,213,6],[213,7,213,8],[209,3,209,4],[209,5,209,6],[209,7,209,8],[211,3,211,4],[211,5,211,6],[211,7,211,8],[207,5,207,6],[207,7,207,8],[208,3,208,4],[208,5,208,6],[208,7,208,8],[205,3,205,4],[205,5,205,6],[205,7,205,8],[206,3,206,4],[206,5,206,6],[206,7,206,8],[203,3,203,4],[203,5,203,6],[203,7,203,8],[204,3,204,4],[204,5,204,6],[204,7,204,8],[197,0,197,8],[198,1,198,4],[199,1,199,4],[202,0,202,8],[177,0,177,8],[178,1,178,4],[191,0,191,8],[192,1,192,4],[193,1,193,4],[159,5,159,6],[159,7,159,8],[161,0,161,8],[162,0,162,8],[163,1,163,4],[176,0,176,8],[157,3,157,4],[157,5,157,6],[157,7,157,8],[158,3,158,4],[158,5,158,6],[158,7,158,8],[154,3,154,4],[154,5,154,6],[154,7,154,8],[155,3,155,4],[155,5,155,6],[155,7,155,8],[156,7,156,8],[150,5,150,6],[150,7,150,8],[152,0,152,8],[153,3,153,4],[153,5,153,6],[153,7,153,8],[147,3,147,4],[147,5,147,6],[147,7,147,8],[148,3,148,4],[148,5,148,6],[148,7,148,8],[149,3,149,4],[149,5,149,6],[149,7,149,8],[143,5,143,6],[143,7,143,8],[145,0,145,8],[146,3,146,4],[146,5,146,6],[146,7,146,8],[141,3,141,4],[141,5,141,6],[141,7,141,8],[142,3,142,4],[142,5,142,6],[142,7,142,8],[138,3,138,4],[138,5,138,6],[138,7,138,8],[140,3,140,4],[140,5,140,6],[140,7,140,8],[139,7,139,8],[136,3,136,4],[136,5,136,6],[136,7,136,8],[137,3,137,4],[137,5,137,6],[137,7,137,8],[134,3,134,4],[134,5,134,6],[134,7,134,8],[135,3,135,4],[135,5,135,6],[135,7,135,8],[130,3,130,4],[130,5,130,6],[130,7,130,8],[131,5,131,6],[131,7,131,8],[133,0,133,8],[128,3,128,4],[128,5,128,6],[128,7,128,8],[129,3,129,4],[129,5,129,6],[129,7,129,8],[126,3,126,4],[126,5,126,6],[126,7,126,8],[127,3,127,4],[127,5,127,6],[127,7,127,8],[122,3,122,4],[122,5,122,6],[122,7,122,8],[123,5,123,6],[123,7,123,8],[125,0,125,8],[120,3,120,4],[120,5,120,6],[120,7,120,8],[121,3,121,4],[121,5,121,6],[121,7,121,8],[116,5,116,6],[116,7,116,8],[118,0,118,8],[119,3,119,4],[119,5,119,6],[119,7,119,8],[114,3,114,4],[114,5,114,6],[114,7,114,8],[115,3,115,4],[115,5,115,6],[115,7,115,8],[113,3,113,4],[113,5,113,6],[113,7,113,8],[110,3,110,4],[110,5,110,6],[110,7,110,8],[111,3,111,4],[111,5,111,6],[111,7,111,8],[112,3,112,4],[112,5,112,6],[112,7,112,8],[64,3,64,4],[64,5,64,6],[64,7,64,8],[65,5,65,6],[65,7,65,8],[96,0,96,8],[72,0,72,8],[73,3,73,4],[73,5,73,6],[73,7,73,8],[74,3,74,4],[74,5,74,6],[74,7,74,8],[75,3,75,4],[75,5,75,6],[75,7,75,8],[76,3,76,4],[76,5,76,6],[76,7,76,8],[77,5,77,6],[77,7,77,8],[84,0,84,8],[85,3,85,4],[85,5,85,6],[62,3,62,4],[62,5,62,6],[62,7,62,8],[63,3,63,4],[63,5,63,6],[63,7,63,8],[53,5,53,6],[53,7,53,8],[60,0,60,8],[61,3,61,4],[61,5,61,6],[61,7,61,8],[51,3,51,4],[51,5,51,6],[51,7,51,8],[52,3,52,4],[52,5,52,6],[52,7,52,8],[32,0,32,8],[48,0,48,8],[49,3,49,4],[49,5,49,6],[49,7,49,8],[50,3,50,4],[50,5,50,6],[50,7,50,8],[28,3,28,4],[28,5,28,6],[28,7,28,8],[29,3,29,4],[29,5,29,6],[29,7,29,8],[26,3,26,4],[26,5,26,6],[26,7,26,8],[27,3,27,4],[27,5,27,6],[27,7,27,8],[24,3,24,4],[24,5,24,6],[24,7,24,8],[25,3,25,4],[25,5,25,6],[25,7,25,8],[22,3,22,4],[22,5,22,6],[22,7,22,8],[23,3,23,4],[23,5,23,6],[23,7,23,8],[20,3,20,4],[20,5,20,6],[20,7,20,8],[21,3,21,4],[21,5,21,6],[21,7,21,8],[18,3,18,4],[18,5,18,6],[18,7,18,8],[19,3,19,4],[19,5,19,6],[19,7,19,8],[16,3,16,4],[16,5,16,6],[16,7,16,8],[17,3,17,4],[17,5,17,6],[17,7,17,8],[14,3,14,4],[14,5,14,6],[14,7,14,8],[15,3,15,4],[15,5,15,6],[15,7,15,8],[12,3,12,4],[12,5,12,6],[12,7,12,8],[13,3,13,4],[13,5,13,6],[13,7,13,8],[10,3,10,4],[10,5,10,6],[10,7,10,8],[11,3,11,4],[11,5,11,6],[11,7,11,8],[9,3,9,4],[9,5,9,6],[9,7,9,8],[6,3,6,4],[6,5,6,6],[6,7,6,8],[7,3,7,4],[7,5,7,6],[7,7,7,8],[3,0,3,8],[4,3,4,4],[4,5,4,6],[4,7,4,8],[5,3,5,4],[5,5,5,6],[5,7,5,8],[8,3,8,4],[8,5,8,6],[8,7,8,8],[85,7,85,8],[86,3,86,4],[86,5,86,6],[86,7,86,8],[87,3,87,4],[87,5,87,6],[87,7,87,8],[88,3,88,4],[88,5,88,6],[88,7,88,8],[0,0,2,8],[89,5,89,6],[89,7,89,8],[230,3,230,4],[230,5,230,6],[230,7,230,8],[97,3,97,4],[97,5,97,6],[97,7,97,8],[98,3,98,4],[98,5,98,6],[98,7,98,8],[101,3,101,4],[101,5,101,6],[101,7,101,8],[102,5,102,6],[102,7,102,8],[109,0,109,8],[99,3,99,4],[99,5,99,6],[99,7,99,8],[100,3,100,4],[100,5,100,6],[100,7,100,8]]}
["LOGOTIPO DA EMPRESA"]
[]
[]
["parcela fixa da administração local \n(mão de obra)"]
["Código","Discriminação ","Unidade"," Quantidade ",null,"Custo Unitário (R$)",null," Custo Total (R$)"]
[null,"Mão de Obra"]
[null,"Gerência Técnica"]
[null,"Geral"]
["P9955","Engenheiro chefe","mês",{"$nulls":4},{"$f":"F9*D9","v":0}]
["P9840","Encarregado geral","mês",{"$nulls":4},{"$f":"F10*D10","v":0}]
["P9897","Técnico de meio ambiente","mês",{"$nulls":4},{"$f":"F11*D11","v":0}]
["P9948","Motorista","mês",{"$nulls":4},{"$f":"F12*D12","v":0}]
["P9878","Secretária","mês",{"$nulls":4},{"$f":"F13*D13","v":0}]
[{"$nulls":5},"Subtotal do Item 1.1",null,{"$f":"SUM(H9:I13)","v":0}]
[null,"Auxiliar"]
["P9946","Engenheiro auxiliar","mês",{"$nulls":4},{"$f":"D16*F16","v":0}]
["P9903","Auxiliar técnico","mês",{"$nulls":4},{"$f":"D17*F17","v":0}]
[{"$nulls":5},"Subtotal do Item 1.2",null,{"$f":"SUM(H16:I17)","v":0}]
[null,"Gerência Administrativa"]
[null,"Geral"]
["P9883","Chefe do setor administrativo","mês",{"$nulls":4},{"$f":"F21*D21","v":0}]
["P9809","Encarregado administrativo","mês",{"$nulls":4},{"$f":"F22*D22","v":0}]
["P9896","Porteiro","mês",{"$nulls":4},{"$f":"F23*D23","v":0}]
["P9827","Vigia","mês",{"$nulls":4},{"$f":"F24*D24","v":0}]
["P9948","Motorista","mês",{"$nulls":4},{"$f":"F25*D25","v":0}]
[{"$nulls":5},"Subtotal do Item 1.3",null,{"$f":"SUM(H21:I25)","v":0}]
[null,"Auxiliar"]
["P9806","Auxiliar administrativo","mês",{"$nulls":4},{"$f":"F28*D28","v":0}]
["P9842","Faxineiro","mês",{"$nulls":4},{"$f":"F29*D29","v":0}]
[{"$nulls":5},"Subtotal do Item 1.4",null,{"$f":"SUM(H28:I29)","v":0}]
[{"$nulls":7},"Total da Mão de Obra da Parcela Fixa",{"$f":"H30+H26+H18+H14","v":0}]
[]
["parcela fixa da administração local \n(veículos)"]
["Código","Discriminação ","Unidade"," Quantidade ","Utilização Produtiva","Utilização Improdutiva","Custo Horário \nProdutivo (R$)","Custo Horário Improdutivo (R$)","Custo Total (R$)"]
[2,"Veículos"]
[null,"Gerência Técnica"]
["2.1","Geral"]
["E9093","Veículo Leve 53 kw","mês",{"$nulls":5},{"$f":"((E38*G38)+(F38*H38))*D38","v":0}]
["E9560","Ônibus coletivo - 175 kw","mês",{"$nulls":5},{"$f":"((E39*G39)+(F39*H39))*D39","v":0}]
[{"$nulls":7},"Subtotal do Item 2",{"$f":"SUM(I38:I39)","v":0}]
["2.2","Auxiliar"]
["E9093","Veículo Leve 53 kw","mês",{"$nulls":5},{"$f":"((E42*G42)+(F42*H42))*D42","v":0}]
[{"$nulls":7},"Subtotal do Item 2",{"$f":"SUM(I42)","v":0}]
["2.3","Gerência Administrativa"]
["E9093","Veículo Leve 53 kw","mês",{"$nulls":5},{"$f":"((E45*G45)+(F45*H45))*D45","v":0}]
[{"$nulls":7},"Subtotal do Item 2",{"$f":"I45","v":0}]
[{"$nulls":7},"Total dos Veículos da Parcela Fixa",{"$f":"I46+I43+I40","v":0}]
[]
["Composição de custo da equipe de produção de terraplenagem"]
["Código","Discriminação ","Unidade"," Quantidade ",null,"Custo Unitário (R$)",null," Custo Total (R$)"]
[null,"Equipe de Produção de Terraplenagem"]
["3.1","Mão de Obra"]
["P9884","Encarregado de produção ","mês",{"$nulls":4},{"$f":"F53*D53","v":0}]
[{"$nulls":5},"Subtotal do Item 3.1",null,{"$f":"SUM(H53:H53)","v":0}]
["Código","Discriminação ","Unidade"," Quantidade ","Utilização Produtiva","Utilização Improdutiva","Custo Horário \nProdutivo (R$)","Custo Horário Improdutivo (R$)","Custo Total (R$)"]
["3.2","Veículos"]
[null,"Veículo Leve 53 kw","mês",{"$nulls":5},{"$f":"((E57*G57)+(F57*H57))*D57","v":0}]
[{"$nulls":7},"Subtotal do Item 3.2",{"$f":"SUM(I57:I57)","v":0}]
[{"$nulls":7},"Total da Equipe de Produção de Terraplenagem",{"$f":"I58+H54","v":0}]
[]
["Composição de custo da equipe de produção de pavimentação"]
["Código","Discriminação ","Unidade"," Quantidade ",null,"Custo Unitário (R$)",null," Custo Total (R$)"]
[null,"Equipe de Produção de Pavimentação"]
["3.1","Mão de Obra"]
["P9893","Encarregado de produção ","mês",{"$nulls":4},{"$f":"F65*D65","v":0}]
[{"$nulls":5},"Subtotal do Item 3.1",null,{"$f":"SUM(H65:H65)","v":0}]
["Código","Discriminação ","Unidade"," Quantidade ","Utilização Produtiva","Utilização Improdutiva","Custo Horário \nProdutivo (R$)","Custo Horário Improdutivo (R$)","Custo Total (R$)"]
["3.2","Veículos"]
[null,"Veículo Leve 53 kw","mês",{"$nulls":5},{"$f":"((E69*G69)+(F69*H69))*D69","v":0}]
[{"$nulls":7},"Subtotal do Item 3.2",{"$f":"SUM(I69:I69)","v":0}]
[{"$nulls":7},"Total da Equipe de Produção de Pavimentação",{"$f":"I70+H66","v":0}]
[]
["Composição de custo da equipe de produção de drenagem"]
["Código","Discriminação ","Unidade"," Quantidade ",null,"Custo Unitário (R$)",null," Custo Total (R$)"]
[null,"Equipe de Produção de Pavimentação"]
["3.1","Mão de Obra"]
["P9893","Encarregado de produção ","mês",{"$nulls":4},{"$f":"F77*D77","v":0}]
[{"$nulls":5},"Subtotal do Item 3.1",null,{"$f":"SUM(H77:H77)","v":0}]
["Código","Discriminação ","Unidade"," Quantidade ","Utilização Produtiva","Utilização Improdutiva","Custo Horário \nProdutivo (R$)","Custo Horário Improdutivo (R$)","Custo Total (R$)"]
["3.2","Veículos"]
[null,"Veículo Leve 53 kw","mês",{"$nulls":5},{"$f":"((E81*G81)+(F81*H81))*D81","v":0}]
[{"$nulls":7},"Subtotal do Item 3.2",{"$f":"SUM(I81:I81)","v":0}]
[{"$nulls":7},"Total da Equipe de Produção de Pavimentação",{"$f":"I82+H78","v":0}]
[]
["Composição de custo da equipe de produção de sinalização"]
["Código","Discriminação ","Unidade"," Quantidade ",null,"Custo Unitário (R$)",null," Custo Total (R$)"]
[null,"Equipe de Produção de Pavimentação"]
["3.1","Mão de Obra"]
["P9893","Encarregado de produção ","mês",{"$nulls":4},{"$f":"F89*D89","v":0}]
[{"$nulls":5},"Subtotal do Item 3.1",null,{"$f":"SUM(H89:H89)","v":0}]
["Código","Discriminação ","Unidade"," Quantidade ","Utilização Produtiva","Utilização Improdutiva","Custo Horário \nProdutivo (R$)","Custo Horário Improdutivo (R$)","Custo Total (R$)"]
["3.2","Veículos"]
[null,"Veículo Leve 53 kw","mês",{"$nulls":5},{"$f":"((E93*G93)+(F93*H93))*D93","v":0}]
[{"$nulls":7},"Subtotal do Item 3.2",{"$f":"SUM(I93:I93)","v":0}]
[{"$nulls":7},"Total da Equipe de Produção de Pavimentação",{"$f":"I94+H90","v":0}]
[]
["Composição de custo da equipe topografia"]
["Código","Discriminação ","Unidade"," Quantidade ",null,"Custo Unitário (R$)",null," Custo Total (R$)"]
[null,"Equipe de Topografia"]
["3.1","Mão de Obra"]
["P9949","Topográfo","mês",{"$nulls":4},{"$f":"F101*D101","v":0}]
["P9950","Auxiliar de topografia","mês",{"$nulls":4},{"$f":"F102*D102","v":0}]
[{"$nulls":5},"Subtotal do Item 3.1",null,{"$f":"SUM(H101:I102)","v":0}]
["Código","Discriminação ","Unidade"," Quantidade ","Utilização Produtiva","Utilização Improdutiva","Custo Horário \nProdutivo (R$)","Custo Horário Improdutivo (R$)","Custo Total (R$)"]
["3.2","Veículos"]
[null,"Veículo Leve 53 kw","mês",{"$nulls":5},{"$f":"((E106*G106)+(F106*H106))*D106","v":0}]
[{"$nulls":7},"Subtotal do Item 3.2",{"$f":"SUM(I106:I106)","v":0}]
[{"$nulls":7},"Total da Equipe de Produção de Topografia",{"$f":"I107+H103","v":0}]
[]
["Composição de custo do setor de medicina e segurança do trabalho"]
["Código","Discriminação ","Unidade"," Quantidade ",null,"Custo Unitário (R$)",null," Custo Total (R$)"]
[4,"Setor de Medicina e Segurança do Trabalho"]
["P9876","Técnico de segurança do trabalho","mês",{"$nulls":4},{"$f":"F113*D113","v":0}]
["P9864","Engenheiro de segurança do trabalho","mês",{"$nulls":4},{"$f":"F114*D114","v":0}]
["P9851","Médico do trabalho","mês",{"$nulls":4},{"$f":"F115*D115","v":0}]
["P9951","Médico de câmara hiperbárica","mês",{"$nulls":4},{"$f":"F116*D116","v":0}]
[{"$nulls":5},"Subtotal do Item 4",null,{"$f":"SUM(H113:I116)","v":0}]
[]
["Parcela Variável - Composição de custo da equipe de frente de serviço"]
["Código","Discriminação ","Unidade"," Quantidade ",null,"Custo Unitário (R$)",null," Custo Total (R$)"]
[5,"Equipe de Frente de Serviço","equipexmês"]
["P9875","Encarregado de Turma","mês",{"$nulls":4},{"$f":"F122*D122","v":0}]
["P9804","Apontador","mês",{"$nulls":4},{"$f":"F123*D123","v":0}]
[{"$nulls":5},"Subtotal do Item 5",null,{"$f":"SUM(H122:I123)","v":0}]
[]
["Parcela Variável - Composição de custo da equipe de frente de serviço (Terraplenagem) - Somente Compactação "]
["Código","Discriminação ","Unidade"," Quantidade ",null,"Produção Horária \n(und/h)",null,"Efs"]
["5.1","Equipe de Frente de Serviço","equipexmês"]
[null,null,"mês",{"$nulls":4},{"$f":"(D129)/(F129*182.49)","v":{"$error":"#DIV/0!"}}]
[null,null,"mês",{"$nulls":4},{"$f":"(D130)/(F130*182.49)","v":{"$error":"#DIV/0!"}}]
[null,null,"mês",{"$nulls":4},{"$f":"(D131)/(F131*182.49)","v":{"$error":"#DIV/0!"}}]
[{"$nulls":5},"Total de Equipes para Terraplenagem",null,{"$f":"SUM(H131:I131)","v":{"$error":"#DIV/0!"}}]
[]
["Parcela Variável - Composição de custo da acompanhamento das frentes de serviço de pavimentação"]
["Código","Discriminação ","Unidade"," Quantidade ",null,"Produção Horária \n(und/h)",null,"Efs"]
["5.2","Equipe de Frente de Serviço","equipe x mês"]
[36170,"Bloquete/piso intertravado de concreto - modelo onda/16 faces/retangular/t ijolinho/paver/holandes/paralelepipedo, *22 cm x 11* cm, e = 8 cm, resistencia de 35 mpa (nbr 9781), cor natural",{"$f":"'1.JANUARIA'!I22","v":"m²"},{"$f":"'1.JANUARIA'!J22","v":42168},null,null,null,{"$f":"(D137)/(F137*182.49)","v":{"$error":"#DIV/0!"}}]
["92404 ADAPTADA","Execução de pavimento em piso intertravado, com bloco 16 faces de 22 x 11 cm, espessura 8 cm. af_10/2022 - exclusive fornecimento de bloquete",{"$f":"'1.JANUARIA'!I23","v":"m²"},{"$f":"'1.JANUARIA'!J23","v":42000},null,null,null,{"$error":"#DIV/0!"}]
[5915014,{"$f":"VLOOKUP(A139,#REF!,2,0)","v":{"$error":"#REF!"}},{"$f":"'1.JANUARIA'!I24","v":"tkm"},{"$f":"'1.JANUARIA'!J24","v":516096.00000000006},null,null,null,{"$error":"#DIV/0!"}]
[5915321,{"$f":"VLOOKUP(A140,#REF!,2,0)","v":{"$error":"#REF!"}},{"$f":"'1.JANUARIA'!I25","v":"tkm"},{"$f":"'1.JANUARIA'!J25","v":143136},null,null,null,{"$f":"(D140)/(F140*182.49)","v":{"$error":"#DIV/0!"}}]
[5915321,{"$f":"VLOOKUP(A141,#REF!,2,0)","v":{"$error":"#REF!"}},{"$f":"'1.JANUARIA'!I26","v":"tkm"},{"$f":"'1.JANUARIA'!J26","v":37044},null,null,null,{"$error":"#DIV/0!"}]
[4011268,{"$f":"VLOOKUP(A142,#REF!,2,0)","v":{"$error":"#REF!"}},{"$f":"'1.JANUARIA'!I27","v":"m³"},{"$f":"'1.JANUARIA'!J27","v":6300},null,null,null,{"$error":"#DIV/0!"}]
[4011209,{"$f":"VLOOKUP(A143,#REF!,2,0)","v":{"$error":"#REF!"}},{"$f":"'1.JANUARIA'!I28","v":"m²"},{"$f":"'1.JANUARIA'!J28","v":42000},null,null,null,{"$error":"#DIV/0!"}]
[{"$nulls":5},"Total de Equipes para Pavimentação",null,{"$f":"SUM(H137:I143)","v":{"$error":"#DIV/0!"}}]
[]
["Parcela Variável - Composição de custo da acompanhamento das frentes de serviço de drenagem"]
["Código","Discriminação ","Unidade"," Quantidade ",null,"Efsdu",null,"Efs"]
["5.3","Frentes de Serviço para Drenagem","equipe x mês"]
[94273,{"$f":"VLOOKUP(A149,#REF!,2,0)","v":{"$error":"#REF!"}},"m",{"$f":"VLOOKUP(A149,'1.JANUARIA'!D11:J48,7,0)","v":12000},null,null,null,{"$f":"D149*F149","v":0}]
[94287,{"$f":"VLOOKUP(A150,#REF!,2,0)","v":{"$error":"#REF!"}},"m",{"$f":"VLOOKUP(A150,'1.JANUARIA'!D12:J49,7,0)","v":12000},null,null,null,{"$f":"D150*F150","v":0}]
[{"$nulls":5},"Total de Equipes para Drenagem",null,{"$f":"SUM(H149:I150)","v":0}]
[]
["Parcela Variável - Composição de custo da acompanhamento das frentes de serviço de sinalização"]
["Código","Discriminação ","Unidade"," Quantidade ",null,"Produção Horária (und/h)",null,"Efs"]
["5.4","Frentes de Serviço para Sinalização","equipe x mês"]
[5213440,{"$f":"VLOOKUP(A156,#REF!,2,0)","v":{"$error":"#REF!"}},{"$f":"'1.JANUARIA'!I30","v":"und"},{"$f":"'1.JANUARIA'!J30","v":30},null,null,null,{"$f":"0.2*((D156)/(F156*182.49))","v":{"$error":"#DIV/0!"}}]
[5213464,{"$f":"VLOOKUP(A157,#REF!,2,0)","v":{"$error":"#REF!"}},{"$f":"'1.JANUARIA'!I31","v":"und"},{"$f":"'1.JANUARIA'!J31","v":30},null,null,null,{"$f":"0.2*((D157)/(F157*182.49))","v":{"$error":"#DIV/0!"}}]
[5213863,{"$f":"VLOOKUP(A158,#REF!,2,0)","v":{"$error":"#REF!"}},{"$f":"'1.JANUARIA'!I32","v":"und"},{"$f":"'1.JANUARIA'!J32","v":60},null,null,null,{"$f":"0.2*((D158)/(F158*182.49))","v":{"$error":"#DIV/0!"}}]
[5213400,{"$f":"VLOOKUP(A159,#REF!,2,0)","v":{"$error":"#REF!"}},{"$f":"'1.JANUARIA'!I33","v":"m²"},{"$f":"'1.JANUARIA'!J33","v":1400},null,null,null,{"$error":"#DIV/0!"}]
[{"$nulls":5},"Total de Equipes para Sinalização",null,{"$f":"SUM(H156:I159)","v":{"$error":"#DIV/0!"}}]
[]
["3. PARCELA VARIÁVEL - EQUIPE DE CONTROLE TECNOLÓGICO"]
["LABORATÓRIO DE SOLOS"]
["Item","Discriminação",null,null,null,"Unidade","Quantidade","Custo Unitário (R$)","Custo Total (R$)"]
[null,"Laboratório de Solos (equipe x mês)"]
[null,"Mão de Obra"]
["P9858","Laboratorista",null,null,null,"func./mês",null,null,{"$f":"TRUNC(G167*H167,2)","v":0}]
["P9833","Auxiliar de laboratório",null,null,null,"func./mês",null,null,{"$f":"TRUNC(G168*H168,2)","v":0}]
[{"$nulls":7},"Subtotal do Item",{"$f":"SUM(I167:I168)","v":0}]
["Item","Discriminação","Und","Quant","Utilização Produtiva","Utilização Improdutiva","Horário Produtivo (R$)","Horário Improdutivo (R$)","Total (R$)"]
[null,"Equipe de Controle Tecnológico"]
[null,"Veículos"]
["E9125","Van furgão a diesel - 93 kW","veic./mês",{"$nulls":5},{"$f":"D173*((E173*G173)+(F173*H173))","v":0}]
[{"$nulls":7},"Subtotal do Item",{"$f":"SUM(I173:I173)","v":0}]
[{"$nulls":7},"Total da Equipe do Laboratório de Solos",{"$f":"I169+I174","v":0}]
[]
["3. PARCELA VARIÁVEL - EQUIPE DE CONTROLE TECNOLÓGICO"]
["LABORATÓRIO DE CONCRETO"]
["Item","Discriminação",null,null,null,"Unidade","Quantidade","Custo Unitário (R$)","Custo Total (R$)"]
[null,"Laboratório de Solos (equipe x mês)"]
[null,"Mão de Obra"]
["P9858","Laboratorista",null,null,null,"func./mês",null,null,{"$f":"TRUNC(G182*H182,2)","v":0}]
["P9833","Auxiliar de laboratório",null,null,null,"func./mês",null,null,{"$f":"TRUNC(G183*H183,2)","v":0}]
[{"$nulls":7},"Subtotal do Item",{"$f":"SUM(I182:I183)","v":0}]
["Item","Discriminação","Und","Quant","Utilização Produtiva","Utilização Improdutiva","Horário Produtivo (R$)","Horário Improdutivo (R$)","Total (R$)"]
[null,"Equipe de Controle Tecnológico"]
[null,"Veículos"]
["E9125","Van furgão a diesel - 93 kW","veic./mês",{"$nulls":5},{"$f":"D188*((E188*G188)+(F188*H188))","v":0}]
[{"$nulls":7},"Subtotal do Item",{"$f":"SUM(I188:I188)","v":0}]
[{"$nulls":7},"Total da Equipe do Laboratório de Concreto",{"$f":"I184+I189","v":0}]
[]
["Equipes de laboratório de solos para pavimentação"]
["Item","Discriminação",null,null,null,"Und","Quant","QE","Els"]
[{"$f":"'1.JANUARIA'!D27","v":4011221},{"$f":"VLOOKUP(A194,#REF!,2,0)","v":{"$error":"#REF!"}},null,null,null,{"$f":"VLOOKUP(A194,#REF!,3,0)","v":{"$error":"#REF!"}},{"$f":"'1.JANUARIA'!J27","v":6300},null,{"$f":"G194/H194","v":{"$error":"#DIV/0!"}}]
[{"$f":"'1.JANUARIA'!D28","v":4011209},{"$f":"VLOOKUP(A195,#REF!,2,0)","v":{"$error":"#REF!"}},null,null,null,{"$f":"VLOOKUP(A195,#REF!,3,0)","v":{"$error":"#REF!"}},{"$f":"'1.JANUARIA'!J28","v":42000},null,{"$f":"G195/H195","v":{"$error":"#DIV/0!"}}]
[{"$nulls":7},"Total de equipes de Laboratório de Solos para Pavimentação",{"$f":"I194+I195","v":{"$error":"#DIV/0!"}}]
[]
["Equipes de laboratório de Concreto"]
["Item","Discriminação",null,null,null,"Und","Quant","QE","Ela"]
[{"$f":"'1.JANUARIA'!D22","v":36170},"BLOQUETE/PISO INTERTRAVADO DE CONCRETO - MODELO ONDA/16 FACES/RETANGULAR/T IJOLINHO/PAVER/HOLANDES/PARALELEPIPEDO, *22 CM X 11* CM, E = 8 CM, RESISTENCIA DE 35 MPA (NBR 9781), COR NATURAL",null,null,null,{"$f":"'1.JANUARIA'!I22","v":"m²"},{"$f":"'1.JANUARIA'!J22","v":42168},null,{"$f":"G200/H200","v":{"$error":"#DIV/0!"}}]
[{"$nulls":7},"Total de equipes de Laboratório de Concreto",{"$f":"SUM(I200:I200)","v":{"$error":"#DIV/0!"}}]
[]
["manutenção do canteiro de obras e acampamentos"]
["Código","Discriminação ","Unidade"," Quantidade ",null,"Custo Unitário (R$)",null," Custo Total (R$)"]
[null,"Manutenção do Canteiro de Obras e Acampamentos"]
["6.1","Mão de Obra"]
["P9952","Pedreiro","mês",{"$nulls":4},{"$f":"F207*D207","v":0}]
["P9954","Servente","mês",{"$nulls":4},{"$f":"F208*D208","v":0}]
["P9953","Eletricista","mês",{"$nulls":4},{"$f":"F209*D209","v":0}]
[{"$nulls":5},"Subtotal do Item 6.1",null,{"$f":"SUM(H207:I209)","v":0}]
[]
["Código","Discriminação ","Unidade"," Quantidade ",null,"Custo Produtivo (R$)",null," Custo Total (R$)"]
["6.2","Equipamentos"]
[null,"Caminhão guindauto de 6 toneladas","h/mês",{"$nulls":4},{"$f":"F214*D214","v":0}]
[null,"Caminhão tanque de 8.000 litros","h/mês",{"$nulls":4},{"$f":"F215*D215","v":0}]
["E9524","Motoniveladora","h/mês",{"$nulls":4},{"$f":"F216*D216","v":0}]
[{"$nulls":5},"Subtotal do Item 6.2",null,{"$f":"SUM(H214:I216)","v":0}]
[{"$nulls":6},"Total da Manutenção do Canteiro de Obras e Acampamentos",{"$f":"H217+H210","v":0}]
[]
[]
[]
["Resumo das parcelas de administração local"]
["Código","Discriminação ","Unidade"," Quantidade ",null,"Custo Unitário (R$)",null," Custo Total (R$)"]
[null,"Parcela Fixa"]
[null,"Mão de Obra","mês",null,null,{"$f":"H14+H18+H26+H30","v":0},null,{"$f":"F225*D225","v":0}]
[null,"Veículos","mês",null,null,{"$f":"I47","v":0},null,{"$f":"F226*D226","v":0}]
[{"$nulls":5},"Subtotal do Item 1",null,{"$f":"SUM(H225:I226)","v":0}]
[null,"Parcela Vinculada"]
[null,"Equipe de produção de terraplenagem","mês",null,null,{"$f":"I59","v":0},null,{"$f":"F229*D229","v":0}]
[null,"Equipe de produção de pavimentação","mês",null,null,{"$f":"I71","v":0},null,0]
[null,"Equipe de produção de drenagem","mês",null,null,{"$f":"I83","v":0},null,0]
[null,"Equipe de produção de sinalização","mês",null,null,{"$f":"I95","v":0},null,0]
[null,"Equipe de topografia","mês",null,null,{"$f":"I108","v":0},null,0]
[null,"Equipe de medicina e segurança do trabalho","mês",null,null,{"$f":"H117","v":0},null,0]
[null,"Técnicos especializados","mês",{"$nulls":4},0]
[{"$nulls":5},"Subtotal do Item 2",null,{"$f":"SUM(H229:I235)","v":0}]
[null,"Parcela Variável"]
[null,"Acompanhamento da Terraplenagem","equipe x mês","-",null,{"$f":"$H$124","v":0},null,"-"]
[null,"Acompanhamento da Pavimentação","equipe x mês",{"$f":"H144","v":{"$error":"#DIV/0!"}},null,{"$f":"$H$124","v":0},null,{"$f":"F239*D239","v":{"$error":"#DIV/0!"}}]
[null,"Acompanhamento da Drenagem","equipe x mês",{"$f":"H151","v":0},null,0,null,{"$f":"F240*D240","v":0}]
[null,"Acompanhamento da Sinalização","equipe x mês",{"$f":"H160","v":{"$error":"#DIV/0!"}},null,0,null,{"$f":"F241*D241","v":{"$error":"#DIV/0!"}}]
[null,"Laboratório de Solos","equipe x mês",{"$f":"I196","v":{"$error":"#DIV/0!"}},null,{"$f":"I175","v":0},null,{"$f":"F242*D242","v":{"$error":"#DIV/0!"}}]
[null,"Laboratório de concreto","equipe x mês",{"$f":"I201","v":{"$error":"#DIV/0!"}},null,{"$f":"I190","v":0},null,{"$f":"F243*D243","v":{"$error":"#DIV/0!"}}]
[{"$nulls":5},"Subtotal do Item 3",null,{"$f":"SUM(H238:I243)","v":{"$error":"#DIV/0!"}}]
[null,"Manutenção dos Canteiros de Obras e Acampamentos"]
[null,"Equipe de manutenção","mês",0,null,{"$f":"H218","v":0},null,{"$f":"F246*D246","v":0}]
[{"$nulls":5},"Subtotal do Item 4",null,{"$f":"SUM(H246:I246)","v":0}]
[{"$nulls":6},"Subtotal",{"$f":"H247+H244+H236+H227","v":{"$error":"#DIV/0!"}}]
[null,"Despesas Diversas","%",0.05,null,"-",null,{"$f":"D249*H248","v":{"$error":"#DIV/0!"}}]
[{"$nulls":5},"TOTAL",null,{"$f":"H248+H249","v":{"$error":"#DIV/0!"}}]
[{"$nulls":5},"BDI",null,null,{"$f":"H250*BDI!C17","v":{"$error":"#DIV/0!"}}]
[{"$nulls":5},"TOTAL COM BDI",null,null,{"$f":"I251+H250","v":{"$error":"#DIV/0!"}}]

{"sheet":"PROJ","index":9,"n_rows":29,"n_cols":7,"rows_kept":29,"cut":false,"hidden":false,"merged":[[0,0,2,6],[26,0,26,1],[27,0,27,1],[3,0,3,6],[4,2,6,4],[5,0,5,1],[16,0,16,1],[20,0,20,1],[25,0,25,1]]}
["LOGOTIPO DA EMPRESA"]
[]
[]
["COMPOSIÇAO PREÇO PROJETO EXECUTIVO"]
[]
["DISCRIMINAÇAO",{"$nulls":4},"Pr. Unit.","Pr. Total"]
[]
["A· EOUIPE TECNICA",{"$nulls":5},{"$f":"G9+G12","v":0}]
[null,"A. 1 - Pessoal de Nível Superior","Unidade","Quantitativo","SICRO e Rel.Custos Gerais",null,{"$f":"G10+G11","v":0}]
[null,"Engenheiro","mês",null,"P9812",null,{"$f":"F10*D10","v":0}]
[null,"Topógrafo","mês",null,"P9949",null,{"$f":"F11*D11","v":0}]
[null,"A.2 - Pessoal de Nível Técnico e Aux.",{"$nulls":4},{"$f":"G13+G14","v":0}]
[null,"Auxiliar de topógrafo","mês",null,"P9950",null,{"$f":"F13*D13","v":0}]
[null,"Auxiliar Técnico/Assistente de Engenharia ","mês",null,"P9903",null,{"$f":"F14*D14","v":0}]
["B - ENCARGOS SOCIAIS",{"$nulls":5},{"$f":"G16","v":0}]
[null,{"$f":"CONCATENATE(\"Taxas \",'ENC. SOCIAIS'!E51,\"%\")","v":"Taxas 0%"},"JÁ INCLUSAS EM \"A\""]
["C - DESPESAS GERAIS",{"$nulls":5},{"$f":"G18+G20+G19","v":0}]
[null,"C.1 - MATERIAIS DE CONSUMO","Estimativa % como referência de equipe técnica com encargos sociais ",null,null,null,{"$f":"F18*D18","v":0}]
[null,"C.2 - VEÍCULOS (Veículo leve picape 4 x 4 com capacidade de 1,10 t - 147 kW)","h",null,"E9684",null,{"$f":"F19*D19","v":0}]
[null,"C.3 - Estação total eletrônica com alcance máximo de 3.000 m","h",null,"E9553",null,{"$f":"F20*D20","v":0}]
["D - ENSAIOS",{"$nulls":5},{"$f":"SUM(G22:G25)","v":0}]
[null,"Laboratorista","mês",null,"P9858",null,{"$f":"F22*D22","v":0}]
[null,"Auxiliar de Laboratório","mês",null,"P9833",null,{"$f":"F23*D23","v":0}]
[null,"Laboratório de solos","mês",null,"B8957",null,{"$f":"F24*D24","v":0}]
[null,"Laboratório de asfalto","mês",null,"B8955",null,{"$f":"F25*D25","v":0}]
["I - SOMA (A+B+C+D)",{"$nulls":5},{"$f":"G8+G15+G17+G21","v":0}]
["II - CUSTOS ADMINISTRATIVOS",{"$nulls":5},{"$f":"D27*G26","v":0}]
[" TOTAL",{"$nulls":5},{"$f":"G26+G27","v":0}]
[{"$nulls":5},"Por m²:",{"$f":"G28/(1200*7)","v":0}]

{"sheet":"CPU","index":10,"n_rows":29,"n_cols":9,"rows_kept":29,"cut":false,"hidden":false,"merged":[[0,0,2,7],[3,0,3,7],[4,0,6,3],[4,6,4,7],[5,4,6,5],[15,4,15,6],[18,5,18,6],[7,0,7,7],[8,7,9,7],[8,5,9,5],[8,6,9,6],[8,0,9,0],[8,1,9,1],[8,2,9,2],[8,3,9,3],[8,4,9,4],[28,5,28,6],[20,6,21,6],[20,7,21,7],[26,4,26,6],[20,0,21,0],[20,1,21,1],[20,2,21,2],[20,3,21,3],[20,4,21,4],[20,5,21,5]]}
["LOGOTIPO DA EMPRESA"]
[]
[]
["EXECUÇÃO DE SERVIÇOS DE IMPLANTAÇÃO DE PAVIMENTAÇÃO EM BLOCO DE CONCRETO INTERTRAVADO (BLOQUETES), EM VIAS DE MUNICÍPIOS DIVERSOS INSERIDOS NA ÁREA DE ATUAÇÃO DA 1ª SUPERINTENDÊNCIA REGIONAL DA CODEVASF, NO ESTADO DE MINAS GERAIS - ITEM x - REGIÃO: xxxxxxxxxxxx/MG"]
[{"$nulls":5},"BDI %:",{"$f":"BDI!C17","v":0}]
[{"$nulls":4},"Encargos Sociais:",null,"Horista","Mensalista"]
[{"$nulls":6},{"$f":"'ENC. SOCIAIS'!E51/100","v":0},{"$f":"'ENC. SOCIAIS'!F51/100","v":0}]
["COMPOSIÇÕES DE CUSTO UNITARIO"]
["CPU-02","CODEVASF",null,"Correção de vazamentos no ramal na rua sem pavimento com fornecimento do material hidráulico","m","COEF.","PRECO UNITÁRIO (R$)","TOTAL (R$)"]
[]
["SICRO","SICRO","P9824",{"$f":"VLOOKUP(C11,#REF!,2,0)","v":{"$error":"#REF!"}},"H",null,null,{"$f":"F11*G11","v":0}]
["SICRO","SICRO","P9807",{"$f":"VLOOKUP(C12,#REF!,2,0)","v":{"$error":"#REF!"}},"H",null,null,0]
["INS. SINAPI","SINAPI",9867,"TUBO PVC, SOLDAVEL, DN 20 MM, AGUA FRIA (NBR-5648)","m",null,null,0]
["INSUMO","ORSE",10585,"Arco de serra","un",null,null,0]
["INS. SINAPI","SINAPI",3859,"LUVA SOLDAVEL COM ROSCA, PVC, 20 MM X 1/2\", PARA AGUA FRIA PREDIAL","un",null,null,0]
[{"$nulls":4},"Sub total:",null,null,{"$f":"SUM(H11:H15)","v":0}]
[{"$nulls":5},"BDI",{"$f":"G5","v":0},{"$f":"H16*G17","v":0}]
[{"$nulls":6},"Total Serviços:",{"$f":"H16+H17","v":0}]
[{"$nulls":4},{"$f":"A9","v":"CPU-02"},"PREÇO UNITÁRIO TOTAL:",null,{"$f":"H18","v":0},{"$f":"H16","v":0}]
[]
["CPU-04","CODEVASF",null,"CONTROLE TECNOLÓGICO - PROJETO","m²","COEF.","PRECO UNITÁRIO (R$)","TOTAL (R$)"]
[]
["Insumo","SICRO","P9858","Laboratorista","mês",null,null,{"$f":"F23*G23","v":0}]
["Composição","SICRO","P9833","Auxiliar de Laboratório","mês",null,null,0]
["Composição","SICRO","*B8957","Laboratório de Solos","mês",null,null,0]
["Composição","SICRO","*B8956","Laboratório de concreto","mês",null,null,0]
[null,"*Relatório de Custos Gerais do DNIT, página 1",null,null,"Sub total:",null,null,{"$f":"SUM(H23:H26)","v":0}]
[{"$nulls":5},"BDI",{"$f":"G5","v":0},{"$f":"H27*G28","v":0}]
[{"$nulls":4},"CPU-20","PREÇO UNITÁRIO TOTAL:",null,{"$f":"H27+H28","v":0},{"$f":"H27","v":0}]

{"sheet":"CPU SINAPI","index":11,"n_rows":17,"n_cols":7,"rows_kept":17,"cut":false,"hidden":false,"merged":[[15,3,15,4],[16,3,16,5],[0,0,0,4],[0,5,1,6],[1,0,1,1],[1,2,1,4],[2,0,2,4],[14,3,14,5]]}
["SINAPI - SISTEMA NACIONAL DE PESQUISA DE CUSTOS E ÍNDICES DA CONSTRUÇÃO CIVIL",{"$nulls":4},"1ª/SR - MINAS GERAIS"]
["PCI.818.01 - COMPOSIÇÕES ATIVAS ANALÍTICAS COM CUSTO",null,"ABRANGENCIA: NACIONAL                                                                               DATA DE PREÇO          :   06/2024                                                                                                             DATA REFERENCIA TECNICA: 12/07/2024"]
["* Composições constantes nos Relatórios publicados de Composições Analíticas para as 27 Unidades da Federação"]
["MACROCLASSE.CLASSE.GRUPO","CÓDIGOS","DESCRIÇÃO","UNIDADE","COEFICIENTE","PREÇO UNITÁRIO","PREÇO TOTAL"]
["03.PAVI.INTE.004/001","92404 ADAPTADA","EXECUÇÃO DE PAVIMENTO EM PISO INTERTRAVADO, COM BLOCO 16 FACES DE 22 X 11 CM, ESPESSURA 8 CM - EXCLUSIVE FORNECIMENTO DE BLOQUETE","M2",null,"Pavimento Intertravado",{"$f":"G17","v":0}]
["INSUMO",370,"AREIA MEDIA - POSTO JAZIDA/FORNECEDOR (RETIRADO NA JAZIDA, SEM TRANSPORTE)","M3",5.6800000000000003E-2,null,{"$f":"ROUND(ROUND(E6,5)*ROUND(F6,2),2)","v":0}]
["INSUMO",4741,"PO DE PEDRA (POSTO PEDREIRA/FORNECEDOR, SEM FRETE)","M3",9.7999999999999997E-3,null,{"$f":"ROUND(ROUND(E7,5)*ROUND(F7,2),2)","v":0}]
["INSUMO",36170,"BLOQUETE/PISO INTERTRAVADO DE CONCRETO - MODELO ONDA/16 FACES/RETANGULAR/T IJOLINHO/PAVER/HOLANDES/PARALELEPIPEDO, *22 CM X 11* CM, E = 8 CM, RESISTENCIA DE 35 MPA (NBR 9781), COR NATURAL (FORNECIMENTO COM BDI DIFERENCIADO)","M2",1.004,0,0]
["COMPOSICAO",88260,"CALCETEIRO COM ENCARGOS COMPLEMENTARES","H",0.21290000000000001,null,0]
["COMPOSICAO",88316,"SERVENTE COM ENCARGOS COMPLEMENTARES","H",0.21290000000000001,null,0]
["COMPOSICAO",91277,"PLACA VIBRATÓRIA REVERSÍVEL COM MOTOR 4 TEMPOS A GASOLINA, FORÇA CENTRÍFUG A DE 25 KN (2500 KGF), POTÊNCIA 5,5 CV - CHP DIURNO","CHP",5.4999999999999997E-3,null,0]
["COMPOSICAO",91278,"PLACA VIBRATÓRIA REVERSÍVEL COM MOTOR 4 TEMPOS A GASOLINA, FORÇA CENTRÍFUGA DE 25 KN (2500 KGF), POTÊNCIA 5,5 CV - CHI DIURNO","CHP",0.10100000000000001,null,0]
["COMPOSICAO",91283,"CORTADORA DE PISO COM MOTOR 4 TEMPOS A GASOLINA, POTÊNCIA DE 13 HP, COM DISCO DE CORTE DIAMANTADO SEGMENTADO PARA CONCRETO, DIÂMETRO DE 350 MM, FURO DE 1\" (14 X 1\") - CHP DIURNO","CHI",3.8E-3,null,{"$f":"ROUND(ROUND(E13,5)*ROUND(F13,2),2)","v":0}]
["COMPOSICAO",91285,"CORTADORA DE PISO COM MOTOR 4 TEMPOS A GASOLINA, POTÊNCIA DE 13 HP, COM DISCO DE CORTE DIAMANTADO SEGMENTADO PARA CONCRETO, DIÂMETRO DE 350 MM, FURO DE 1\" (14 X 1\") - CHI DIURNO","CHI",0.1027,null,0]
[null,null,null,"Sub total:",null,null,{"$f":"SUM(G6:G14)","v":0}]
[{"$nulls":5},"BDI",{"$f":"BDI!C17","v":0}]
[null,null,null,"Total Serviços:",null,null,{"$f":"ROUND(ROUND(G15,2)*ROUND(1+G16,4),2)","v":0}]

{"sheet":"BDI","index":12,"n_rows":66,"n_cols":3,"rows_kept":66,"cut":false,"hidden":false,"merged":[[0,0,0,2],[66,0,66,1],[67,0,67,1],[69,0,69,2],[65,0,65,2],[5,0,5,2],[4,0,4,2],[17,0,17,2],[51,0,51,3],[52,0,52,3],[53,1,53,2]]}
["LOGOTIPO DA EMPRESA"]
["OBRA:"]
["LOCAL: "]
["DATA BASE: "]
["DETALHAMENTO DO BDI  - SEM DESONERAÇÃO"]
["EXECUÇÃO DE SERVIÇOS DE IMPLANTAÇÃO DE PAVIMENTAÇÃO EM BLOCO DE CONCRETO INTERTRAVADO (BLOQUETES), EM VIAS DE MUNICÍPIOS DIVERSOS INSERIDOS NA ÁREA DE ATUAÇÃO DA 1ª SUPERINTENDÊNCIA REGIONAL DA CODEVASF, NO ESTADO DE MINAS GERAIS - ITEM x - REGIÃO: xxxxxxxxxxxx/MG"]
["DESCRIÇÃO DOS SERVIÇOS","PREÇO DE VENDA (%)","CUSTO DIRETO (%)"]
["ADMINISTRAÇÃO CENTRAL"]
["DESPESA FINANCEIRAS"]
["SEGUROS E GARANTIAS CONTRATUAIS"]
["RISCOS"]
["LUCRO OPERACIONAL"]
["PIS"]
["COFINS"]
["ISSQN"]
["Contribuição Previdenciaria"]
[null,"BDI",{"$f":"ROUND((1+(C8+C12))/(1-(B9+B10+B11+B13+B14+B15+B16))-1,4)","v":0}]
["Observação: O percentual de ISSQN aqui utilizado consiste apenas em um referencial médio. O valor real do ISSQN a ser adotado deve ser aquele proveniente das alíquotas dos municípios situados na área de influência das obras."]
[null," "]
{"$rows_empty":32}
["DETALHAMENTO DO BDI DIFERENCIADO  - SEM DESONERAÇÃO"]
["EXECUÇÃO DE SERVIÇOS DE IMPLANTAÇÃO DE PAVIMENTAÇÃO EM BLOCO DE CONCRETO INTERTRAVADO (BLOQUETES), EM VIAS DE MUNICÍPIOS DIVERSOS INSERIDOS NA ÁREA DE ATUAÇÃO DA 1ª SUPERINTENDÊNCIA REGIONAL DA CODEVASF, NO ESTADO DE MINAS GERAIS - ITEM x - REGIÃO: xxxxxxxxxxxx/MG"]
[]
["DESCRIÇÃO DOS SERVIÇOS","PREÇO DE VENDA (%)","CUSTO DIRETO (%)"]
["ADMINISTRAÇÃO CENTRAL"]
["DESPESA FINANCEIRAS"]
["SEGUROS E GARANTIAS CONTRATUAIS"]
["RISCOS"]
["LUCRO OPERACIONAL"]
["PIS"]
["COFINS"]
["ISSQN"]
["Contribuição Previdenciaria"]
[null,"BDI",{"$f":"ROUND((1+(C56+C60))/(1-(B57+B58+B59+B61+B62+B63+B64))-1,4)","v":0}]
["Fonte da composição, valores de referência e fórmula do BDI:  Instrução Normativa N° 62/DNIT-SEDE"]

{"sheet":"ENC. SOCIAIS","index":13,"n_rows":51,"n_cols":8,"rows_kept":51,"cut":false,"hidden":false,"merged":[[0,0,4,5],[8,0,9,5],[50,0,50,1],[10,0,10,5],[11,2,11,3],[11,4,11,5],[12,0,12,5],[13,0,14,1],[13,2,14,2],[13,3,14,3],[13,4,14,4],[13,5,14,5],[15,0,15,5],[26,0,26,5],[38,0,38,5],[45,0,45,5],[49,0,49,5]]}
["LOGOTIPO DA EMPRESA"]
[]
[]
[]
[]
["NOME DA CONCORRENTE:"]
["EDITAL:"]
["FOLHA:"]
["EXECUÇÃO DE SERVIÇOS DE IMPLANTAÇÃO DE PAVIMENTAÇÃO EM BLOCO DE CONCRETO INTERTRAVADO (BLOQUETES), EM VIAS DE MUNICÍPIOS DIVERSOS INSERIDOS NA ÁREA DE ATUAÇÃO DA 1ª SUPERINTENDÊNCIA REGIONAL DA CODEVASF, NO ESTADO DE MINAS GERAIS - ITEM x - REGIÃO: xxxxxxxxxxxx/MG"]
[]
["DETALHAMENTO DOS ENCARGOS SOCIAIS (%)"]
["VIGÊNCIA A PARTIR DE 12/2023",null,"COM DESONERAÇÃO",null,"SEM DESONERAÇÃO"]
[]
[null,null,"HORISTA","MENSALISTA","HORISTA","MENSALISTA"]
[]
["GRUPO A"]
["A1","INSS",0,0]
["A2","SESI",1.5,1.5]
["A3","SENAI",1,1]
["A4","INCRA",0.2,0.2]
["A5","SEBRAE",0.6,0.6]
["A6","Salário Educação",2.5,2.5]
["A7","Seguro Contra Acidentes de Trabalho",3,3]
["A8","FGTS",8,8]
["A9","SECONCI",1,1]
["A","Total",{"$f":"SUM(C17:C25)","v":17.8},{"$f":"SUM(D17:D25)","v":17.8},{"$f":"SUM(E17:E25)","v":0},{"$f":"SUM(F17:F25)","v":0}]
["GRUPO B"]
["B1","Repouso Semanal Remunerado",17.88,"-"]
["B2","Feriados",3.94,"-"]
["B3","Auxílio-enfermidade",0.91,0.69]
["B4","13° salário",10.98,8.33]
["B5","Licença-paternidade",7.0000000000000007E-2,0.06]
["B6","Faltas Justificadas",0.73,0.56000000000000005]
["B7","Dias de chuva",1.45,"-"]
["B8","Auxílio Acidente de Trabalho",0.11,0.09]
["B9","Férias Gozadas",11.35,8.6199999999999992]
["B10","Salário Maternidade",0.03,0.03]
["B","Total ",{"$f":"SUM(C28:C37)","v":47.45},{"$f":"SUM(D28:D37)","v":18.380000000000003},{"$f":"SUM(E28:E37)","v":0},{"$f":"SUM(F28:F37)","v":0}]
["GRUPO C"]
["C1","Aviso Prévio Indenizado",6.76,5.14]
["C2","Aviso Prévio Trabalhado",0.16,0.12]
["C3","Férias Indenizadas",2.2799999999999998,1.73]
["C4","Depósito Rescisão Sem Justa Causa",3.81,2.89]
["C5","Indenização Adicional",0.56999999999999995,0.43]
["C","Total ",{"$f":"SUM(C40:C44)","v":13.58},{"$f":"SUM(D40:D44)","v":10.31},{"$f":"SUM(E40:E44)","v":0},{"$f":"SUM(F40:F44)","v":0}]
["GRUPO D"]
["D1","Reincidência de A sobre B",8.4499999999999993,3.27]
["D2","Reincidência de Grupo A sobre Aviso Prévio Trabalhado e Reincidência do FGTS sobre Aviso Prévio Indenizado",0.56999999999999995,0.43]
["D","Total",{"$f":"SUM(C47:C48)","v":9.02},{"$f":"SUM(D47:D48)","v":3.7},{"$f":"SUM(E47:E48)","v":0},{"$f":"SUM(F47:F48)","v":0},null,"Fonte: Sinapi Cálculos e Parâmetros 5ª Edição - Atualizada em Agosto 2023"]
[]
["T O T A L (%)",null,{"$f":"C26+C38+C45+C49","v":87.85},{"$f":"D26+D38+D45+D49","v":50.190000000000012},{"$f":"E26+E38+E45+E49","v":0},{"$f":"F26+F38+F45+F49","v":0}]