{"text_format":"2","workbook":"xlsx","n_sheets":16,"sheets":["1.MONTES CLAROS","2.JANUARIA","3.JANAUBA","4.PIRAPORA","5.CURVELO","6.SALINAS","7.CAPELINHA","8.JEQUITINHONHA","CRONOG","MOB","CANT","ADM.LOC","PROJ.EXEC.","CPU ","BDI","ENC. SOCIAIS"],"not_rendered":{"charts":0,"images":4,"macros":1,"external_links":201,"defined_names":31504,"comments":0,"pivot_tables":0},"unopened":[],"bounds":{"document_bytes":16777216,"sheet_cells":100000,"run_cost":"one","rows_first":2000,"rows_last":500,"rows_between":2000,"halvings":0,"cell_chars":16384,"cell_head_chars":4096},"cells_cut":0,"cells_raw":0,"read":"whole","date_system":"1900"}

{"sheet":"1.MONTES CLAROS","index":0,"n_rows":50,"n_cols":15,"rows_kept":50,"cut":false,"hidden":false,"merged":[[47,4,47,7],[34,4,34,7],[35,4,35,7],[37,4,37,7],[39,4,39,7],[40,4,40,7],[41,4,41,7],[42,4,42,7],[43,4,43,7],[44,4,44,7],[45,4,45,7],[46,4,46,7],[33,4,33,7],[19,4,19,7],[20,4,20,7],[21,4,21,7],[23,4,23,7],[24,4,24,7],[25,4,25,7],[26,4,26,7],[28,4,28,7],[29,4,29,7],[30,4,30,7],[31,4,31,7],[18,4,18,7],[1,1,3,11],[4,1,4,13],[5,1,8,1],[5,2,8,2],[5,3,8,3],[5,4,8,7],[6,9,7,9],[6,12,8,12],[6,13,8,13],[10,4,10,7],[11,4,11,7],[13,4,13,7],[14,4,14,7],[16,4,16,7]]}
[null,"CONTRATAÇÃO DE SERVIÇOS DE EXECUÇÃO DE CAPA ASFÁLTICA COM CONCRETO BETUMINOSO USINADO A QUENTE (CBUQ) EM VIAS URBANAS E RURAIS INSERIDAS NA ÁREA DE ATUAÇÃO DA 1ª SUPERINTENDÊNCIA REGIONAL DA CODEVASF, NO ESTADO DE MINAS GERAIS - ITEM X - REGIÃO: XXXXXXXXXXXX/MG",{"$nulls":11},"xxxxxxxxxxxx"]
[null,"LOGOTIPO DA EMPRESA"]
[]
[{"$nulls":12},"Data base do orçamento: ","2024-08-01"]
[null,"CONTRATAÇÃO DE SERVIÇOS DE EXECUÇÃO DE CAPA ASFÁLTICA COM CONCRETO BETUMINOSO USINADO A QUENTE (CBUQ) EM VIAS URBANAS E RURAIS INSERIDAS NA ÁREA DE ATUAÇÃO DA 1ª SUPERINTENDÊNCIA REGIONAL DA CODEVASF, NO ESTADO DE MINAS GERAIS - ITEM 1 - REGIÃO: MONTES CLAROS/MG"]
[null,"ITEM","ORIGEM\nCOMPOSIÇÃO","CÓDIGO\nCOMPOSIÇÃO","DISCRIMINAÇÃO DOS SERVIÇOS",null,null,null,"BDI =",{"$f":"BDI!C16","v":0},"BDI  DIFERENCIADO:",{"$f":"BDI!C31","v":0},"R$/m² =",{"$f":"N49/I8","v":0}]
[{"$nulls":8},"Total de m²","Encargos Sociais:","Horista R$","Mensalista R$","PREÇO UNITÁRIO COM BDI","PREÇO TOTAL COM BDI "]
[{"$nulls":8},98000,null,{"$f":"'ENC. SOCIAIS'!$E$47","v":0},{"$f":"'ENC. SOCIAIS'!$F$47","v":0}]
[{"$nulls":8},"UND","QTDE.","BDI","PREÇO UNITÁRIO "]
[{"$nulls":4},"MOBILIZAÇÃO/DESMOBILIZAÇÃO"]
[{"$f":"VLOOKUP(N11,'1.MONTES CLAROS'!$O$11:$P$45,2,0)","v":0},1,"Codevasf","Mob","Mobilização",null,null,null,"kmxfrente",630,{"$f":"(M11/L11-1)","v":{"$error":"#DIV/0!"}},null,{"$f":"L11*(1+$J$6)","v":0},{"$f":"ROUND(ROUND(J11,2)*ROUND(M11,6),2)","v":0},{"$f":"N11/N49","v":{"$error":"#DIV/0!"}}]
[{"$f":"VLOOKUP(N12,'1.MONTES CLAROS'!$O$11:$P$45,2,0)","v":0},2,"Codevasf","Mob","Desmobilização",null,null,null,"kmxfrente",630,{"$f":"(M12/L12-1)","v":{"$error":"#DIV/0!"}},null,{"$f":"L12*(1+$J$6)","v":0},{"$f":"ROUND(ROUND(J12,2)*ROUND(M12,6),2)","v":0},{"$f":"N12/$N$49","v":{"$error":"#DIV/0!"}}]
[{"$nulls":4},"INSTALAÇÃO DE CANTEIRO"]
[{"$f":"VLOOKUP(#REF!,'1.MONTES CLAROS'!$O$11:$P$45,2,0)","v":{"$error":"#REF!"}},3,"Codevasf","Canteiro","Canteiro de Obras",null,null,null,"frente",7,{"$f":"(M14/L14-1)","v":{"$error":"#DIV/0!"}},null,{"$f":"L14*(1+$J$6)","v":0},{"$f":"ROUND(ROUND(J14,2)*ROUND(M14,6),2)","v":0},{"$f":"N14/J20","v":0}]
[{"$f":"VLOOKUP(N14,'1.MONTES CLAROS'!$O$11:$P$45,2,0)","v":0},4,"SINAPI",103689,"Fornecimento e instalação de placa de obra com chapa galvanizada e estrutura de madeira",null,null,null,"m²",112,{"$f":"(M15/L15-1)","v":{"$error":"#DIV/0!"}},null,0,{"$f":"ROUND(ROUND(J15,2)*ROUND(M15,6),2)","v":0}]
[{"$nulls":4},"ADMINISTRAÇÃO LOCAL DA OBRA"]
[null,5,"Codevasf","Adm Local","Administração Local da Obra",null,null,null,"und",1,{"$f":"(M17/L17-1)","v":{"$error":"#DIV/0!"}},null,{"$f":"L17*(1+$J$6)","v":0},{"$f":"ROUND(ROUND(J17,2)*ROUND(M17,6),2)","v":0},{"$f":"N17/N49","v":{"$error":"#DIV/0!"}}]
[{"$f":"VLOOKUP(N18,'1.MONTES CLAROS'!$O$11:$P$45,2,0)","v":0},null,null,null,"PAVIMENTAÇÃO"]
[{"$f":"VLOOKUP(N19,'1.MONTES CLAROS'!$O$11:$P$45,2,0)","v":0},6,"SICRO",4011463,"Concreto asfáltico - faixa C - areia e brita comerciais",null,null,null,"t",11760,{"$f":"(M19/L19-1)","v":{"$error":"#DIV/0!"}},null,{"$f":"L19*(1+$J$6)","v":0},{"$f":"ROUND(ROUND(J19,2)*ROUND(M19,6),2)","v":0}]
[{"$f":"VLOOKUP(N20,'1.MONTES CLAROS'!$O$11:$P$45,2,0)","v":0},7,"SICRO",4011353,"Pintura de ligação",null,null,null,"m²",98000,{"$error":"#DIV/0!"},null,0,0]
[{"$f":"VLOOKUP(N21,'1.MONTES CLAROS'!$O$11:$P$45,2,0)","v":0},8,"SICRO",4915663,"Fresagem descontínua de revestimento asfáltico - espessura de 5 cm",null,null,null,"m³",490,{"$error":"#DIV/0!"},null,0,0]
[{"$f":"VLOOKUP(N22,'1.MONTES CLAROS'!$O$11:$P$45,2,0)","v":0},9,"SICRO",4915618,"Recomposição de camada granular do pavimento com material de jazida",null,null,null,"m²",9800,{"$error":"#DIV/0!"},null,0,0]
[{"$f":"VLOOKUP(N23,'1.MONTES CLAROS'!$O$11:$P$45,2,0)","v":0},null,null,null,"AQUISIÇÃO E TRANSPORTE DO MATERIAL BETUMINOSO"]
[{"$f":"VLOOKUP(N24,'1.MONTES CLAROS'!$O$11:$P$45,2,0)","v":0},10,"CODEVASF","CPU-13","AQUISIÇÃO DE CIMENTO ASFALTICO CAP 50/70",null,null,null,"t",743.58,{"$f":"(M24/L24-1)","v":{"$error":"#DIV/0!"}},null,{"$f":"L24*(1+$L$6)","v":0},{"$f":"ROUND(ROUND(J24,2)*ROUND(M24,6),2)","v":0}]
[{"$f":"VLOOKUP(N25,'1.MONTES CLAROS'!$O$11:$P$45,2,0)","v":0},11,"CODEVASF","CPU-17","TRANSPORTE CAP 50/70",null,null,null,"t",743.58,{"$error":"#DIV/0!"},null,{"$f":"L25*(1+$L$6)","v":0},0]
[{"$f":"VLOOKUP(N26,'1.MONTES CLAROS'!$O$11:$P$45,2,0)","v":0},12,"CODEVASF","CPU-15","AQUISIÇÃO DE EMULSÃO ASFÁLTICA RR-1C",null,null,null,"t",44.1,{"$error":"#DIV/0!"},null,0,0]
[{"$f":"VLOOKUP(N27,'1.MONTES CLAROS'!$O$11:$P$45,2,0)","v":0},13,"CODEVASF","CPU-19","TRANSPORTE RR-1C",null,null,null,"t",44.1,{"$error":"#DIV/0!"},null,0,0]
[{"$f":"VLOOKUP(N28,'1.MONTES CLAROS'!$O$11:$P$45,2,0)","v":0},null,null,null,"SINALIZAÇÃO"]
[{"$f":"VLOOKUP(N29,'1.MONTES CLAROS'!$O$11:$P$45,2,0)","v":0},14,"SICRO",5213440,"Placa de regulamentação em aço D = 0,60 m - película retrorrefletiva tipo I + SI - fornecimento e implantação",null,null,null,"und",42,{"$f":"(M29/L29-1)","v":{"$error":"#DIV/0!"}},null,{"$f":"L29*(1+$J$6)","v":0},{"$f":"ROUND(ROUND(J29,2)*ROUND(M29,6),2)","v":0}]
[null,15,"SICRO",5213464,"Placa de advertência em aço, lado de 0,60 m - película retrorrefletiva tipo I + SI - fornecimento e implantação",null,null,null,"und",42,{"$error":"#DIV/0!"},null,0,0]
[{"$f":"VLOOKUP(N31,'1.MONTES CLAROS'!$O$11:$P$45,2,0)","v":0},16,"SICRO",5213863,"Suporte metálico galvanizado para placa de advertência ou regulamentação - lado ou diâmetro de 0,60 m - fornecimento e implantação",null,null,null,"und",84,{"$f":"(M31/L31-1)","v":{"$error":"#DIV/0!"}},null,0,0]
[{"$f":"VLOOKUP(N32,'1.MONTES CLAROS'!$O$11:$P$45,2,0)","v":0},17,"SICRO",5213400,"Pintura de faixa com tinta acrílica - espessura de 0,4 mm",null,null,null,"m²",3360,{"$error":"#DIV/0!"},null,0,0]
[{"$f":"VLOOKUP(N33,'1.MONTES CLAROS'!$O$11:$P$45,2,0)","v":0},null,null,null,"DRENAGEM"]
[{"$f":"VLOOKUP(N34,'1.MONTES CLAROS'!$O$11:$P$45,2,0)","v":0},18,"SICRO",4915777,"Reassentamento manual de meio-fio com material arrancado da pista",null,null,null,"m",2800,{"$f":"(M34/L34-1)","v":{"$error":"#DIV/0!"}},null,{"$f":"L34*(1+$J$6)","v":0},{"$f":"ROUND(ROUND(J34,2)*ROUND(M34,6),2)","v":0}]
[{"$f":"VLOOKUP(N35,'1.MONTES CLAROS'!$O$11:$P$45,2,0)","v":0},19,"SICRO",4915708,"Limpeza de sarjeta e meio-fio",null,null,null,"m",3360,{"$error":"#DIV/0!"},null,0,0]
[{"$f":"VLOOKUP(N36,'1.MONTES CLAROS'!$O$11:$P$45,2,0)","v":0},20,"SICRO",4915724,"Caiação mecanizada com fixador de cal",null,null,null,"m²",3360,{"$error":"#DIV/0!"},null,0,0]
[{"$f":"VLOOKUP(N37,'1.MONTES CLAROS'!$O$11:$P$45,2,0)","v":0},null,null,null,"PROJETO EXECUTIVO"]
[{"$f":"VLOOKUP(N38,'1.MONTES CLAROS'!$O$11:$P$45,2,0)","v":0},21,"Codevasf","Composição Própria","Projeto Executivo",null,null,null,"m²",98000,{"$f":"(M38/L38-1)","v":{"$error":"#DIV/0!"}},null,{"$f":"L38*(1+$J$6)","v":0},{"$f":"ROUND(ROUND(J38,2)*ROUND(M38,6),2)","v":0},{"$f":"N38/N49","v":{"$error":"#DIV/0!"}}]
[{"$f":"VLOOKUP(N39,'1.MONTES CLAROS'!$O$11:$P$45,2,0)","v":0},null,null,null,"MOMENTO DE TRANSPORTE"]
[{"$f":"VLOOKUP(N40,'1.MONTES CLAROS'!$O$11:$P$45,2,0)","v":0},22,"SICRO",5914359,"Transporte com caminhão basculante de 10 m³ - rodovia em leito natural",null,null,null,"tkm",29552.79,{"$f":"(M40/L40-1)","v":{"$error":"#DIV/0!"}},null,{"$f":"L40*(1+$J$6)","v":0},{"$f":"ROUND(ROUND(J40,2)*ROUND(M40,6),2)","v":0}]
[{"$f":"VLOOKUP(N41,'1.MONTES CLAROS'!$O$11:$P$45,2,0)","v":0},23,"SICRO",5914374,"Transporte com caminhão basculante de 10 m³ - rodovia em revestimento primário",null,null,null,"tkm",29552.79,{"$error":"#DIV/0!"},null,0,0]
[{"$f":"VLOOKUP(N42,'1.MONTES CLAROS'!$O$11:$P$45,2,0)","v":0},24,"SICRO",5914389,"Transporte com caminhão basculante de 10 m³ - rodovia pavimentada",null,null,null,"tkm",1055341.5,{"$error":"#DIV/0!"},null,0,0]
[{"$f":"VLOOKUP(N43,'1.MONTES CLAROS'!$O$11:$P$45,2,0)","v":0},25,"SICRO",5914364,"Transporte de cimento ou cal hidratada a granel com caminhão silo de 30 m³ - rodovia em leito natural",null,null,null,"tkm",539.29999999999995,{"$error":"#DIV/0!"},null,0,0]
[{"$f":"VLOOKUP(N44,'1.MONTES CLAROS'!$O$11:$P$45,2,0)","v":0},26,"SICRO",5914365,"Transporte de cimento ou cal hidratada a granel com caminhão silo de 30 m³ - rodovia em revestimento primário",null,null,null,"tkm",539.29999999999995,{"$error":"#DIV/0!"},null,0,0]
[{"$f":"VLOOKUP(N45,'1.MONTES CLAROS'!$O$11:$P$45,2,0)","v":0},27,"SICRO",5914366,"Transporte de cimento ou cal hidratada a granel com caminhão silo de 30 m³ - rodovia pavimentada",null,null,null,"tkm",5393.04,{"$error":"#DIV/0!"},null,0,0]
[{"$f":"VLOOKUP(N46,'1.MONTES CLAROS'!$O$11:$P$45,2,0)","v":0},28,"SICRO",5914314,"Transporte com caminhão basculante de 6 m³ - rodovia em leito natural",null,null,null,"tkm",202.17,{"$error":"#DIV/0!"},null,0,0]
[{"$f":"VLOOKUP(N47,'1.MONTES CLAROS'!$O$11:$P$45,2,0)","v":0},29,"SICRO",5914329,"Transporte com caminhão basculante de 6 m³ - rodovia em revestimento primário",null,null,null,"tkm",202.17,{"$error":"#DIV/0!"},null,0,0]
[{"$f":"VLOOKUP(N48,'1.MONTES CLAROS'!$O$11:$P$45,2,0)","v":0},30,"SICRO",5914344,"Transporte com caminhão basculante de 6 m³ - rodovia pavimentada",null,null,null,"tkm",16173.53,{"$error":"#DIV/0!"},null,0,0]
[{"$nulls":9},"VALOR TOTAL DO SRP",null,null,null,{"$f":"SUM(N11:N48)","v":0}]
[null,"Obs.: Os valores estão apresentados com apenas 2 casas decimais, mas os valores da presente planilha foram calculados utilizando a precisão de 6 casa decimais. "]

{"sheet":"2.JANUARIA","index":1,"n_rows":50,"n_cols":15,"rows_kept":50,"cut":false,"hidden":false,"merged":[[42,4,42,7],[43,4,43,7],[44,4,44,7],[45,4,45,7],[46,4,46,7],[47,4,47,7],[34,4,34,7],[35,4,35,7],[37,4,37,7],[39,4,39,7],[40,4,40,7],[41,4,41,7],[26,4,26,7],[28,4,28,7],[29,4,29,7],[30,4,30,7],[31,4,31,7],[33,4,33,7],[19,4,19,7],[20,4,20,7],[21,4,21,7],[23,4,23,7],[24,4,24,7],[25,4,25,7],[10,4,10,7],[11,4,11,7],[13,4,13,7],[14,4,14,7],[16,4,16,7],[18,4,18,7],[1,1,3,11],[4,1,4,13],[5,1,8,1],[5,2,8,2],[5,3,8,3],[5,4,8,7],[6,9,7,9],[6,12,8,12],[6,13,8,13]]}
[null,"CONTRATAÇÃO DE SERVIÇOS DE EXECUÇÃO DE CAPA ASFÁLTICA COM CONCRETO BETUMINOSO USINADO A QUENTE (CBUQ) EM VIAS URBANAS E RURAIS INSERIDAS NA ÁREA DE ATUAÇÃO DA 1ª SUPERINTENDÊNCIA REGIONAL DA CODEVASF, NO ESTADO DE MINAS GERAIS - ITEM X - REGIÃO: XXXXXXXXXXXX/MG",{"$nulls":11},"xxxxxxxxxxxx"]
[null,"LOGOTIPO DA EMPRESA"]
[]
[{"$nulls":12},"Data base do orçamento: ","2024-08-01"]
[null,"CONTRATAÇÃO DE SERVIÇOS DE EXECUÇÃO DE CAPA ASFÁLTICA COM CONCRETO BETUMINOSO USINADO A QUENTE (CBUQ) EM VIAS URBANAS E RURAIS INSERIDAS NA ÁREA DE ATUAÇÃO DA 1ª SUPERINTENDÊNCIA REGIONAL DA CODEVASF, NO ESTADO DE MINAS GERAIS - ITEM 2 - REGIÃO: JANUÁRIA/MG"]
[null,"ITEM","ORIGEM\nCOMPOSIÇÃO","CÓDIGO\nCOMPOSIÇÃO","DISCRIMINAÇÃO DOS SERVIÇOS",null,null,null,"BDI =",{"$f":"BDI!C16","v":0},"BDI  DIFERENCIADO:",{"$f":"BDI!C31","v":0},"R$/m² =",{"$f":"N49/I8","v":0}]
[{"$nulls":8},"Total de m²","Encargos Sociais:","Horista R$","Mensalista R$","PREÇO UNITÁRIO COM BDI","PREÇO TOTAL COM BDI "]
[{"$nulls":8},70000,null,{"$f":"'ENC. SOCIAIS'!$E$47","v":0},{"$f":"'ENC. SOCIAIS'!$F$47","v":0}]
[{"$nulls":8},"UND","QTDE.","BDI","PREÇO UNITÁRIO "]
[{"$nulls":4},"MOBILIZAÇÃO/DESMOBILIZAÇÃO"]
[{"$f":"VLOOKUP(N11,'2.JANUARIA'!$O$11:$P$45,2,0)","v":0},1,"Codevasf","Mob","Mobilização",null,null,null,"kmxfrente",450,{"$f":"(M11/L11-1)","v":{"$error":"#DIV/0!"}},null,{"$f":"L11*(1+$J$6)","v":0},{"$f":"ROUND(ROUND(J11,2)*ROUND(M11,6),2)","v":0},{"$f":"N11/N49","v":{"$error":"#DIV/0!"}}]
[{"$f":"VLOOKUP(N12,'2.JANUARIA'!$O$11:$P$45,2,0)","v":0},2,"Codevasf","Mob","Desmobilização",null,null,null,"kmxfrente",450,{"$f":"(M12/L12-1)","v":{"$error":"#DIV/0!"}},null,{"$f":"L12*(1+$J$6)","v":0},{"$f":"ROUND(ROUND(J12,2)*ROUND(M12,6),2)","v":0},{"$f":"N12/$N$49","v":{"$error":"#DIV/0!"}}]
[{"$nulls":4},"INSTALAÇÃO DE CANTEIRO"]
[{"$f":"VLOOKUP(#REF!,'2.JANUARIA'!$O$11:$P$45,2,0)","v":{"$error":"#REF!"}},3,"Codevasf","Canteiro","Canteiro de Obras",null,null,null,"frente",5,{"$f":"(M14/L14-1)","v":{"$error":"#DIV/0!"}},null,{"$f":"L14*(1+$J$6)","v":0},{"$f":"ROUND(ROUND(J14,2)*ROUND(M14,6),2)","v":0},{"$f":"N14/J20","v":0}]
[{"$f":"VLOOKUP(N14,'2.JANUARIA'!$O$11:$P$45,2,0)","v":0},4,"SINAPI",103689,"Fornecimento e instalação de placa de obra com chapa galvanizada e estrutura de madeira",null,null,null,"m²",80,{"$f":"(M15/L15-1)","v":{"$error":"#DIV/0!"}},null,0,{"$f":"ROUND(ROUND(J15,2)*ROUND(M15,6),2)","v":0}]
[{"$nulls":4},"ADMINISTRAÇÃO LOCAL DA OBRA"]
[null,5,"Codevasf","Adm Local","Administração Local da Obra",null,null,null,"und",1,{"$f":"(M17/L17-1)","v":{"$error":"#DIV/0!"}},null,{"$f":"L17*(1+$J$6)","v":0},{"$f":"ROUND(ROUND(J17,2)*ROUND(M17,6),2)","v":0},{"$f":"N17/N49","v":{"$error":"#DIV/0!"}}]
[{"$f":"VLOOKUP(N18,'2.JANUARIA'!$O$11:$P$45,2,0)","v":0},null,null,null,"PAVIMENTAÇÃO"]
[{"$f":"VLOOKUP(N19,'2.JANUARIA'!$O$11:$P$45,2,0)","v":0},6,"SICRO",4011463,"Concreto asfáltico - faixa C - areia e brita comerciais",null,null,null,"t",8400,{"$f":"(M19/L19-1)","v":{"$error":"#DIV/0!"}},null,{"$f":"L19*(1+$J$6)","v":0},{"$f":"ROUND(ROUND(J19,2)*ROUND(M19,6),2)","v":0}]
[{"$f":"VLOOKUP(N20,'2.JANUARIA'!$O$11:$P$45,2,0)","v":0},7,"SICRO",4011353,"Pintura de ligação",null,null,null,"m²",70000,{"$error":"#DIV/0!"},null,0,0]
[{"$f":"VLOOKUP(N21,'2.JANUARIA'!$O$11:$P$45,2,0)","v":0},8,"SICRO",4915663,"Fresagem descontínua de revestimento asfáltico - espessura de 5 cm",null,null,null,"m³",350,{"$error":"#DIV/0!"},null,0,0]
[{"$f":"VLOOKUP(N22,'2.JANUARIA'!$O$11:$P$45,2,0)","v":0},9,"SICRO",4915618,"Recomposição de camada granular do pavimento com material de jazida",null,null,null,"m²",7000,{"$error":"#DIV/0!"},null,0,0]
[{"$f":"VLOOKUP(N23,'2.JANUARIA'!$O$11:$P$45,2,0)","v":0},null,null,null,"AQUISIÇÃO E TRANSPORTE DO MATERIAL BETUMINOSO"]
[{"$f":"VLOOKUP(N24,'2.JANUARIA'!$O$11:$P$45,2,0)","v":0},10,"CODEVASF","CPU-13","AQUISIÇÃO DE CIMENTO ASFALTICO CAP 50/70",null,null,null,"t",531.13,{"$f":"(M24/L24-1)","v":{"$error":"#DIV/0!"}},null,{"$f":"L24*(1+$L$6)","v":0},{"$f":"ROUND(ROUND(J24,2)*ROUND(M24,6),2)","v":0}]
[{"$f":"VLOOKUP(N25,'2.JANUARIA'!$O$11:$P$45,2,0)","v":0},11,"CODEVASF","CPU-17","TRANSPORTE CAP 50/70",null,null,null,"t",531.13,{"$error":"#DIV/0!"},null,{"$f":"L25*(1+$L$6)","v":0},0]
[{"$f":"VLOOKUP(N26,'2.JANUARIA'!$O$11:$P$45,2,0)","v":0},12,"CODEVASF","CPU-15","AQUISIÇÃO DE EMULSÃO ASFÁLTICA RR-1C",null,null,null,"t",31.5,{"$error":"#DIV/0!"},null,0,0]
[{"$f":"VLOOKUP(N27,'2.JANUARIA'!$O$11:$P$45,2,0)","v":0},13,"CODEVASF","CPU-19","TRANSPORTE RR-1C",null,null,null,"t",31.5,{"$error":"#DIV/0!"},null,0,0]
[{"$f":"VLOOKUP(N28,'2.JANUARIA'!$O$11:$P$45,2,0)","v":0},null,null,null,"SINALIZAÇÃO"]
[{"$f":"VLOOKUP(N29,'2.JANUARIA'!$O$11:$P$45,2,0)","v":0},14,"SICRO",5213440,"Placa de regulamentação em aço D = 0,60 m - película retrorrefletiva tipo I + SI - fornecimento e implantação",null,null,null,"und",30,{"$f":"(M29/L29-1)","v":{"$error":"#DIV/0!"}},null,{"$f":"L29*(1+$J$6)","v":0},{"$f":"ROUND(ROUND(J29,2)*ROUND(M29,6),2)","v":0}]
[null,15,"SICRO",5213464,"Placa de advertência em aço, lado de 0,60 m - película retrorrefletiva tipo I + SI - fornecimento e implantação",null,null,null,"und",30,{"$error":"#DIV/0!"},null,0,0]
[{"$f":"VLOOKUP(N31,'2.JANUARIA'!$O$11:$P$45,2,0)","v":0},16,"SICRO",5213863,"Suporte metálico galvanizado para placa de advertência ou regulamentação - lado ou diâmetro de 0,60 m - fornecimento e implantação",null,null,null,"und",60,{"$error":"#DIV/0!"},null,0,0]
[{"$f":"VLOOKUP(N32,'2.JANUARIA'!$O$11:$P$45,2,0)","v":0},17,"SICRO",5213400,"Pintura de faixa com tinta acrílica - espessura de 0,4 mm",null,null,null,"m²",2400,{"$error":"#DIV/0!"},null,0,0]
[{"$f":"VLOOKUP(N33,'2.JANUARIA'!$O$11:$P$45,2,0)","v":0},null,null,null,"DRENAGEM"]
[{"$f":"VLOOKUP(N34,'2.JANUARIA'!$O$11:$P$45,2,0)","v":0},18,"SICRO",4915777,"Reassentamento manual de meio-fio com material arrancado da pista",null,null,null,"m",2000,{"$f":"(M34/L34-1)","v":{"$error":"#DIV/0!"}},null,{"$f":"L34*(1+$J$6)","v":0},{"$f":"ROUND(ROUND(J34,2)*ROUND(M34,6),2)","v":0}]
[{"$f":"VLOOKUP(N35,'2.JANUARIA'!$O$11:$P$45,2,0)","v":0},19,"SICRO",4915708,"Limpeza de sarjeta e meio-fio",null,null,null,"m",2400,{"$error":"#DIV/0!"},null,0,0]
[{"$f":"VLOOKUP(N36,'2.JANUARIA'!$O$11:$P$45,2,0)","v":0},20,"SICRO",4915724,"Caiação mecanizada com fixador de cal",null,null,null,"m²",2400,{"$error":"#DIV/0!"},null,0,0]
[{"$f":"VLOOKUP(N37,'2.JANUARIA'!$O$11:$P$45,2,0)","v":0},null,null,null,"PROJETO EXECUTIVO"]
[{"$f":"VLOOKUP(N38,'2.JANUARIA'!$O$11:$P$45,2,0)","v":0},21,"Codevasf","Composição Própria","Projeto Executivo",null,null,null,"m²",70000,{"$f":"(M38/L38-1)","v":{"$error":"#DIV/0!"}},null,{"$f":"L38*(1+$J$6)","v":0},{"$f":"ROUND(ROUND(J38,2)*ROUND(M38,6),2)","v":0},{"$f":"N38/N49","v":{"$error":"#DIV/0!"}}]
[{"$f":"VLOOKUP(N39,'2.JANUARIA'!$O$11:$P$45,2,0)","v":0},null,null,null,"MOMENTO DE TRANSPORTE"]
[{"$f":"VLOOKUP(N40,'2.JANUARIA'!$O$11:$P$45,2,0)","v":0},22,"SICRO",5914359,"Transporte com caminhão basculante de 10 m³ - rodovia em leito natural",null,null,null,"tkm",21237.52,{"$f":"(M40/L40-1)","v":{"$error":"#DIV/0!"}},null,{"$f":"L40*(1+$J$6)","v":0},{"$f":"ROUND(ROUND(J40,2)*ROUND(M40,6),2)","v":0}]
[{"$f":"VLOOKUP(N41,'2.JANUARIA'!$O$11:$P$45,2,0)","v":0},23,"SICRO",5914374,"Transporte com caminhão basculante de 10 m³ - rodovia em revestimento primário",null,null,null,"tkm",21237.52,{"$error":"#DIV/0!"},null,0,0]
[{"$f":"VLOOKUP(N42,'2.JANUARIA'!$O$11:$P$45,2,0)","v":0},24,"SICRO",5914389,"Transporte com caminhão basculante de 10 m³ - rodovia pavimentada",null,null,null,"tkm",755099.18,{"$error":"#DIV/0!"},null,0,0]
[{"$f":"VLOOKUP(N43,'2.JANUARIA'!$O$11:$P$45,2,0)","v":0},25,"SICRO",5914364,"Transporte de cimento ou cal hidratada a granel com caminhão silo de 30 m³ - rodovia em leito natural",null,null,null,"tkm",385.22,{"$error":"#DIV/0!"},null,0,0]
[{"$f":"VLOOKUP(N44,'2.JANUARIA'!$O$11:$P$45,2,0)","v":0},26,"SICRO",5914365,"Transporte de cimento ou cal hidratada a granel com caminhão silo de 30 m³ - rodovia em revestimento primário",null,null,null,"tkm",385.22,{"$error":"#DIV/0!"},null,0,0]
[{"$f":"VLOOKUP(N45,'2.JANUARIA'!$O$11:$P$45,2,0)","v":0},27,"SICRO",5914366,"Transporte de cimento ou cal hidratada a granel com caminhão silo de 30 m³ - rodovia pavimentada",null,null,null,"tkm",3852.17,{"$error":"#DIV/0!"},null,0,0]
[{"$f":"VLOOKUP(N46,'2.JANUARIA'!$O$11:$P$45,2,0)","v":0},28,"SICRO",5914314,"Transporte com caminhão basculante de 6 m³ - rodovia em leito natural",null,null,null,"tkm",144.41,{"$error":"#DIV/0!"},null,0,0]
[{"$f":"VLOOKUP(N47,'2.JANUARIA'!$O$11:$P$45,2,0)","v":0},29,"SICRO",5914329,"Transporte com caminhão basculante de 6 m³ - rodovia em revestimento primário",null,null,null,"tkm",144.41,{"$error":"#DIV/0!"},null,0,0]
[{"$f":"VLOOKUP(N48,'2.JANUARIA'!$O$11:$P$45,2,0)","v":0},30,"SICRO",5914344,"Transporte com caminhão basculante de 6 m³ - rodovia pavimentada",null,null,null,"tkm",11552.52,{"$error":"#DIV/0!"},null,0,0]
[{"$nulls":9},"VALOR TOTAL DO SRP",null,null,null,{"$f":"SUM(N11:N48)","v":0}]
[null,"Obs.: Os valores estão apresentados com apenas 2 casas decimais, mas os valores da presente planilha foram calculados utilizando a precisão de 6 casa decimais. "]

{"sheet":"3.JANAUBA","index":2,"n_rows":50,"n_cols":15,"rows_kept":50,"cut":false,"hidden":false,"merged":[[42,4,42,7],[43,4,43,7],[44,4,44,7],[45,4,45,7],[46,4,46,7],[47,4,47,7],[34,4,34,7],[35,4,35,7],[37,4,37,7],[39,4,39,7],[40,4,40,7],[41,4,41,7],[26,4,26,7],[28,4,28,7],[29,4,29,7],[30,4,30,7],[31,4,31,7],[33,4,33,7],[19,4,19,7],[20,4,20,7],[21,4,21,7],[23,4,23,7],[24,4,24,7],[25,4,25,7],[10,4,10,7],[11,4,11,7],[13,4,13,7],[14,4,14,7],[16,4,16,7],[18,4,18,7],[1,1,3,11],[4,1,4,13],[5,1,8,1],[5,2,8,2],[5,3,8,3],[5,4,8,7],[6,9,7,9],[6,12,8,12],[6,13,8,13]]}
[null,"CONTRATAÇÃO DE SERVIÇOS DE EXECUÇÃO DE CAPA ASFÁLTICA COM CONCRETO BETUMINOSO USINADO A QUENTE (CBUQ) EM VIAS URBANAS E RURAIS INSERIDAS NA ÁREA DE ATUAÇÃO DA 1ª SUPERINTENDÊNCIA REGIONAL DA CODEVASF, NO ESTADO DE MINAS GERAIS - ITEM X - REGIÃO: XXXXXXXXXXXX/MG",{"$nulls":11},"xxxxxxxxxxxx"]
[null,"LOGOTIPO DA EMPRESA"]
[]
[{"$nulls":12},"Data base do orçamento: ","2024-08-01"]
[null,"CONTRATAÇÃO DE SERVIÇOS DE EXECUÇÃO DE CAPA ASFÁLTICA COM CONCRETO BETUMINOSO USINADO A QUENTE (CBUQ) EM VIAS URBANAS E RURAIS INSERIDAS NA ÁREA DE ATUAÇÃO DA 1ª SUPERINTENDÊNCIA REGIONAL DA CODEVASF, NO ESTADO DE MINAS GERAIS - ITEM 3 - REGIÃO: JANAÚBA/MG"]
[null,"ITEM","ORIGEM\nCOMPOSIÇÃO","CÓDIGO\nCOMPOSIÇÃO","DISCRIMINAÇÃO DOS SERVIÇOS",null,null,null,"BDI =",{"$f":"BDI!C16","v":0},"BDI  DIFERENCIADO:",{"$f":"BDI!C31","v":0},"R$/m² =",{"$f":"N49/I8","v":0}]
[{"$nulls":8},"Total de m²","Encargos Sociais:","Horista R$","Mensalista R$","PREÇO UNITÁRIO COM BDI","PREÇO TOTAL COM BDI "]
[{"$nulls":8},84000,null,{"$f":"'ENC. SOCIAIS'!$E$47","v":0},{"$f":"'ENC. SOCIAIS'!$F$47","v":0}]
[{"$nulls":8},"UND","QTDE.","BDI","PREÇO UNITÁRIO "]
[{"$nulls":4},"MOBILIZAÇÃO/DESMOBILIZAÇÃO"]
[{"$f":"VLOOKUP(N11,'3.JANAUBA'!$O$11:$P$45,2,0)","v":0},1,"Codevasf","Mob","Mobilização",null,null,null,"kmxfrente",480,{"$f":"(M11/L11-1)","v":{"$error":"#DIV/0!"}},null,{"$f":"L11*(1+$J$6)","v":0},{"$f":"ROUND(ROUND(J11,2)*ROUND(M11,6),2)","v":0},{"$f":"N11/N49","v":{"$error":"#DIV/0!"}}]
[{"$f":"VLOOKUP(N12,'3.JANAUBA'!$O$11:$P$45,2,0)","v":0},2,"Codevasf","Mob","Desmobilização",null,null,null,"kmxfrente",480,{"$f":"(M12/L12-1)","v":{"$error":"#DIV/0!"}},null,{"$f":"L12*(1+$J$6)","v":0},{"$f":"ROUND(ROUND(J12,2)*ROUND(M12,6),2)","v":0},{"$f":"N12/$N$49","v":{"$error":"#DIV/0!"}}]
[{"$nulls":4},"INSTALAÇÃO DE CANTEIRO"]
[{"$f":"VLOOKUP(#REF!,'3.JANAUBA'!$O$11:$P$45,2,0)","v":{"$error":"#REF!"}},3,"Codevasf","Canteiro","Canteiro de Obras",null,null,null,"frente",6,{"$f":"(M14/L14-1)","v":{"$error":"#DIV/0!"}},null,{"$f":"L14*(1+$J$6)","v":0},{"$f":"ROUND(ROUND(J14,2)*ROUND(M14,6),2)","v":0},{"$f":"N14/J20","v":0}]
[{"$f":"VLOOKUP(N14,'3.JANAUBA'!$O$11:$P$45,2,0)","v":0},4,"SINAPI",103689,"Fornecimento e instalação de placa de obra com chapa galvanizada e estrutura de madeira",null,null,null,"m²",96,{"$f":"(M15/L15-1)","v":{"$error":"#DIV/0!"}},null,0,{"$f":"ROUND(ROUND(J15,2)*ROUND(M15,6),2)","v":0}]
[{"$nulls":4},"ADMINISTRAÇÃO LOCAL DA OBRA"]
[null,5,"Codevasf","Adm Local","Administração Local da Obra",null,null,null,"und",1,{"$f":"(M17/L17-1)","v":{"$error":"#DIV/0!"}},null,{"$f":"L17*(1+$J$6)","v":0},{"$f":"ROUND(ROUND(J17,2)*ROUND(M17,6),2)","v":0},{"$f":"N17/N49","v":{"$error":"#DIV/0!"}}]
[{"$f":"VLOOKUP(N18,'3.JANAUBA'!$O$11:$P$45,2,0)","v":0},null,null,null,"PAVIMENTAÇÃO"]
[{"$f":"VLOOKUP(N19,'3.JANAUBA'!$O$11:$P$45,2,0)","v":0},6,"SICRO",4011463,"Concreto asfáltico - faixa C - areia e brita comerciais",null,null,null,"t",10080,{"$f":"(M19/L19-1)","v":{"$error":"#DIV/0!"}},null,{"$f":"L19*(1+$J$6)","v":0},{"$f":"ROUND(ROUND(J19,2)*ROUND(M19,6),2)","v":0}]
[{"$f":"VLOOKUP(N20,'3.JANAUBA'!$O$11:$P$45,2,0)","v":0},7,"SICRO",4011353,"Pintura de ligação",null,null,null,"m²",84000,{"$error":"#DIV/0!"},null,0,0]
[{"$f":"VLOOKUP(N21,'3.JANAUBA'!$O$11:$P$45,2,0)","v":0},8,"SICRO",4915663,"Fresagem descontínua de revestimento asfáltico - espessura de 5 cm",null,null,null,"m³",420,{"$error":"#DIV/0!"},null,0,0]
[{"$f":"VLOOKUP(N22,'3.JANAUBA'!$O$11:$P$45,2,0)","v":0},9,"SICRO",4915618,"Recomposição de camada granular do pavimento com material de jazida",null,null,null,"m²",8400,{"$error":"#DIV/0!"},null,0,0]
[{"$f":"VLOOKUP(N23,'3.JANAUBA'!$O$11:$P$45,2,0)","v":0},null,null,null,"AQUISIÇÃO E TRANSPORTE DO MATERIAL BETUMINOSO"]
[{"$f":"VLOOKUP(N24,'3.JANAUBA'!$O$11:$P$45,2,0)","v":0},10,"CODEVASF","CPU-13","AQUISIÇÃO DE CIMENTO ASFALTICO CAP 50/70",null,null,null,"t",637.36,{"$f":"(M24/L24-1)","v":{"$error":"#DIV/0!"}},null,{"$f":"L24*(1+$L$6)","v":0},{"$f":"ROUND(ROUND(J24,2)*ROUND(M24,6),2)","v":0}]
[{"$f":"VLOOKUP(N25,'3.JANAUBA'!$O$11:$P$45,2,0)","v":0},11,"CODEVASF","CPU-17","TRANSPORTE CAP 50/70",null,null,null,"t",637.36,{"$error":"#DIV/0!"},null,{"$f":"L25*(1+$L$6)","v":0},0]
[{"$f":"VLOOKUP(N26,'3.JANAUBA'!$O$11:$P$45,2,0)","v":0},12,"CODEVASF","CPU-15","AQUISIÇÃO DE EMULSÃO ASFÁLTICA RR-1C",null,null,null,"t",37.799999999999997,{"$error":"#DIV/0!"},null,0,0]
[{"$f":"VLOOKUP(N27,'3.JANAUBA'!$O$11:$P$45,2,0)","v":0},13,"CODEVASF","CPU-19","TRANSPORTE RR-1C",null,null,null,"t",37.799999999999997,{"$error":"#DIV/0!"},null,0,0]
[{"$f":"VLOOKUP(N28,'3.JANAUBA'!$O$11:$P$45,2,0)","v":0},null,null,null,"SINALIZAÇÃO"]
[{"$f":"VLOOKUP(N29,'3.JANAUBA'!$O$11:$P$45,2,0)","v":0},14,"SICRO",5213440,"Placa de regulamentação em aço D = 0,60 m - película retrorrefletiva tipo I + SI - fornecimento e implantação",null,null,null,"und",36,{"$f":"(M29/L29-1)","v":{"$error":"#DIV/0!"}},null,{"$f":"L29*(1+$J$6)","v":0},{"$f":"ROUND(ROUND(J29,2)*ROUND(M29,6),2)","v":0}]
[null,15,"SICRO",5213464,"Placa de advertência em aço, lado de 0,60 m - película retrorrefletiva tipo I + SI - fornecimento e implantação",null,null,null,"und",36,{"$error":"#DIV/0!"},null,0,0]
[{"$f":"VLOOKUP(N31,'3.JANAUBA'!$O$11:$P$45,2,0)","v":0},16,"SICRO",5213863,"Suporte metálico galvanizado para placa de advertência ou regulamentação - lado ou diâmetro de 0,60 m - fornecimento e implantação",null,null,null,"und",72,{"$error":"#DIV/0!"},null,0,0]
[{"$f":"VLOOKUP(N32,'3.JANAUBA'!$O$11:$P$45,2,0)","v":0},17,"SICRO",5213400,"Pintura de faixa com tinta acrílica - espessura de 0,4 mm",null,null,null,"m²",2880,{"$error":"#DIV/0!"},null,0,0]
[{"$f":"VLOOKUP(N33,'3.JANAUBA'!$O$11:$P$45,2,0)","v":0},null,null,null,"DRENAGEM"]
[{"$f":"VLOOKUP(N34,'3.JANAUBA'!$O$11:$P$45,2,0)","v":0},18,"SICRO",4915777,"Reassentamento manual de meio-fio com material arrancado da pista",null,null,null,"m",2400,{"$f":"(M34/L34-1)","v":{"$error":"#DIV/0!"}},null,{"$f":"L34*(1+$J$6)","v":0},{"$f":"ROUND(ROUND(J34,2)*ROUND(M34,6),2)","v":0}]
[{"$f":"VLOOKUP(N35,'3.JANAUBA'!$O$11:$P$45,2,0)","v":0},19,"SICRO",4915708,"Limpeza de sarjeta e meio-fio",null,null,null,"m",2880,{"$error":"#DIV/0!"},null,0,0]
[{"$f":"VLOOKUP(N36,'3.JANAUBA'!$O$11:$P$45,2,0)","v":0},20,"SICRO",4915724,"Caiação mecanizada com fixador de cal",null,null,null,"m²",2880,{"$error":"#DIV/0!"},null,0,0]
[{"$f":"VLOOKUP(N37,'3.JANAUBA'!$O$11:$P$45,2,0)","v":0},null,null,null,"PROJETO EXECUTIVO"]
[{"$f":"VLOOKUP(N38,'3.JANAUBA'!$O$11:$P$45,2,0)","v":0},21,"Codevasf","Composição Própria","Projeto Executivo",null,null,null,"m²",84000,{"$f":"(M38/L38-1)","v":{"$error":"#DIV/0!"}},null,{"$f":"L38*(1+$J$6)","v":0},{"$f":"ROUND(ROUND(J38,2)*ROUND(M38,6),2)","v":0},{"$f":"N38/N49","v":{"$error":"#DIV/0!"}}]
[{"$f":"VLOOKUP(N39,'3.JANAUBA'!$O$11:$P$45,2,0)","v":0},null,null,null,"MOMENTO DE TRANSPORTE"]
[{"$f":"VLOOKUP(N40,'3.JANAUBA'!$O$11:$P$45,2,0)","v":0},22,"SICRO",5914359,"Transporte com caminhão basculante de 10 m³ - rodovia em leito natural",null,null,null,"tkm",21220.63,{"$f":"(M40/L40-1)","v":{"$error":"#DIV/0!"}},null,{"$f":"L40*(1+$J$6)","v":0},{"$f":"ROUND(ROUND(J40,2)*ROUND(M40,6),2)","v":0}]
[{"$f":"VLOOKUP(N41,'3.JANAUBA'!$O$11:$P$45,2,0)","v":0},23,"SICRO",5914374,"Transporte com caminhão basculante de 10 m³ - rodovia em revestimento primário",null,null,null,"tkm",21220.63,{"$error":"#DIV/0!"},null,0,0]
[{"$f":"VLOOKUP(N42,'3.JANAUBA'!$O$11:$P$45,2,0)","v":0},24,"SICRO",5914389,"Transporte com caminhão basculante de 10 m³ - rodovia pavimentada",null,null,null,"tkm",791503.86,{"$error":"#DIV/0!"},null,0,0]
[{"$f":"VLOOKUP(N43,'3.JANAUBA'!$O$11:$P$45,2,0)","v":0},25,"SICRO",5914364,"Transporte de cimento ou cal hidratada a granel com caminhão silo de 30 m³ - rodovia em leito natural",null,null,null,"tkm",462.26,{"$error":"#DIV/0!"},null,0,0]
[{"$f":"VLOOKUP(N44,'3.JANAUBA'!$O$11:$P$45,2,0)","v":0},26,"SICRO",5914365,"Transporte de cimento ou cal hidratada a granel com caminhão silo de 30 m³ - rodovia em revestimento primário",null,null,null,"tkm",462.26,{"$error":"#DIV/0!"},null,0,0]
[{"$f":"VLOOKUP(N45,'3.JANAUBA'!$O$11:$P$45,2,0)","v":0},27,"SICRO",5914366,"Transporte de cimento ou cal hidratada a granel com caminhão silo de 30 m³ - rodovia pavimentada",null,null,null,"tkm",4622.6099999999997,{"$error":"#DIV/0!"},null,0,0]
[{"$f":"VLOOKUP(N46,'3.JANAUBA'!$O$11:$P$45,2,0)","v":0},28,"SICRO",5914314,"Transporte com caminhão basculante de 6 m³ - rodovia em leito natural",null,null,null,"tkm",173.29,{"$error":"#DIV/0!"},null,0,0]
[{"$f":"VLOOKUP(N47,'3.JANAUBA'!$O$11:$P$45,2,0)","v":0},29,"SICRO",5914329,"Transporte com caminhão basculante de 6 m³ - rodovia em revestimento primário",null,null,null,"tkm",173.29,{"$error":"#DIV/0!"},null,0,0]
[{"$f":"VLOOKUP(N48,'3.JANAUBA'!$O$11:$P$45,2,0)","v":0},30,"SICRO",5914344,"Transporte com caminhão basculante de 6 m³ - rodovia pavimentada",null,null,null,"tkm",13863.02,{"$error":"#DIV/0!"},null,0,0]
[{"$nulls":9},"VALOR TOTAL DO SRP",null,null,null,{"$f":"SUM(N11:N48)","v":0}]
[null,"Obs.: Os valores estão apresentados com apenas 2 casas decimais, mas os valores da presente planilha foram calculados utilizando a precisão de 6 casa decimais. "]

{"sheet":"4.PIRAPORA","index":3,"n_rows":50,"n_cols":15,"rows_kept":50,"cut":false,"hidden":false,"merged":[[42,4,42,7],[43,4,43,7],[44,4,44,7],[45,4,45,7],[46,4,46,7],[47,4,47,7],[34,4,34,7],[35,4,35,7],[37,4,37,7],[39,4,39,7],[40,4,40,7],[41,4,41,7],[26,4,26,7],[28,4,28,7],[29,4,29,7],[30,4,30,7],[31,4,31,7],[33,4,33,7],[19,4,19,7],[20,4,20,7],[21,4,21,7],[23,4,23,7],[24,4,24,7],[25,4,25,7],[10,4,10,7],[11,4,11,7],[13,4,13,7],[14,4,14,7],[16,4,16,7],[18,4,18,7],[1,1,3,11],[4,1,4,13],[5,1,8,1],[5,2,8,2],[5,3,8,3],[5,4,8,7],[6,9,7,9],[6,12,8,12],[6,13,8,13]]}
[null,"CONTRATAÇÃO DE SERVIÇOS DE EXECUÇÃO DE CAPA ASFÁLTICA COM CONCRETO BETUMINOSO USINADO A QUENTE (CBUQ) EM VIAS URBANAS E RURAIS INSERIDAS NA ÁREA DE ATUAÇÃO DA 1ª SUPERINTENDÊNCIA REGIONAL DA CODEVASF, NO ESTADO DE MINAS GERAIS - ITEM X - REGIÃO: XXXXXXXXXXXX/MG",{"$nulls":11},"xxxxxxxxxxxx"]
[null,"LOGOTIPO DA EMPRESA"]
[]
[{"$nulls":12},"Data base do orçamento: ","2024-08-01"]
[null,"CONTRATAÇÃO DE SERVIÇOS DE EXECUÇÃO DE CAPA ASFÁLTICA COM CONCRETO BETUMINOSO USINADO A QUENTE (CBUQ) EM VIAS URBANAS E RURAIS INSERIDAS NA ÁREA DE ATUAÇÃO DA 1ª SUPERINTENDÊNCIA REGIONAL DA CODEVASF, NO ESTADO DE MINAS GERAIS - ITEM 4 - REGIÃO: PÍRAPORA/MG"]
[null,"ITEM","ORIGEM\nCOMPOSIÇÃO","CÓDIGO\nCOMPOSIÇÃO","DISCRIMINAÇÃO DOS SERVIÇOS",null,null,null,"BDI =",{"$f":"BDI!C16","v":0},"BDI  DIFERENCIADO:",{"$f":"BDI!C31","v":0},"R$/m² =",{"$f":"N49/I8","v":0}]
[{"$nulls":8},"Total de m²","Encargos Sociais:","Horista R$","Mensalista R$","PREÇO UNITÁRIO COM BDI","PREÇO TOTAL COM BDI "]
[{"$nulls":8},56000,null,{"$f":"'ENC. SOCIAIS'!$E$47","v":0},{"$f":"'ENC. SOCIAIS'!$F$47","v":0}]
[{"$nulls":8},"UND","QTDE.","BDI","PREÇO UNITÁRIO "]
[{"$nulls":4},"MOBILIZAÇÃO/DESMOBILIZAÇÃO"]
[{"$f":"VLOOKUP(N11,'4.PIRAPORA'!$O$11:$P$45,2,0)","v":0},1,"Codevasf","Mob","Mobilização",null,null,null,"kmxfrente",320,{"$f":"(M11/L11-1)","v":{"$error":"#DIV/0!"}},null,{"$f":"L11*(1+$J$6)","v":0},{"$f":"ROUND(ROUND(J11,2)*ROUND(M11,6),2)","v":0},{"$f":"N11/N49","v":{"$error":"#DIV/0!"}}]
[{"$f":"VLOOKUP(N12,'4.PIRAPORA'!$O$11:$P$45,2,0)","v":0},2,"Codevasf","Mob","Desmobilização",null,null,null,"kmxfrente",320,{"$f":"(M12/L12-1)","v":{"$error":"#DIV/0!"}},null,{"$f":"L12*(1+$J$6)","v":0},{"$f":"ROUND(ROUND(J12,2)*ROUND(M12,6),2)","v":0},{"$f":"N12/$N$49","v":{"$error":"#DIV/0!"}}]
[{"$nulls":4},"INSTALAÇÃO DE CANTEIRO"]
[{"$f":"VLOOKUP(#REF!,'4.PIRAPORA'!$O$11:$P$45,2,0)","v":{"$error":"#REF!"}},3,"Codevasf","Canteiro","Canteiro de Obras",null,null,null,"frente",4,{"$f":"(M14/L14-1)","v":{"$error":"#DIV/0!"}},null,{"$f":"L14*(1+$J$6)","v":0},{"$f":"ROUND(ROUND(J14,2)*ROUND(M14,6),2)","v":0},{"$f":"N14/J20","v":0}]
[{"$f":"VLOOKUP(N14,'4.PIRAPORA'!$O$11:$P$45,2,0)","v":0},4,"SINAPI",103689,"Fornecimento e instalação de placa de obra com chapa galvanizada e estrutura de madeira",null,null,null,"m²",64,{"$f":"(M15/L15-1)","v":{"$error":"#DIV/0!"}},null,0,{"$f":"ROUND(ROUND(J15,2)*ROUND(M15,6),2)","v":0}]
[{"$nulls":4},"ADMINISTRAÇÃO LOCAL DA OBRA"]
[null,5,"Codevasf","Adm Local","Administração Local da Obra",null,null,null,"und",1,{"$f":"(M17/L17-1)","v":{"$error":"#DIV/0!"}},null,{"$f":"L17*(1+$J$6)","v":0},{"$f":"ROUND(ROUND(J17,2)*ROUND(M17,6),2)","v":0},{"$f":"N17/N49","v":{"$error":"#DIV/0!"}}]
[{"$f":"VLOOKUP(N18,'4.PIRAPORA'!$O$11:$P$45,2,0)","v":0},null,null,null,"PAVIMENTAÇÃO"]
[{"$f":"VLOOKUP(N19,'4.PIRAPORA'!$O$11:$P$45,2,0)","v":0},6,"SICRO",4011463,"Concreto asfáltico - faixa C - areia e brita comerciais",null,null,null,"t",6720,{"$f":"(M19/L19-1)","v":{"$error":"#DIV/0!"}},null,{"$f":"L19*(1+$J$6)","v":0},{"$f":"ROUND(ROUND(J19,2)*ROUND(M19,6),2)","v":0}]
[{"$f":"VLOOKUP(N20,'4.PIRAPORA'!$O$11:$P$45,2,0)","v":0},7,"SICRO",4011353,"Pintura de ligação",null,null,null,"m²",56000,{"$error":"#DIV/0!"},null,0,0]
[{"$f":"VLOOKUP(N21,'4.PIRAPORA'!$O$11:$P$45,2,0)","v":0},8,"SICRO",4915663,"Fresagem descontínua de revestimento asfáltico - espessura de 5 cm",null,null,null,"m³",280,{"$error":"#DIV/0!"},null,0,0]
[{"$f":"VLOOKUP(N22,'4.PIRAPORA'!$O$11:$P$45,2,0)","v":0},9,"SICRO",4915618,"Recomposição de camada granular do pavimento com material de jazida",null,null,null,"m²",5600,{"$error":"#DIV/0!"},null,0,0]
[{"$f":"VLOOKUP(N23,'4.PIRAPORA'!$O$11:$P$45,2,0)","v":0},null,null,null,"AQUISIÇÃO E TRANSPORTE DO MATERIAL BETUMINOSO"]
[{"$f":"VLOOKUP(N24,'4.PIRAPORA'!$O$11:$P$45,2,0)","v":0},10,"CODEVASF","CPU-13","AQUISIÇÃO DE CIMENTO ASFALTICO CAP 50/70",null,null,null,"t",424.91,{"$f":"(M24/L24-1)","v":{"$error":"#DIV/0!"}},null,{"$f":"L24*(1+$L$6)","v":0},{"$f":"ROUND(ROUND(J24,2)*ROUND(M24,6),2)","v":0}]
[{"$f":"VLOOKUP(N25,'4.PIRAPORA'!$O$11:$P$45,2,0)","v":0},11,"CODEVASF","CPU-17","TRANSPORTE CAP 50/70",null,null,null,"t",424.91,{"$error":"#DIV/0!"},null,{"$f":"L25*(1+$L$6)","v":0},0]
[{"$f":"VLOOKUP(N26,'4.PIRAPORA'!$O$11:$P$45,2,0)","v":0},12,"CODEVASF","CPU-15","AQUISIÇÃO DE EMULSÃO ASFÁLTICA RR-1C",null,null,null,"t",25.2,{"$error":"#DIV/0!"},null,0,0]
[{"$f":"VLOOKUP(N27,'4.PIRAPORA'!$O$11:$P$45,2,0)","v":0},13,"CODEVASF","CPU-19","TRANSPORTE RR-1C",null,null,null,"t",25.2,{"$error":"#DIV/0!"},null,0,0]
[{"$f":"VLOOKUP(N28,'4.PIRAPORA'!$O$11:$P$45,2,0)","v":0},null,null,null,"SINALIZAÇÃO"]
[{"$f":"VLOOKUP(N29,'4.PIRAPORA'!$O$11:$P$45,2,0)","v":0},14,"SICRO",5213440,"Placa de regulamentação em aço D = 0,60 m - película retrorrefletiva tipo I + SI - fornecimento e implantação",null,null,null,"und",24,{"$f":"(M29/L29-1)","v":{"$error":"#DIV/0!"}},null,{"$f":"L29*(1+$J$6)","v":0},{"$f":"ROUND(ROUND(J29,2)*ROUND(M29,6),2)","v":0}]
[null,15,"SICRO",5213464,"Placa de advertência em aço, lado de 0,60 m - película retrorrefletiva tipo I + SI - fornecimento e implantação",null,null,null,"und",24,{"$error":"#DIV/0!"},null,0,0]
[{"$f":"VLOOKUP(N31,'4.PIRAPORA'!$O$11:$P$45,2,0)","v":0},16,"SICRO",5213863,"Suporte metálico galvanizado para placa de advertência ou regulamentação - lado ou diâmetro de 0,60 m - fornecimento e implantação",null,null,null,"und",48,{"$error":"#DIV/0!"},null,0,0]
[{"$f":"VLOOKUP(N32,'4.PIRAPORA'!$O$11:$P$45,2,0)","v":0},17,"SICRO",5213400,"Pintura de faixa com tinta acrílica - espessura de 0,4 mm",null,null,null,"m²",1920,{"$error":"#DIV/0!"},null,0,0]
[{"$f":"VLOOKUP(N33,'4.PIRAPORA'!$O$11:$P$45,2,0)","v":0},null,null,null,"DRENAGEM"]
[{"$f":"VLOOKUP(N34,'4.PIRAPORA'!$O$11:$P$45,2,0)","v":0},18,"SICRO",4915777,"Reassentamento manual de meio-fio com material arrancado da pista",null,null,null,"m",1600,{"$f":"(M34/L34-1)","v":{"$error":"#DIV/0!"}},null,{"$f":"L34*(1+$J$6)","v":0},{"$f":"ROUND(ROUND(J34,2)*ROUND(M34,6),2)","v":0}]
[{"$f":"VLOOKUP(N35,'4.PIRAPORA'!$O$11:$P$45,2,0)","v":0},19,"SICRO",4915708,"Limpeza de sarjeta e meio-fio",null,null,null,"m",1920,{"$error":"#DIV/0!"},null,0,0]
[{"$f":"VLOOKUP(N36,'4.PIRAPORA'!$O$11:$P$45,2,0)","v":0},20,"SICRO",4915724,"Caiação mecanizada com fixador de cal",null,null,null,"m²",1920,{"$error":"#DIV/0!"},null,0,0]
[{"$f":"VLOOKUP(N37,'4.PIRAPORA'!$O$11:$P$45,2,0)","v":0},null,null,null,"PROJETO EXECUTIVO"]
[{"$f":"VLOOKUP(N38,'4.PIRAPORA'!$O$11:$P$45,2,0)","v":0},21,"Codevasf","Composição Própria","Projeto Executivo",null,null,null,"m²",56000,{"$f":"(M38/L38-1)","v":{"$error":"#DIV/0!"}},null,{"$f":"L38*(1+$J$6)","v":0},{"$f":"ROUND(ROUND(J38,2)*ROUND(M38,6),2)","v":0},{"$f":"N38/N49","v":{"$error":"#DIV/0!"}}]
[{"$f":"VLOOKUP(N39,'4.PIRAPORA'!$O$11:$P$45,2,0)","v":0},null,null,null,"MOMENTO DE TRANSPORTE"]
[{"$f":"VLOOKUP(N40,'4.PIRAPORA'!$O$11:$P$45,2,0)","v":0},22,"SICRO",5914359,"Transporte com caminhão basculante de 10 m³ - rodovia em leito natural",null,null,null,"tkm",30036.13,{"$f":"(M40/L40-1)","v":{"$error":"#DIV/0!"}},null,{"$f":"L40*(1+$J$6)","v":0},{"$f":"ROUND(ROUND(J40,2)*ROUND(M40,6),2)","v":0}]
[{"$f":"VLOOKUP(N41,'4.PIRAPORA'!$O$11:$P$45,2,0)","v":0},23,"SICRO",5914374,"Transporte com caminhão basculante de 10 m³ - rodovia em revestimento primário",null,null,null,"tkm",30036.13,{"$error":"#DIV/0!"},null,0,0]
[{"$f":"VLOOKUP(N42,'4.PIRAPORA'!$O$11:$P$45,2,0)","v":0},24,"SICRO",5914389,"Transporte com caminhão basculante de 10 m³ - rodovia pavimentada",null,null,null,"tkm",590598.11,{"$error":"#DIV/0!"},null,0,0]
[{"$f":"VLOOKUP(N43,'4.PIRAPORA'!$O$11:$P$45,2,0)","v":0},25,"SICRO",5914364,"Transporte de cimento ou cal hidratada a granel com caminhão silo de 30 m³ - rodovia em leito natural",null,null,null,"tkm",308.17,{"$error":"#DIV/0!"},null,0,0]
[{"$f":"VLOOKUP(N44,'4.PIRAPORA'!$O$11:$P$45,2,0)","v":0},26,"SICRO",5914365,"Transporte de cimento ou cal hidratada a granel com caminhão silo de 30 m³ - rodovia em revestimento primário",null,null,null,"tkm",308.17,{"$error":"#DIV/0!"},null,0,0]
[{"$f":"VLOOKUP(N45,'4.PIRAPORA'!$O$11:$P$45,2,0)","v":0},27,"SICRO",5914366,"Transporte de cimento ou cal hidratada a granel com caminhão silo de 30 m³ - rodovia pavimentada",null,null,null,"tkm",3081.74,{"$error":"#DIV/0!"},null,0,0]
[{"$f":"VLOOKUP(N46,'4.PIRAPORA'!$O$11:$P$45,2,0)","v":0},28,"SICRO",5914314,"Transporte com caminhão basculante de 6 m³ - rodovia em leito natural",null,null,null,"tkm",115.53,{"$error":"#DIV/0!"},null,0,0]
[{"$f":"VLOOKUP(N47,'4.PIRAPORA'!$O$11:$P$45,2,0)","v":0},29,"SICRO",5914329,"Transporte com caminhão basculante de 6 m³ - rodovia em revestimento primário",null,null,null,"tkm",115.53,{"$error":"#DIV/0!"},null,0,0]
[{"$f":"VLOOKUP(N48,'4.PIRAPORA'!$O$11:$P$45,2,0)","v":0},30,"SICRO",5914344,"Transporte com caminhão basculante de 6 m³ - rodovia pavimentada",null,null,null,"tkm",9242.02,{"$error":"#DIV/0!"},null,0,0]
[{"$nulls":9},"VALOR TOTAL DO SRP",null,null,null,{"$f":"SUM(N11:N48)","v":0}]
[null,"Obs.: Os valores estão apresentados com apenas 2 casas decimais, mas os valores da presente planilha foram calculados utilizando a precisão de 6 casa decimais. "]

{"sheet":"5.CURVELO","index":4,"n_rows":50,"n_cols":15,"rows_kept":50,"cut":false,"hidden":false,"merged":[[42,4,42,7],[43,4,43,7],[44,4,44,7],[45,4,45,7],[46,4,46,7],[47,4,47,7],[34,4,34,7],[35,4,35,7],[37,4,37,7],[39,4,39,7],[40,4,40,7],[41,4,41,7],[26,4,26,7],[28,4,28,7],[29,4,29,7],[30,4,30,7],[31,4,31,7],[33,4,33,7],[19,4,19,7],[20,4,20,7],[21,4,21,7],[23,4,23,7],[24,4,24,7],[25,4,25,7],[10,4,10,7],[11,4,11,7],[13,4,13,7],[14,4,14,7],[16,4,16,7],[18,4,18,7],[1,1,3,11],[4,1,4,13],[5,1,8,1],[5,2,8,2],[5,3,8,3],[5,4,8,7],[6,9,7,9],[6,12,8,12],[6,13,8,13]]}
[null,"CONTRATAÇÃO DE SERVIÇOS DE EXECUÇÃO DE CAPA ASFÁLTICA COM CONCRETO BETUMINOSO USINADO A QUENTE (CBUQ) EM VIAS URBANAS E RURAIS INSERIDAS NA ÁREA DE ATUAÇÃO DA 1ª SUPERINTENDÊNCIA REGIONAL DA CODEVASF, NO ESTADO DE MINAS GERAIS - ITEM X - REGIÃO: XXXXXXXXXXXX/MG",{"$nulls":11},"xxxxxxxxxxxx"]
[null,"LOGOTIPO DA EMPRESA"]
[]
[{"$nulls":12},"Data base do orçamento: ","2024-08-01"]
[null,"CONTRATAÇÃO DE SERVIÇOS DE EXECUÇÃO DE CAPA ASFÁLTICA COM CONCRETO BETUMINOSO USINADO A QUENTE (CBUQ) EM VIAS URBANAS E RURAIS INSERIDAS NA ÁREA DE ATUAÇÃO DA 1ª SUPERINTENDÊNCIA REGIONAL DA CODEVASF, NO ESTADO DE MINAS GERAIS - ITEM 5 - REGIÃO: CURVELO/MG"]
[null,"ITEM","ORIGEM\nCOMPOSIÇÃO","CÓDIGO\nCOMPOSIÇÃO","DISCRIMINAÇÃO DOS SERVIÇOS",null,null,null,"BDI =",{"$f":"BDI!C16","v":0},"BDI  DIFERENCIADO:",{"$f":"BDI!C31","v":0},"R$/m² =",{"$f":"N49/I8","v":0}]
[{"$nulls":8},"Total de m²","Encargos Sociais:","Horista R$","Mensalista R$","PREÇO UNITÁRIO COM BDI","PREÇO TOTAL COM BDI "]
[{"$nulls":8},84000,null,{"$f":"'ENC. SOCIAIS'!$E$47","v":0},{"$f":"'ENC. SOCIAIS'!$F$47","v":0}]
[{"$nulls":8},"UND","QTDE.","BDI","PREÇO UNITÁRIO "]
[{"$nulls":4},"MOBILIZAÇÃO/DESMOBILIZAÇÃO"]
[{"$f":"VLOOKUP(N11,'5.CURVELO'!$O$11:$P$45,2,0)","v":0},1,"Codevasf","Mob","Mobilização",null,null,null,"kmxfrente",540,{"$f":"(M11/L11-1)","v":{"$error":"#DIV/0!"}},null,{"$f":"L11*(1+$J$6)","v":0},{"$f":"ROUND(ROUND(J11,2)*ROUND(M11,6),2)","v":0},{"$f":"N11/N49","v":{"$error":"#DIV/0!"}}]
[{"$f":"VLOOKUP(N12,'5.CURVELO'!$O$11:$P$45,2,0)","v":0},2,"Codevasf","Mob","Desmobilização",null,null,null,"kmxfrente",540,{"$f":"(M12/L12-1)","v":{"$error":"#DIV/0!"}},null,{"$f":"L12*(1+$J$6)","v":0},{"$f":"ROUND(ROUND(J12,2)*ROUND(M12,6),2)","v":0},{"$f":"N12/$N$49","v":{"$error":"#DIV/0!"}}]
[{"$nulls":4},"INSTALAÇÃO DE CANTEIRO"]
[{"$f":"VLOOKUP(#REF!,'5.CURVELO'!$O$11:$P$45,2,0)","v":{"$error":"#REF!"}},3,"Codevasf","Canteiro","Canteiro de Obras",null,null,null,"frente",6,{"$f":"(M14/L14-1)","v":{"$error":"#DIV/0!"}},null,{"$f":"L14*(1+$J$6)","v":0},{"$f":"ROUND(ROUND(J14,2)*ROUND(M14,6),2)","v":0},{"$f":"N14/J20","v":0}]
[{"$f":"VLOOKUP(N14,'5.CURVELO'!$O$11:$P$45,2,0)","v":0},4,"SINAPI",103689,"Fornecimento e instalação de placa de obra com chapa galvanizada e estrutura de madeira",null,null,null,"m²",96,{"$f":"(M15/L15-1)","v":{"$error":"#DIV/0!"}},null,0,{"$f":"ROUND(ROUND(J15,2)*ROUND(M15,6),2)","v":0}]
[{"$nulls":4},"ADMINISTRAÇÃO LOCAL DA OBRA"]
[null,5,"Codevasf","Adm Local","Administração Local da Obra",null,null,null,"und",1,{"$f":"(M17/L17-1)","v":{"$error":"#DIV/0!"}},null,{"$f":"L17*(1+$J$6)","v":0},{"$f":"ROUND(ROUND(J17,2)*ROUND(M17,6),2)","v":0},{"$f":"N17/N49","v":{"$error":"#DIV/0!"}}]
[{"$f":"VLOOKUP(N18,'5.CURVELO'!$O$11:$P$45,2,0)","v":0},null,null,null,"PAVIMENTAÇÃO"]
[{"$f":"VLOOKUP(N19,'5.CURVELO'!$O$11:$P$45,2,0)","v":0},6,"SICRO",4011463,"Concreto asfáltico - faixa C - areia e brita comerciais",null,null,null,"t",10080,{"$f":"(M19/L19-1)","v":{"$error":"#DIV/0!"}},null,{"$f":"L19*(1+$J$6)","v":0},{"$f":"ROUND(ROUND(J19,2)*ROUND(M19,6),2)","v":0}]
[{"$f":"VLOOKUP(N20,'5.CURVELO'!$O$11:$P$45,2,0)","v":0},7,"SICRO",4011353,"Pintura de ligação",null,null,null,"m²",84000,{"$error":"#DIV/0!"},null,0,0]
[{"$f":"VLOOKUP(N21,'5.CURVELO'!$O$11:$P$45,2,0)","v":0},8,"SICRO",4915663,"Fresagem descontínua de revestimento asfáltico - espessura de 5 cm",null,null,null,"m³",420,{"$error":"#DIV/0!"},null,0,0]
[{"$f":"VLOOKUP(N22,'5.CURVELO'!$O$11:$P$45,2,0)","v":0},9,"SICRO",4915618,"Recomposição de camada granular do pavimento com material de jazida",null,null,null,"m²",8400,{"$error":"#DIV/0!"},null,0,0]
[{"$f":"VLOOKUP(N23,'5.CURVELO'!$O$11:$P$45,2,0)","v":0},null,null,null,"AQUISIÇÃO E TRANSPORTE DO MATERIAL BETUMINOSO"]
[{"$f":"VLOOKUP(N24,'5.CURVELO'!$O$11:$P$45,2,0)","v":0},10,"CODEVASF","CPU-13","AQUISIÇÃO DE CIMENTO ASFALTICO CAP 50/70",null,null,null,"t",637.36,{"$f":"(M24/L24-1)","v":{"$error":"#DIV/0!"}},null,{"$f":"L24*(1+$L$6)","v":0},{"$f":"ROUND(ROUND(J24,2)*ROUND(M24,6),2)","v":0}]
[{"$f":"VLOOKUP(N25,'5.CURVELO'!$O$11:$P$45,2,0)","v":0},11,"CODEVASF","CPU-17","TRANSPORTE CAP 50/70",null,null,null,"t",637.36,{"$error":"#DIV/0!"},null,{"$f":"L25*(1+$L$6)","v":0},0]
[{"$f":"VLOOKUP(N26,'5.CURVELO'!$O$11:$P$45,2,0)","v":0},12,"CODEVASF","CPU-15","AQUISIÇÃO DE EMULSÃO ASFÁLTICA RR-1C",null,null,null,"t",37.799999999999997,{"$error":"#DIV/0!"},null,0,0]
[{"$f":"VLOOKUP(N27,'5.CURVELO'!$O$11:$P$45,2,0)","v":0},13,"CODEVASF","CPU-19","TRANSPORTE RR-1C",null,null,null,"t",37.799999999999997,{"$error":"#DIV/0!"},null,0,0]
[{"$f":"VLOOKUP(N28,'5.CURVELO'!$O$11:$P$45,2,0)","v":0},null,null,null,"SINALIZAÇÃO"]
[{"$f":"VLOOKUP(N29,'5.CURVELO'!$O$11:$P$45,2,0)","v":0},14,"SICRO",5213440,"Placa de regulamentação em aço D = 0,60 m - película retrorrefletiva tipo I + SI - fornecimento e implantação",null,null,null,"und",36,{"$f":"(M29/L29-1)","v":{"$error":"#DIV/0!"}},null,{"$f":"L29*(1+$J$6)","v":0},{"$f":"ROUND(ROUND(J29,2)*ROUND(M29,6),2)","v":0}]
[null,15,"SICRO",5213464,"Placa de advertência em aço, lado de 0,60 m - película retrorrefletiva tipo I + SI - fornecimento e implantação",null,null,null,"und",36,{"$error":"#DIV/0!"},null,0,0]
[{"$f":"VLOOKUP(N31,'5.CURVELO'!$O$11:$P$45,2,0)","v":0},16,"SICRO",5213863,"Suporte metálico galvanizado para placa de advertência ou regulamentação - lado ou diâmetro de 0,60 m - fornecimento e implantação",null,null,null,"und",72,{"$error":"#DIV/0!"},null,0,0]
[{"$f":"VLOOKUP(N32,'5.CURVELO'!$O$11:$P$45,2,0)","v":0},17,"SICRO",5213400,"Pintura de faixa com tinta acrílica - espessura de 0,4 mm",null,null,null,"m²",2880,{"$error":"#DIV/0!"},null,0,0]
[{"$f":"VLOOKUP(N33,'5.CURVELO'!$O$11:$P$45,2,0)","v":0},null,null,null,"DRENAGEM"]
[{"$f":"VLOOKUP(N34,'5.CURVELO'!$O$11:$P$45,2,0)","v":0},18,"SICRO",4915777,"Reassentamento manual de meio-fio com material arrancado da pista",null,null,null,"m",2400,{"$f":"(M34/L34-1)","v":{"$error":"#DIV/0!"}},null,{"$f":"L34*(1+$J$6)","v":0},{"$f":"ROUND(ROUND(J34,2)*ROUND(M34,6),2)","v":0}]
[{"$f":"VLOOKUP(N35,'5.CURVELO'!$O$11:$P$45,2,0)","v":0},19,"SICRO",4915708,"Limpeza de sarjeta e meio-fio",null,null,null,"m",2880,{"$error":"#DIV/0!"},null,0,0]
[{"$f":"VLOOKUP(N36,'5.CURVELO'!$O$11:$P$45,2,0)","v":0},20,"SICRO",4915724,"Caiação mecanizada com fixador de cal",null,null,null,"m²",2880,{"$error":"#DIV/0!"},null,0,0]
[{"$f":"VLOOKUP(N37,'5.CURVELO'!$O$11:$P$45,2,0)","v":0},null,null,null,"PROJETO EXECUTIVO"]
[{"$f":"VLOOKUP(N38,'5.CURVELO'!$O$11:$P$45,2,0)","v":0},21,"Codevasf","Composição Própria","Projeto Executivo",null,null,null,"m²",84000,{"$f":"(M38/L38-1)","v":{"$error":"#DIV/0!"}},null,{"$f":"L38*(1+$J$6)","v":0},{"$f":"ROUND(ROUND(J38,2)*ROUND(M38,6),2)","v":0},{"$f":"N38/N49","v":{"$error":"#DIV/0!"}}]
[{"$f":"VLOOKUP(N39,'5.CURVELO'!$O$11:$P$45,2,0)","v":0},null,null,null,"MOMENTO DE TRANSPORTE"]
[{"$f":"VLOOKUP(N40,'5.CURVELO'!$O$11:$P$45,2,0)","v":0},22,"SICRO",5914359,"Transporte com caminhão basculante de 10 m³ - rodovia em leito natural",null,null,null,"tkm",16009.83,{"$f":"(M40/L40-1)","v":{"$error":"#DIV/0!"}},null,{"$f":"L40*(1+$J$6)","v":0},{"$f":"ROUND(ROUND(J40,2)*ROUND(M40,6),2)","v":0}]
[{"$f":"VLOOKUP(N41,'5.CURVELO'!$O$11:$P$45,2,0)","v":0},23,"SICRO",5914374,"Transporte com caminhão basculante de 10 m³ - rodovia em revestimento primário",null,null,null,"tkm",16009.83,{"$error":"#DIV/0!"},null,0,0]
[{"$f":"VLOOKUP(N42,'5.CURVELO'!$O$11:$P$45,2,0)","v":0},24,"SICRO",5914389,"Transporte com caminhão basculante de 10 m³ - rodovia pavimentada",null,null,null,"tkm",1027280.69,{"$error":"#DIV/0!"},null,0,0]
[{"$f":"VLOOKUP(N43,'5.CURVELO'!$O$11:$P$45,2,0)","v":0},25,"SICRO",5914364,"Transporte de cimento ou cal hidratada a granel com caminhão silo de 30 m³ - rodovia em leito natural",null,null,null,"tkm",462.26,{"$error":"#DIV/0!"},null,0,0]
[{"$f":"VLOOKUP(N44,'5.CURVELO'!$O$11:$P$45,2,0)","v":0},26,"SICRO",5914365,"Transporte de cimento ou cal hidratada a granel com caminhão silo de 30 m³ - rodovia em revestimento primário",null,null,null,"tkm",462.26,{"$error":"#DIV/0!"},null,0,0]
[{"$f":"VLOOKUP(N45,'5.CURVELO'!$O$11:$P$45,2,0)","v":0},27,"SICRO",5914366,"Transporte de cimento ou cal hidratada a granel com caminhão silo de 30 m³ - rodovia pavimentada",null,null,null,"tkm",4622.6099999999997,{"$error":"#DIV/0!"},null,0,0]
[{"$f":"VLOOKUP(N46,'5.CURVELO'!$O$11:$P$45,2,0)","v":0},28,"SICRO",5914314,"Transporte com caminhão basculante de 6 m³ - rodovia em leito natural",null,null,null,"tkm",173.29,{"$error":"#DIV/0!"},null,0,0]
[{"$f":"VLOOKUP(N47,'5.CURVELO'!$O$11:$P$45,2,0)","v":0},29,"SICRO",5914329,"Transporte com caminhão basculante de 6 m³ - rodovia em revestimento primário",null,null,null,"tkm",173.29,{"$error":"#DIV/0!"},null,0,0]
[{"$f":"VLOOKUP(N48,'5.CURVELO'!$O$11:$P$45,2,0)","v":0},30,"SICRO",5914344,"Transporte com caminhão basculante de 6 m³ - rodovia pavimentada",null,null,null,"tkm",13863.02,{"$error":"#DIV/0!"},null,0,0]
[{"$nulls":9},"VALOR TOTAL DO SRP",null,null,null,{"$f":"SUM(N11:N48)","v":0}]
[null,"Obs.: Os valores estão apresentados com apenas 2 casas decimais, mas os valores da presente planilha foram calculados utilizando a precisão de 6 casa decimais. "]

{"sheet":"6.SALINAS","index":5,"n_rows":50,"n_cols":15,"rows_kept":50,"cut":false,"hidden":false,"merged":[[42,4,42,7],[43,4,43,7],[44,4,44,7],[45,4,45,7],[46,4,46,7],[47,4,47,7],[34,4,34,7],[35,4,35,7],[37,4,37,7],[39,4,39,7],[40,4,40,7],[41,4,41,7],[26,4,26,7],[28,4,28,7],[29,4,29,7],[30,4,30,7],[31,4,31,7],[33,4,33,7],[19,4,19,7],[20,4,20,7],[21,4,21,7],[23,4,23,7],[24,4,24,7],[25,4,25,7],[10,4,10,7],[11,4,11,7],[13,4,13,7],[14,4,14,7],[16,4,16,7],[18,4,18,7],[1,1,3,11],[4,1,4,13],[5,1,8,1],[5,2,8,2],[5,3,8,3],[5,4,8,7],[6,9,7,9],[6,12,8,12],[6,13,8,13]]}
[null,"CONTRATAÇÃO DE SERVIÇOS DE EXECUÇÃO DE CAPA ASFÁLTICA COM CONCRETO BETUMINOSO USINADO A QUENTE (CBUQ) EM VIAS URBANAS E RURAIS INSERIDAS NA ÁREA DE ATUAÇÃO DA 1ª SUPERINTENDÊNCIA REGIONAL DA CODEVASF, NO ESTADO DE MINAS GERAIS - ITEM X - REGIÃO: XXXXXXXXXXXX/MG",{"$nulls":11},"xxxxxxxxxxxx"]
[null,"LOGOTIPO DA EMPRESA"]
[]
[{"$nulls":12},"Data base do orçamento: ","2024-08-01"]
[null,"CONTRATAÇÃO DE SERVIÇOS DE EXECUÇÃO DE CAPA ASFÁLTICA COM CONCRETO BETUMINOSO USINADO A QUENTE (CBUQ) EM VIAS URBANAS E RURAIS INSERIDAS NA ÁREA DE ATUAÇÃO DA 1ª SUPERINTENDÊNCIA REGIONAL DA CODEVASF, NO ESTADO DE MINAS GERAIS - ITEM 6 - REGIÃO: SALINAS/MG"]
[null,"ITEM","ORIGEM\nCOMPOSIÇÃO","CÓDIGO\nCOMPOSIÇÃO","DISCRIMINAÇÃO DOS SERVIÇOS",null,null,null,"BDI =",{"$f":"BDI!C16","v":0},"BDI  DIFERENCIADO:",{"$f":"BDI!C31","v":0},"R$/m² =",{"$f":"N49/I8","v":0}]
[{"$nulls":8},"Total de m²","Encargos Sociais:","Horista R$","Mensalista R$","PREÇO UNITÁRIO COM BDI","PREÇO TOTAL COM BDI "]
[{"$nulls":8},84000,null,{"$f":"'ENC. SOCIAIS'!$E$47","v":0},{"$f":"'ENC. SOCIAIS'!$F$47","v":0}]
[{"$nulls":8},"UND","QTDE.","BDI","PREÇO UNITÁRIO "]
[{"$nulls":4},"MOBILIZAÇÃO/DESMOBILIZAÇÃO"]
[{"$f":"VLOOKUP(N11,'6.SALINAS'!$O$11:$P$45,2,0)","v":0},1,"Codevasf","Mob","Mobilização",null,null,null,"kmxfrente",480,{"$f":"(M11/L11-1)","v":{"$error":"#DIV/0!"}},null,{"$f":"L11*(1+$J$6)","v":0},{"$f":"ROUND(ROUND(J11,2)*ROUND(M11,6),2)","v":0},{"$f":"N11/N49","v":{"$error":"#DIV/0!"}}]
[{"$f":"VLOOKUP(N12,'6.SALINAS'!$O$11:$P$45,2,0)","v":0},2,"Codevasf","Mob","Desmobilização",null,null,null,"kmxfrente",480,{"$f":"(M12/L12-1)","v":{"$error":"#DIV/0!"}},null,{"$f":"L12*(1+$J$6)","v":0},{"$f":"ROUND(ROUND(J12,2)*ROUND(M12,6),2)","v":0},{"$f":"N12/$N$49","v":{"$error":"#DIV/0!"}}]
[{"$nulls":4},"INSTALAÇÃO DE CANTEIRO"]
[{"$f":"VLOOKUP(#REF!,'6.SALINAS'!$O$11:$P$45,2,0)","v":{"$error":"#REF!"}},3,"Codevasf","Canteiro","Canteiro de Obras",null,null,null,"frente",6,{"$f":"(M14/L14-1)","v":{"$error":"#DIV/0!"}},null,{"$f":"L14*(1+$J$6)","v":0},{"$f":"ROUND(ROUND(J14,2)*ROUND(M14,6),2)","v":0},{"$f":"N14/J20","v":0}]
[{"$f":"VLOOKUP(N14,'6.SALINAS'!$O$11:$P$45,2,0)","v":0},4,"SINAPI",103689,"Fornecimento e instalação de placa de obra com chapa galvanizada e estrutura de madeira",null,null,null,"m²",96,{"$f":"(M15/L15-1)","v":{"$error":"#DIV/0!"}},null,0,{"$f":"ROUND(ROUND(J15,2)*ROUND(M15,6),2)","v":0}]
[{"$nulls":4},"ADMINISTRAÇÃO LOCAL DA OBRA"]
[null,5,"Codevasf","Adm Local","Administração Local da Obra",null,null,null,"und",1,{"$f":"(M17/L17-1)","v":{"$error":"#DIV/0!"}},null,{"$f":"L17*(1+$J$6)","v":0},{"$f":"ROUND(ROUND(J17,2)*ROUND(M17,6),2)","v":0},{"$f":"N17/N49","v":{"$error":"#DIV/0!"}}]
[{"$f":"VLOOKUP(N18,'6.SALINAS'!$O$11:$P$45,2,0)","v":0},null,null,null,"PAVIMENTAÇÃO"]
[{"$f":"VLOOKUP(N19,'6.SALINAS'!$O$11:$P$45,2,0)","v":0},6,"SICRO",4011463,"Concreto asfáltico - faixa C - areia e brita comerciais",null,null,null,"t",10080,{"$f":"(M19/L19-1)","v":{"$error":"#DIV/0!"}},null,{"$f":"L19*(1+$J$6)","v":0},{"$f":"ROUND(ROUND(J19,2)*ROUND(M19,6),2)","v":0}]
[{"$f":"VLOOKUP(N20,'6.SALINAS'!$O$11:$P$45,2,0)","v":0},7,"SICRO",4011353,"Pintura de ligação",null,null,null,"m²",84000,{"$error":"#DIV/0!"},null,0,0]
[{"$f":"VLOOKUP(N21,'6.SALINAS'!$O$11:$P$45,2,0)","v":0},8,"SICRO",4915663,"Fresagem descontínua de revestimento asfáltico - espessura de 5 cm",null,null,null,"m³",420,{"$error":"#DIV/0!"},null,0,0]
[{"$f":"VLOOKUP(N22,'6.SALINAS'!$O$11:$P$45,2,0)","v":0},9,"SICRO",4915618,"Recomposição de camada granular do pavimento com material de jazida",null,null,null,"m²",8400,{"$error":"#DIV/0!"},null,0,0]
[{"$f":"VLOOKUP(N23,'6.SALINAS'!$O$11:$P$45,2,0)","v":0},null,null,null,"AQUISIÇÃO E TRANSPORTE DO MATERIAL BETUMINOSO"]
[{"$f":"VLOOKUP(N24,'6.SALINAS'!$O$11:$P$45,2,0)","v":0},10,"CODEVASF","CPU-13","AQUISIÇÃO DE CIMENTO ASFALTICO CAP 50/70",null,null,null,"t",637.36,{"$f":"(M24/L24-1)","v":{"$error":"#DIV/0!"}},null,{"$f":"L24*(1+$L$6)","v":0},{"$f":"ROUND(ROUND(J24,2)*ROUND(M24,6),2)","v":0}]
[{"$f":"VLOOKUP(N25,'6.SALINAS'!$O$11:$P$45,2,0)","v":0},11,"CODEVASF","CPU-17","TRANSPORTE CAP 50/70",null,null,null,"t",637.36,{"$error":"#DIV/0!"},null,{"$f":"L25*(1+$L$6)","v":0},0]
[{"$f":"VLOOKUP(N26,'6.SALINAS'!$O$11:$P$45,2,0)","v":0},12,"CODEVASF","CPU-15","AQUISIÇÃO DE EMULSÃO ASFÁLTICA RR-1C",null,null,null,"t",37.799999999999997,{"$error":"#DIV/0!"},null,0,0]
[{"$f":"VLOOKUP(N27,'6.SALINAS'!$O$11:$P$45,2,0)","v":0},13,"CODEVASF","CPU-19","TRANSPORTE RR-1C",null,null,null,"t",37.799999999999997,{"$error":"#DIV/0!"},null,0,0]
[{"$f":"VLOOKUP(N28,'6.SALINAS'!$O$11:$P$45,2,0)","v":0},null,null,null,"SINALIZAÇÃO"]
[{"$f":"VLOOKUP(N29,'6.SALINAS'!$O$11:$P$45,2,0)","v":0},14,"SICRO",5213440,"Placa de regulamentação em aço D = 0,60 m - película retrorrefletiva tipo I + SI - fornecimento e implantação",null,null,null,"und",36,{"$f":"(M29/L29-1)","v":{"$error":"#DIV/0!"}},null,{"$f":"L29*(1+$J$6)","v":0},{"$f":"ROUND(ROUND(J29,2)*ROUND(M29,6),2)","v":0}]
[null,15,"SICRO",5213464,"Placa de advertência em aço, lado de 0,60 m - película retrorrefletiva tipo I + SI - fornecimento e implantação",null,null,null,"und",36,{"$error":"#DIV/0!"},null,0,0]
[{"$f":"VLOOKUP(N31,'6.SALINAS'!$O$11:$P$45,2,0)","v":0},16,"SICRO",5213863,"Suporte metálico galvanizado para placa de advertência ou regulamentação - lado ou diâmetro de 0,60 m - fornecimento e implantação",null,null,null,"und",72,{"$error":"#DIV/0!"},null,0,0]
[{"$f":"VLOOKUP(N32,'6.SALINAS'!$O$11:$P$45,2,0)","v":0},17,"SICRO",5213400,"Pintura de faixa com tinta acrílica - espessura de 0,4 mm",null,null,null,"m²",2880,{"$error":"#DIV/0!"},null,0,0]
[{"$f":"VLOOKUP(N33,'6.SALINAS'!$O$11:$P$45,2,0)","v":0},null,null,null,"DRENAGEM"]
[{"$f":"VLOOKUP(N34,'6.SALINAS'!$O$11:$P$45,2,0)","v":0},18,"SICRO",4915777,"Reassentamento manual de meio-fio com material arrancado da pista",null,null,null,"m",2400,{"$f":"(M34/L34-1)","v":{"$error":"#DIV/0!"}},null,{"$f":"L34*(1+$J$6)","v":0},{"$f":"ROUND(ROUND(J34,2)*ROUND(M34,6),2)","v":0}]
[{"$f":"VLOOKUP(N35,'6.SALINAS'!$O$11:$P$45,2,0)","v":0},19,"SICRO",4915708,"Limpeza de sarjeta e meio-fio",null,null,null,"m",2880,{"$error":"#DIV/0!"},null,0,0]
[{"$f":"VLOOKUP(N36,'6.SALINAS'!$O$11:$P$45,2,0)","v":0},20,"SICRO",4915724,"Caiação mecanizada com fixador de cal",null,null,null,"m²",2880,{"$error":"#DIV/0!"},null,0,0]
[{"$f":"VLOOKUP(N37,'6.SALINAS'!$O$11:$P$45,2,0)","v":0},null,null,null,"PROJETO EXECUTIVO"]
[{"$f":"VLOOKUP(N38,'6.SALINAS'!$O$11:$P$45,2,0)","v":0},21,"Codevasf","Composição Própria","Projeto Executivo",null,null,null,"m²",84000,{"$f":"(M38/L38-1)","v":{"$error":"#DIV/0!"}},null,{"$f":"L38*(1+$J$6)","v":0},{"$f":"ROUND(ROUND(J38,2)*ROUND(M38,6),2)","v":0},{"$f":"N38/N49","v":{"$error":"#DIV/0!"}}]
[{"$f":"VLOOKUP(N39,'6.SALINAS'!$O$11:$P$45,2,0)","v":0},null,null,null,"MOMENTO DE TRANSPORTE"]
[{"$f":"VLOOKUP(N40,'6.SALINAS'!$O$11:$P$45,2,0)","v":0},22,"SICRO",5914359,"Transporte com caminhão basculante de 10 m³ - rodovia em leito natural",null,null,null,"tkm",12278.1,{"$f":"(M40/L40-1)","v":{"$error":"#DIV/0!"}},null,{"$f":"L40*(1+$J$6)","v":0},{"$f":"ROUND(ROUND(J40,2)*ROUND(M40,6),2)","v":0}]
[{"$f":"VLOOKUP(N41,'6.SALINAS'!$O$11:$P$45,2,0)","v":0},23,"SICRO",5914374,"Transporte com caminhão basculante de 10 m³ - rodovia em revestimento primário",null,null,null,"tkm",12278.1,{"$error":"#DIV/0!"},null,0,0]
[{"$f":"VLOOKUP(N42,'6.SALINAS'!$O$11:$P$45,2,0)","v":0},24,"SICRO",5914389,"Transporte com caminhão basculante de 10 m³ - rodovia pavimentada",null,null,null,"tkm",774049.81,{"$error":"#DIV/0!"},null,0,0]
[{"$f":"VLOOKUP(N43,'6.SALINAS'!$O$11:$P$45,2,0)","v":0},25,"SICRO",5914364,"Transporte de cimento ou cal hidratada a granel com caminhão silo de 30 m³ - rodovia em leito natural",null,null,null,"tkm",462.26,{"$error":"#DIV/0!"},null,0,0]
[{"$f":"VLOOKUP(N44,'6.SALINAS'!$O$11:$P$45,2,0)","v":0},26,"SICRO",5914365,"Transporte de cimento ou cal hidratada a granel com caminhão silo de 30 m³ - rodovia em revestimento primário",null,null,null,"tkm",462.26,{"$error":"#DIV/0!"},null,0,0]
[{"$f":"VLOOKUP(N45,'6.SALINAS'!$O$11:$P$45,2,0)","v":0},27,"SICRO",5914366,"Transporte de cimento ou cal hidratada a granel com caminhão silo de 30 m³ - rodovia pavimentada",null,null,null,"tkm",4622.6099999999997,{"$error":"#DIV/0!"},null,0,0]
[{"$f":"VLOOKUP(N46,'6.SALINAS'!$O$11:$P$45,2,0)","v":0},28,"SICRO",5914314,"Transporte com caminhão basculante de 6 m³ - rodovia em leito natural",null,null,null,"tkm",173.29,{"$error":"#DIV/0!"},null,0,0]
[{"$f":"VLOOKUP(N47,'6.SALINAS'!$O$11:$P$45,2,0)","v":0},29,"SICRO",5914329,"Transporte com caminhão basculante de 6 m³ - rodovia em revestimento primário",null,null,null,"tkm",173.29,{"$error":"#DIV/0!"},null,0,0]
[{"$f":"VLOOKUP(N48,'6.SALINAS'!$O$11:$P$45,2,0)","v":0},30,"SICRO",5914344,"Transporte com caminhão basculante de 6 m³ - rodovia pavimentada",null,null,null,"tkm",13863.02,{"$error":"#DIV/0!"},null,0,0]
[{"$nulls":9},"VALOR TOTAL DO SRP",null,null,null,{"$f":"SUM(N11:N48)","v":0}]
[null,"Obs.: Os valores estão apresentados com apenas 2 casas decimais, mas os valores da presente planilha foram calculados utilizando a precisão de 6 casa decimais. "]

{"sheet":"7.CAPELINHA","index":6,"n_rows":50,"n_cols":15,"rows_kept":50,"cut":false,"hidden":false,"merged":[[42,4,42,7],[43,4,43,7],[44,4,44,7],[45,4,45,7],[46,4,46,7],[47,4,47,7],[34,4,34,7],[35,4,35,7],[37,4,37,7],[39,4,39,7],[40,4,40,7],[41,4,41,7],[26,4,26,7],[28,4,28,7],[29,4,29,7],[30,4,30,7],[31,4,31,7],[33,4,33,7],[19,4,19,7],[20,4,20,7],[21,4,21,7],[23,4,23,7],[24,4,24,7],[25,4,25,7],[10,4,10,7],[11,4,11,7],[13,4,13,7],[14,4,14,7],[16,4,16,7],[18,4,18,7],[1,1,3,11],[4,1,4,13],[5,1,8,1],[5,2,8,2],[5,3,8,3],[5,4,8,7],[6,9,7,9],[6,12,8,12],[6,13,8,13]]}
[null,"CONTRATAÇÃO DE SERVIÇOS DE EXECUÇÃO DE CAPA ASFÁLTICA COM CONCRETO BETUMINOSO USINADO A QUENTE (CBUQ) EM VIAS URBANAS E RURAIS INSERIDAS NA ÁREA DE ATUAÇÃO DA 1ª SUPERINTENDÊNCIA REGIONAL DA CODEVASF, NO ESTADO DE MINAS GERAIS - ITEM X - REGIÃO: XXXXXXXXXXXX/MG",{"$nulls":11},"xxxxxxxxxxxx"]
[null,"LOGOTIPO DA EMPRESA"]
[]
[{"$nulls":12},"Data base do orçamento: ","2024-08-01"]
[null,"CONTRATAÇÃO DE SERVIÇOS DE EXECUÇÃO DE CAPA ASFÁLTICA COM CONCRETO BETUMINOSO USINADO A QUENTE (CBUQ) EM VIAS URBANAS E RURAIS INSERIDAS NA ÁREA DE ATUAÇÃO DA 1ª SUPERINTENDÊNCIA REGIONAL DA CODEVASF, NO ESTADO DE MINAS GERAIS - ITEM 7 - REGIÃO: CAPELINHA/MG"]
[null,"ITEM","ORIGEM\nCOMPOSIÇÃO","CÓDIGO\nCOMPOSIÇÃO","DISCRIMINAÇÃO DOS SERVIÇOS",null,null,null,"BDI =",{"$f":"BDI!C16","v":0},"BDI  DIFERENCIADO:",{"$f":"BDI!C31","v":0},"R$/m² =",{"$f":"N49/I8","v":0}]
[{"$nulls":8},"Total de m²","Encargos Sociais:","Horista R$","Mensalista R$","PREÇO UNITÁRIO COM BDI","PREÇO TOTAL COM BDI "]
[{"$nulls":8},84000,null,{"$f":"'ENC. SOCIAIS'!$E$47","v":0},{"$f":"'ENC. SOCIAIS'!$F$47","v":0}]
[{"$nulls":8},"UND","QTDE.","BDI","PREÇO UNITÁRIO "]
[{"$nulls":4},"MOBILIZAÇÃO/DESMOBILIZAÇÃO"]
[{"$f":"VLOOKUP(N11,'7.CAPELINHA'!$O$11:$P$45,2,0)","v":0},1,"Codevasf","Mob","Mobilização",null,null,null,"kmxfrente",540,{"$f":"(M11/L11-1)","v":{"$error":"#DIV/0!"}},null,{"$f":"L11*(1+$J$6)","v":0},{"$f":"ROUND(ROUND(J11,2)*ROUND(M11,6),2)","v":0},{"$f":"N11/N49","v":{"$error":"#DIV/0!"}}]
[{"$f":"VLOOKUP(N12,'7.CAPELINHA'!$O$11:$P$45,2,0)","v":0},2,"Codevasf","Mob","Desmobilização",null,null,null,"kmxfrente",540,{"$f":"(M12/L12-1)","v":{"$error":"#DIV/0!"}},null,{"$f":"L12*(1+$J$6)","v":0},{"$f":"ROUND(ROUND(J12,2)*ROUND(M12,6),2)","v":0},{"$f":"N12/$N$49","v":{"$error":"#DIV/0!"}}]
[{"$nulls":4},"INSTALAÇÃO DE CANTEIRO"]
[{"$f":"VLOOKUP(#REF!,'7.CAPELINHA'!$O$11:$P$45,2,0)","v":{"$error":"#REF!"}},3,"Codevasf","Canteiro","Canteiro de Obras",null,null,null,"frente",6,{"$f":"(M14/L14-1)","v":{"$error":"#DIV/0!"}},null,{"$f":"L14*(1+$J$6)","v":0},{"$f":"ROUND(ROUND(J14,2)*ROUND(M14,6),2)","v":0},{"$f":"N14/J20","v":0}]
[{"$f":"VLOOKUP(N14,'7.CAPELINHA'!$O$11:$P$45,2,0)","v":0},4,"SINAPI",103689,"Fornecimento e instalação de placa de obra com chapa galvanizada e estrutura de madeira",null,null,null,"m²",96,{"$f":"(M15/L15-1)","v":{"$error":"#DIV/0!"}},null,0,{"$f":"ROUND(ROUND(J15,2)*ROUND(M15,6),2)","v":0}]
[{"$nulls":4},"ADMINISTRAÇÃO LOCAL DA OBRA"]
[null,5,"Codevasf","Adm Local","Administração Local da Obra",null,null,null,"und",1,{"$f":"(M17/L17-1)","v":{"$error":"#DIV/0!"}},null,{"$f":"L17*(1+$J$6)","v":0},{"$f":"ROUND(ROUND(J17,2)*ROUND(M17,6),2)","v":0},{"$f":"N17/N49","v":{"$error":"#DIV/0!"}}]
[{"$f":"VLOOKUP(N18,'7.CAPELINHA'!$O$11:$P$45,2,0)","v":0},null,null,null,"PAVIMENTAÇÃO"]
[{"$f":"VLOOKUP(N19,'7.CAPELINHA'!$O$11:$P$45,2,0)","v":0},6,"SICRO",4011463,"Concreto asfáltico - faixa C - areia e brita comerciais",null,null,null,"t",10080,{"$f":"(M19/L19-1)","v":{"$error":"#DIV/0!"}},null,{"$f":"L19*(1+$J$6)","v":0},{"$f":"ROUND(ROUND(J19,2)*ROUND(M19,6),2)","v":0}]
[{"$f":"VLOOKUP(N20,'7.CAPELINHA'!$O$11:$P$45,2,0)","v":0},7,"SICRO",4011353,"Pintura de ligação",null,null,null,"m²",84000,{"$error":"#DIV/0!"},null,0,0]
[{"$f":"VLOOKUP(N21,'7.CAPELINHA'!$O$11:$P$45,2,0)","v":0},8,"SICRO",4915663,"Fresagem descontínua de revestimento asfáltico - espessura de 5 cm",null,null,null,"m³",420,{"$error":"#DIV/0!"},null,0,0]
[{"$f":"VLOOKUP(N22,'7.CAPELINHA'!$O$11:$P$45,2,0)","v":0},9,"SICRO",4915618,"Recomposição de camada granular do pavimento com material de jazida",null,null,null,"m²",8400,{"$error":"#DIV/0!"},null,0,0]
[{"$f":"VLOOKUP(N23,'7.CAPELINHA'!$O$11:$P$45,2,0)","v":0},null,null,null,"AQUISIÇÃO E TRANSPORTE DO MATERIAL BETUMINOSO"]
[{"$f":"VLOOKUP(N24,'7.CAPELINHA'!$O$11:$P$45,2,0)","v":0},10,"CODEVASF","CPU-13","AQUISIÇÃO DE CIMENTO ASFALTICO CAP 50/70",null,null,null,"t",637.36,{"$f":"(M24/L24-1)","v":{"$error":"#DIV/0!"}},null,{"$f":"L24*(1+$L$6)","v":0},{"$f":"ROUND(ROUND(J24,2)*ROUND(M24,6),2)","v":0}]
[{"$f":"VLOOKUP(N25,'7.CAPELINHA'!$O$11:$P$45,2,0)","v":0},11,"CODEVASF","CPU-17","TRANSPORTE CAP 50/70",null,null,null,"t",637.36,{"$error":"#DIV/0!"},null,{"$f":"L25*(1+$L$6)","v":0},0]
[{"$f":"VLOOKUP(N26,'7.CAPELINHA'!$O$11:$P$45,2,0)","v":0},12,"CODEVASF","CPU-15","AQUISIÇÃO DE EMULSÃO ASFÁLTICA RR-1C",null,null,null,"t",37.799999999999997,{"$error":"#DIV/0!"},null,0,0]
[{"$f":"VLOOKUP(N27,'7.CAPELINHA'!$O$11:$P$45,2,0)","v":0},13,"CODEVASF","CPU-19","TRANSPORTE RR-1C",null,null,null,"t",37.799999999999997,{"$error":"#DIV/0!"},null,0,0]
[{"$f":"VLOOKUP(N28,'7.CAPELINHA'!$O$11:$P$45,2,0)","v":0},null,null,null,"SINALIZAÇÃO"]
[{"$f":"VLOOKUP(N29,'7.CAPELINHA'!$O$11:$P$45,2,0)","v":0},14,"SICRO",5213440,"Placa de regulamentação em aço D = 0,60 m - película retrorrefletiva tipo I + SI - fornecimento e implantação",null,null,null,"und",36,{"$f":"(M29/L29-1)","v":{"$error":"#DIV/0!"}},null,{"$f":"L29*(1+$J$6)","v":0},{"$f":"ROUND(ROUND(J29,2)*ROUND(M29,6),2)","v":0}]
[null,15,"SICRO",5213464,"Placa de advertência em aço, lado de 0,60 m - película retrorrefletiva tipo I + SI - fornecimento e implantação",null,null,null,"und",36,{"$error":"#DIV/0!"},null,0,0]
[{"$f":"VLOOKUP(N31,'7.CAPELINHA'!$O$11:$P$45,2,0)","v":0},16,"SICRO",5213863,"Suporte metálico galvanizado para placa de advertência ou regulamentação - lado ou diâmetro de 0,60 m - fornecimento e implantação",null,null,null,"und",72,{"$error":"#DIV/0!"},null,0,0]
[{"$f":"VLOOKUP(N32,'7.CAPELINHA'!$O$11:$P$45,2,0)","v":0},17,"SICRO",5213400,"Pintura de faixa com tinta acrílica - espessura de 0,4 mm",null,null,null,"m²",2880,{"$error":"#DIV/0!"},null,0,0]
[{"$f":"VLOOKUP(N33,'7.CAPELINHA'!$O$11:$P$45,2,0)","v":0},null,null,null,"DRENAGEM"]
[{"$f":"VLOOKUP(N34,'7.CAPELINHA'!$O$11:$P$45,2,0)","v":0},18,"SICRO",4915777,"Reassentamento manual de meio-fio com material arrancado da pista",null,null,null,"m",2400,{"$f":"(M34/L34-1)","v":{"$error":"#DIV/0!"}},null,{"$f":"L34*(1+$J$6)","v":0},{"$f":"ROUND(ROUND(J34,2)*ROUND(M34,6),2)","v":0}]
[{"$f":"VLOOKUP(N35,'7.CAPELINHA'!$O$11:$P$45,2,0)","v":0},19,"SICRO",4915708,"Limpeza de sarjeta e meio-fio",null,null,null,"m",2880,{"$error":"#DIV/0!"},null,0,0]
[{"$f":"VLOOKUP(N36,'7.CAPELINHA'!$O$11:$P$45,2,0)","v":0},20,"SICRO",4915724,"Caiação mecanizada com fixador de cal",null,null,null,"m²",2880,{"$error":"#DIV/0!"},null,0,0]
[{"$f":"VLOOKUP(N37,'7.CAPELINHA'!$O$11:$P$45,2,0)","v":0},null,null,null,"PROJETO EXECUTIVO"]
[{"$f":"VLOOKUP(N38,'7.CAPELINHA'!$O$11:$P$45,2,0)","v":0},21,"Codevasf","Composição Própria","Projeto Executivo",null,null,null,"m²",84000,{"$f":"(M38/L38-1)","v":{"$error":"#DIV/0!"}},null,{"$f":"L38*(1+$J$6)","v":0},{"$f":"ROUND(ROUND(J38,2)*ROUND(M38,6),2)","v":0},{"$f":"N38/N49","v":{"$error":"#DIV/0!"}}]
[{"$f":"VLOOKUP(N39,'7.CAPELINHA'!$O$11:$P$45,2,0)","v":0},null,null,null,"MOMENTO DE TRANSPORTE"]
[{"$f":"VLOOKUP(N40,'7.CAPELINHA'!$O$11:$P$45,2,0)","v":0},22,"SICRO",5914359,"Transporte com caminhão basculante de 10 m³ - rodovia em leito natural",null,null,null,"tkm",19193.14,{"$f":"(M40/L40-1)","v":{"$error":"#DIV/0!"}},null,{"$f":"L40*(1+$J$6)","v":0},{"$f":"ROUND(ROUND(J40,2)*ROUND(M40,6),2)","v":0}]
[{"$f":"VLOOKUP(N41,'7.CAPELINHA'!$O$11:$P$45,2,0)","v":0},23,"SICRO",5914374,"Transporte com caminhão basculante de 10 m³ - rodovia em revestimento primário",null,null,null,"tkm",19193.14,{"$error":"#DIV/0!"},null,0,0]
[{"$f":"VLOOKUP(N42,'7.CAPELINHA'!$O$11:$P$45,2,0)","v":0},24,"SICRO",5914389,"Transporte com caminhão basculante de 10 m³ - rodovia pavimentada",null,null,null,"tkm",915171.35,{"$error":"#DIV/0!"},null,0,0]
[{"$f":"VLOOKUP(N43,'7.CAPELINHA'!$O$11:$P$45,2,0)","v":0},25,"SICRO",5914364,"Transporte de cimento ou cal hidratada a granel com caminhão silo de 30 m³ - rodovia em leito natural",null,null,null,"tkm",462.26,{"$error":"#DIV/0!"},null,0,0]
[{"$f":"VLOOKUP(N44,'7.CAPELINHA'!$O$11:$P$45,2,0)","v":0},26,"SICRO",5914365,"Transporte de cimento ou cal hidratada a granel com caminhão silo de 30 m³ - rodovia em revestimento primário",null,null,null,"tkm",462.26,{"$error":"#DIV/0!"},null,0,0]
[{"$f":"VLOOKUP(N45,'7.CAPELINHA'!$O$11:$P$45,2,0)","v":0},27,"SICRO",5914366,"Transporte de cimento ou cal hidratada a granel com caminhão silo de 30 m³ - rodovia pavimentada",null,null,null,"tkm",4622.6099999999997,{"$error":"#DIV/0!"},null,0,0]
[{"$f":"VLOOKUP(N46,'7.CAPELINHA'!$O$11:$P$45,2,0)","v":0},28,"SICRO",5914314,"Transporte com caminhão basculante de 6 m³ - rodovia em leito natural",null,null,null,"tkm",173.29,{"$error":"#DIV/0!"},null,0,0]
[{"$f":"VLOOKUP(N47,'7.CAPELINHA'!$O$11:$P$45,2,0)","v":0},29,"SICRO",5914329,"Transporte com caminhão basculante de 6 m³ - rodovia em revestimento primário",null,null,null,"tkm",173.29,{"$error":"#DIV/0!"},null,0,0]
[{"$f":"VLOOKUP(N48,'7.CAPELINHA'!$O$11:$P$45,2,0)","v":0},30,"SICRO",5914344,"Transporte com caminhão basculante de 6 m³ - rodovia pavimentada",null,null,null,"tkm",13863.02,{"$error":"#DIV/0!"},null,0,0]
[{"$nulls":9},"VALOR TOTAL DO SRP",null,null,null,{"$f":"SUM(N11:N48)","v":0}]
[null,"Obs.: Os valores estão apresentados com apenas 2 casas decimais, mas os valores da presente planilha foram calculados utilizando a precisão de 6 casa decimais. "]

{"sheet":"8.JEQUITINHONHA","index":7,"n_rows":50,"n_cols":15,"rows_kept":50,"cut":false,"hidden":false,"merged":[[42,4,42,7],[43,4,43,7],[44,4,44,7],[45,4,45,7],[46,4,46,7],[47,4,47,7],[34,4,34,7],[35,4,35,7],[37,4,37,7],[39,4,39,7],[40,4,40,7],[41,4,41,7],[26,4,26,7],[28,4,28,7],[29,4,29,7],[30,4,30,7],[31,4,31,7],[33,4,33,7],[19,4,19,7],[20,4,20,7],[21,4,21,7],[23,4,23,7],[24,4,24,7],[25,4,25,7],[10,4,10,7],[11,4,11,7],[13,4,13,7],[14,4,14,7],[16,4,16,7],[18,4,18,7],[1,1,3,11],[4,1,4,13],[5,1,8,1],[5,2,8,2],[5,3,8,3],[5,4,8,7],[6,9,7,9],[6,12,8,12],[6,13,8,13]]}
[null,"CONTRATAÇÃO DE SERVIÇOS DE EXECUÇÃO DE CAPA ASFÁLTICA COM CONCRETO BETUMINOSO USINADO A QUENTE (CBUQ) EM VIAS URBANAS E RURAIS INSERIDAS NA ÁREA DE ATUAÇÃO DA 1ª SUPERINTENDÊNCIA REGIONAL DA CODEVASF, NO ESTADO DE MINAS GERAIS - ITEM X - REGIÃO: XXXXXXXXXXXX/MG",{"$nulls":11},"xxxxxxxxxxxx"]
[null,"LOGOTIPO DA EMPRESA"]
[]
[{"$nulls":12},"Data base do orçamento: ","2024-08-01"]
[null,"CONTRATAÇÃO DE SERVIÇOS DE EXECUÇÃO DE CAPA ASFÁLTICA COM CONCRETO BETUMINOSO USINADO A QUENTE (CBUQ) EM VIAS URBANAS E RURAIS INSERIDAS NA ÁREA DE ATUAÇÃO DA 1ª SUPERINTENDÊNCIA REGIONAL DA CODEVASF, NO ESTADO DE MINAS GERAIS - ITEM 8 - REGIÃO: JEQUITINHONHA/MG"]
[null,"ITEM","ORIGEM\nCOMPOSIÇÃO","CÓDIGO\nCOMPOSIÇÃO","DISCRIMINAÇÃO DOS SERVIÇOS",null,null,null,"BDI =",{"$f":"BDI!C16","v":0},"BDI  DIFERENCIADO:",{"$f":"BDI!C31","v":0},"R$/m² =",{"$f":"N49/I8","v":0}]
[{"$nulls":8},"Total de m²","Encargos Sociais:","Horista R$","Mensalista R$","PREÇO UNITÁRIO COM BDI","PREÇO TOTAL COM BDI "]
[{"$nulls":8},112000,null,{"$f":"'ENC. SOCIAIS'!$E$47","v":0},{"$f":"'ENC. SOCIAIS'!$F$47","v":0}]
[{"$nulls":8},"UND","QTDE.","BDI","PREÇO UNITÁRIO "]
[{"$nulls":4},"MOBILIZAÇÃO/DESMOBILIZAÇÃO"]
[{"$f":"VLOOKUP(N11,'8.JEQUITINHONHA'!$O$11:$P$45,2,0)","v":0},1,"Codevasf","Mob","Mobilização",null,null,null,"kmxfrente",880,{"$f":"(M11/L11-1)","v":{"$error":"#DIV/0!"}},null,{"$f":"L11*(1+$J$6)","v":0},{"$f":"ROUND(ROUND(J11,2)*ROUND(M11,6),2)","v":0},{"$f":"N11/N49","v":{"$error":"#DIV/0!"}}]
[{"$f":"VLOOKUP(N12,'8.JEQUITINHONHA'!$O$11:$P$45,2,0)","v":0},2,"Codevasf","Mob","Desmobilização",null,null,null,"kmxfrente",880,{"$f":"(M12/L12-1)","v":{"$error":"#DIV/0!"}},null,{"$f":"L12*(1+$J$6)","v":0},{"$f":"ROUND(ROUND(J12,2)*ROUND(M12,6),2)","v":0},{"$f":"N12/$N$49","v":{"$error":"#DIV/0!"}}]
[{"$nulls":4},"INSTALAÇÃO DE CANTEIRO"]
[{"$f":"VLOOKUP(#REF!,'8.JEQUITINHONHA'!$O$11:$P$45,2,0)","v":{"$error":"#REF!"}},3,"Codevasf","Canteiro","Canteiro de Obras",null,null,null,"frente",8,{"$f":"(M14/L14-1)","v":{"$error":"#DIV/0!"}},null,{"$f":"L14*(1+$J$6)","v":0},{"$f":"ROUND(ROUND(J14,2)*ROUND(M14,6),2)","v":0},{"$f":"N14/J20","v":0}]
[{"$f":"VLOOKUP(N14,'8.JEQUITINHONHA'!$O$11:$P$45,2,0)","v":0},4,"SINAPI",103689,"Fornecimento e instalação de placa de obra com chapa galvanizada e estrutura de madeira",null,null,null,"m²",128,{"$f":"(M15/L15-1)","v":{"$error":"#DIV/0!"}},null,0,{"$f":"ROUND(ROUND(J15,2)*ROUND(M15,6),2)","v":0}]
[{"$nulls":4},"ADMINISTRAÇÃO LOCAL DA OBRA"]
[null,5,"Codevasf","Adm Local","Administração Local da Obra",null,null,null,"und",1,{"$f":"(M17/L17-1)","v":{"$error":"#DIV/0!"}},null,{"$f":"L17*(1+$J$6)","v":0},{"$f":"ROUND(ROUND(J17,2)*ROUND(M17,6),2)","v":0},{"$f":"N17/N49","v":{"$error":"#DIV/0!"}}]
[{"$f":"VLOOKUP(N18,'8.JEQUITINHONHA'!$O$11:$P$45,2,0)","v":0},null,null,null,"PAVIMENTAÇÃO"]
[{"$f":"VLOOKUP(N19,'8.JEQUITINHONHA'!$O$11:$P$45,2,0)","v":0},6,"SICRO",4011463,"Concreto asfáltico - faixa C - areia e brita comerciais",null,null,null,"t",13440,{"$f":"(M19/L19-1)","v":{"$error":"#DIV/0!"}},null,{"$f":"L19*(1+$J$6)","v":0},{"$f":"ROUND(ROUND(J19,2)*ROUND(M19,6),2)","v":0}]
[{"$f":"VLOOKUP(N20,'8.JEQUITINHONHA'!$O$11:$P$45,2,0)","v":0},7,"SICRO",4011353,"Pintura de ligação",null,null,null,"m²",112000,{"$error":"#DIV/0!"},null,0,0]
[{"$f":"VLOOKUP(N21,'8.JEQUITINHONHA'!$O$11:$P$45,2,0)","v":0},8,"SICRO",4915663,"Fresagem descontínua de revestimento asfáltico - espessura de 5 cm",null,null,null,"m³",560,{"$error":"#DIV/0!"},null,0,0]
[{"$f":"VLOOKUP(N22,'8.JEQUITINHONHA'!$O$11:$P$45,2,0)","v":0},9,"SICRO",4915618,"Recomposição de camada granular do pavimento com material de jazida",null,null,null,"m²",11200,{"$error":"#DIV/0!"},null,0,0]
[{"$f":"VLOOKUP(N23,'8.JEQUITINHONHA'!$O$11:$P$45,2,0)","v":0},null,null,null,"AQUISIÇÃO E TRANSPORTE DO MATERIAL BETUMINOSO"]
[{"$f":"VLOOKUP(N24,'8.JEQUITINHONHA'!$O$11:$P$45,2,0)","v":0},10,"CODEVASF","CPU-13","AQUISIÇÃO DE CIMENTO ASFALTICO CAP 50/70",null,null,null,"t",849.81,{"$f":"(M24/L24-1)","v":{"$error":"#DIV/0!"}},null,{"$f":"L24*(1+$L$6)","v":0},{"$f":"ROUND(ROUND(J24,2)*ROUND(M24,6),2)","v":0}]
[{"$f":"VLOOKUP(N25,'8.JEQUITINHONHA'!$O$11:$P$45,2,0)","v":0},11,"CODEVASF","CPU-17","TRANSPORTE CAP 50/70",null,null,null,"t",849.81,{"$error":"#DIV/0!"},null,{"$f":"L25*(1+$L$6)","v":0},0]
[{"$f":"VLOOKUP(N26,'8.JEQUITINHONHA'!$O$11:$P$45,2,0)","v":0},12,"CODEVASF","CPU-15","AQUISIÇÃO DE EMULSÃO ASFÁLTICA RR-1C",null,null,null,"t",50.4,{"$error":"#DIV/0!"},null,0,0]
[{"$f":"VLOOKUP(N27,'8.JEQUITINHONHA'!$O$11:$P$45,2,0)","v":0},13,"CODEVASF","CPU-19","TRANSPORTE RR-1C",null,null,null,"t",50.4,{"$error":"#DIV/0!"},null,0,0]
[{"$f":"VLOOKUP(N28,'8.JEQUITINHONHA'!$O$11:$P$45,2,0)","v":0},null,null,null,"SINALIZAÇÃO"]
[{"$f":"VLOOKUP(N29,'8.JEQUITINHONHA'!$O$11:$P$45,2,0)","v":0},14,"SICRO",5213440,"Placa de regulamentação em aço D = 0,60 m - película retrorrefletiva tipo I + SI - fornecimento e implantação",null,null,null,"und",48,{"$f":"(M29/L29-1)","v":{"$error":"#DIV/0!"}},null,{"$f":"L29*(1+$J$6)","v":0},{"$f":"ROUND(ROUND(J29,2)*ROUND(M29,6),2)","v":0}]
[null,15,"SICRO",5213464,"Placa de advertência em aço, lado de 0,60 m - película retrorrefletiva tipo I + SI - fornecimento e implantação",null,null,null,"und",48,{"$error":"#DIV/0!"},null,0,0]
[{"$f":"VLOOKUP(N31,'8.JEQUITINHONHA'!$O$11:$P$45,2,0)","v":0},16,"SICRO",5213863,"Suporte metálico galvanizado para placa de advertência ou regulamentação - lado ou diâmetro de 0,60 m - fornecimento e implantação",null,null,null,"und",96,{"$error":"#DIV/0!"},null,0,0]
[{"$f":"VLOOKUP(N32,'8.JEQUITINHONHA'!$O$11:$P$45,2,0)","v":0},17,"SICRO",5213400,"Pintura de faixa com tinta acrílica - espessura de 0,4 mm",null,null,null,"m²",3840,{"$error":"#DIV/0!"},null,0,0]
[{"$f":"VLOOKUP(N33,'8.JEQUITINHONHA'!$O$11:$P$45,2,0)","v":0},null,null,null,"DRENAGEM"]
[{"$f":"VLOOKUP(N34,'8.JEQUITINHONHA'!$O$11:$P$45,2,0)","v":0},18,"SICRO",4915777,"Reassentamento manual de meio-fio com material arrancado da pista",null,null,null,"m",3200,{"$f":"(M34/L34-1)","v":{"$error":"#DIV/0!"}},null,{"$f":"L34*(1+$J$6)","v":0},{"$f":"ROUND(ROUND(J34,2)*ROUND(M34,6),2)","v":0}]
[{"$f":"VLOOKUP(N35,'8.JEQUITINHONHA'!$O$11:$P$45,2,0)","v":0},19,"SICRO",4915708,"Limpeza de sarjeta e meio-fio",null,null,null,"m",3840,{"$error":"#DIV/0!"},null,0,0]
[{"$f":"VLOOKUP(N36,'8.JEQUITINHONHA'!$O$11:$P$45,2,0)","v":0},20,"SICRO",4915724,"Caiação mecanizada com fixador de cal",null,null,null,"m²",3840,{"$error":"#DIV/0!"},null,0,0]
[{"$f":"VLOOKUP(N37,'8.JEQUITINHONHA'!$O$11:$P$45,2,0)","v":0},null,null,null,"PROJETO EXECUTIVO"]
[{"$f":"VLOOKUP(N38,'8.JEQUITINHONHA'!$O$11:$P$45,2,0)","v":0},21,"Codevasf","Composição Própria","Projeto Executivo",null,null,null,"m²",112000,{"$f":"(M38/L38-1)","v":{"$error":"#DIV/0!"}},null,{"$f":"L38*(1+$J$6)","v":0},{"$f":"ROUND(ROUND(J38,2)*ROUND(M38,6),2)","v":0},{"$f":"N38/N49","v":{"$error":"#DIV/0!"}}]
[{"$f":"VLOOKUP(N39,'8.JEQUITINHONHA'!$O$11:$P$45,2,0)","v":0},null,null,null,"MOMENTO DE TRANSPORTE"]
[{"$f":"VLOOKUP(N40,'8.JEQUITINHONHA'!$O$11:$P$45,2,0)","v":0},22,"SICRO",5914359,"Transporte com caminhão basculante de 10 m³ - rodovia em leito natural",null,null,null,"tkm",20762.169999999998,{"$f":"(M40/L40-1)","v":{"$error":"#DIV/0!"}},null,{"$f":"L40*(1+$J$6)","v":0},{"$f":"ROUND(ROUND(J40,2)*ROUND(M40,6),2)","v":0}]
[{"$f":"VLOOKUP(N41,'8.JEQUITINHONHA'!$O$11:$P$45,2,0)","v":0},23,"SICRO",5914374,"Transporte com caminhão basculante de 10 m³ - rodovia em revestimento primário",null,null,null,"tkm",20762.169999999998,{"$error":"#DIV/0!"},null,0,0]
[{"$f":"VLOOKUP(N42,'8.JEQUITINHONHA'!$O$11:$P$45,2,0)","v":0},24,"SICRO",5914389,"Transporte com caminhão basculante de 10 m³ - rodovia pavimentada",null,null,null,"tkm",1171941.69,{"$error":"#DIV/0!"},null,0,0]
[{"$f":"VLOOKUP(N43,'8.JEQUITINHONHA'!$O$11:$P$45,2,0)","v":0},25,"SICRO",5914364,"Transporte de cimento ou cal hidratada a granel com caminhão silo de 30 m³ - rodovia em leito natural",null,null,null,"tkm",616.35,{"$error":"#DIV/0!"},null,0,0]
[{"$f":"VLOOKUP(N44,'8.JEQUITINHONHA'!$O$11:$P$45,2,0)","v":0},26,"SICRO",5914365,"Transporte de cimento ou cal hidratada a granel com caminhão silo de 30 m³ - rodovia em revestimento primário",null,null,null,"tkm",616.35,{"$error":"#DIV/0!"},null,0,0]
[{"$f":"VLOOKUP(N45,'8.JEQUITINHONHA'!$O$11:$P$45,2,0)","v":0},27,"SICRO",5914366,"Transporte de cimento ou cal hidratada a granel com caminhão silo de 30 m³ - rodovia pavimentada",null,null,null,"tkm",6163.48,{"$error":"#DIV/0!"},null,0,0]
[{"$f":"VLOOKUP(N46,'8.JEQUITINHONHA'!$O$11:$P$45,2,0)","v":0},28,"SICRO",5914314,"Transporte com caminhão basculante de 6 m³ - rodovia em leito natural",null,null,null,"tkm",231.05,{"$error":"#DIV/0!"},null,0,0]
[{"$f":"VLOOKUP(N47,'8.JEQUITINHONHA'!$O$11:$P$45,2,0)","v":0},29,"SICRO",5914329,"Transporte com caminhão basculante de 6 m³ - rodovia em revestimento primário",null,null,null,"tkm",231.05,{"$error":"#DIV/0!"},null,0,0]
[{"$f":"VLOOKUP(N48,'8.JEQUITINHONHA'!$O$11:$P$45,2,0)","v":0},30,"SICRO",5914344,"Transporte com caminhão basculante de 6 m³ - rodovia pavimentada",null,null,null,"tkm",18484.03,{"$error":"#DIV/0!"},null,0,0]
[{"$nulls":9},"VALOR TOTAL DO SRP",null,null,null,{"$f":"SUM(N11:N48)","v":0}]
[null,"Obs.: Os valores estão apresentados com apenas 2 casas decimais, mas os valores da presente planilha foram calculados utilizando a precisão de 6 casa decimais. "]

{"sheet":"CRONOG","index":8,"n_rows":36,"n_cols":17,"rows_kept":36,"cut":false,"hidden":false,"merged":[[0,0,0,14],[26,0,26,1],[1,0,1,14],[2,0,2,14],[23,0,23,1],[24,0,24,1],[25,0,25,1]]}
["LOGOTIPO DA EMPRESA"]
["CONTRATAÇÃO DE SERVIÇOS DE EXECUÇÃO DE CAPA ASFÁLTICA COM CONCRETO BETUMINOSO USINADO A QUENTE (CBUQ) EM VIAS URBANAS E RURAIS INSERIDAS NA ÁREA DE ATUAÇÃO DA 1ª SUPERINTENDÊNCIA REGIONAL DA CODEVASF, NO ESTADO DE MINAS GERAIS - ITEM X - REGIÃO: XXXXXXXXXXXX/MG"]
["Cronograma Físico e Financeiro "]
["Item","Descrição","Total Por Etapa","30 DIAS","60 DIAS","90 DIAS","120 DIAS","150 DIAS","180 DIAS","210 DIAS","240 DIAS","270 DIAS","300 DIAS","330 DIAS","360 DIAS"]
[null,{"$f":"'1.MONTES CLAROS'!E10","v":"MOBILIZAÇÃO/DESMOBILIZAÇÃO"},{"$f":"SUM(D5:O5)","v":0}]
[null,null,{"$f":"SUM('1.MONTES CLAROS'!N11:N12)","v":0},{"$nulls":12},{"$f":"SUM(D6:O6)","v":0},{"$f":"IF(P6=C6,\"OK\",\"\")","v":"OK"}]
[null,{"$f":"'1.MONTES CLAROS'!E13","v":"INSTALAÇÃO DE CANTEIRO"},{"$f":"SUM(D7:O7)","v":0}]
[null,null,{"$f":"SUM('1.MONTES CLAROS'!N14:N15)","v":0},{"$nulls":12},{"$f":"SUM(D8:O8)","v":0},{"$f":"IF(P8=C8,\"OK\",\"\")","v":"OK"}]
[null,{"$f":"'1.MONTES CLAROS'!E16","v":"ADMINISTRAÇÃO LOCAL DA OBRA"},{"$f":"SUM(D9:O9)","v":0}]
[null,null,{"$f":"SUM('1.MONTES CLAROS'!N17)","v":0},{"$nulls":12},{"$f":"SUM(D10:O10)","v":0},{"$f":"IF(P10=C10,\"OK\",\"\")","v":"OK"}]
[null,{"$f":"'1.MONTES CLAROS'!E18","v":"PAVIMENTAÇÃO"},{"$f":"SUM(D11:O11)","v":0}]
[null,null,{"$f":"SUM('1.MONTES CLAROS'!N19:N22)","v":0},{"$nulls":12},{"$f":"SUM(D12:O12)","v":0},{"$f":"IF(P12=C12,\"OK\",\"\")","v":"OK"}]
[null,{"$f":"'1.MONTES CLAROS'!E23","v":"AQUISIÇÃO E TRANSPORTE DO MATERIAL BETUMINOSO"},{"$f":"SUM(D13:O13)","v":0}]
[null,null,{"$f":"SUM('1.MONTES CLAROS'!N24:N27)","v":0},{"$nulls":12},{"$f":"SUM(D14:O14)","v":0},{"$f":"IF(P14=C14,\"OK\",\"\")","v":"OK"}]
[null,{"$f":"'1.MONTES CLAROS'!E28","v":"SINALIZAÇÃO"},{"$f":"SUM(D15:O15)","v":0}]
[null,null,{"$f":"SUM('1.MONTES CLAROS'!N29:N32)","v":0},{"$nulls":12},{"$f":"SUM(D16:O16)","v":0},{"$f":"IF(P16=C16,\"OK\",\"\")","v":"OK"}]
[null,{"$f":"'1.MONTES CLAROS'!E33","v":"DRENAGEM"},{"$f":"SUM(D17:O17)","v":0}]
[null,null,{"$f":"SUM('1.MONTES CLAROS'!N34:N36)","v":0},{"$nulls":12},{"$f":"SUM(D18:O18)","v":0},{"$f":"IF(P18=C18,\"OK\",\"\")","v":"OK"}]
[null,{"$f":"'1.MONTES CLAROS'!E37","v":"PROJETO EXECUTIVO"},{"$f":"SUM(D19:O19)","v":0}]
[null,null,{"$f":"SUM('1.MONTES CLAROS'!N38)","v":0},{"$nulls":12},{"$f":"SUM(D20:O20)","v":0},{"$f":"IF(P20=C20,\"OK\",\"\")","v":"OK"}]
[null,{"$f":"'1.MONTES CLAROS'!E39","v":"MOMENTO DE TRANSPORTE"},{"$f":"SUM(D21:O21)","v":0}]
[null,null,{"$f":"SUM('1.MONTES CLAROS'!N40:N48)","v":0},{"$nulls":12},{"$f":"SUM(D22:O22)","v":0},{"$f":"IF(P22=C22,\"OK\",\"\")","v":"OK"}]
[]
["Porcentagem",null,null,{"$f":"SUM(D6+D8+D10+D12+D14+D16+D18+D20+D22)/$O$29","v":{"$error":"#DIV/0!"}},{"$f":"SUM(E6+E8+E10+E12+E14+E16+E18+E20+E22)/$O$29","v":{"$error":"#DIV/0!"}},{"$error":"#DIV/0!"},{"$error":"#DIV/0!"},{"$error":"#DIV/0!"},{"$error":"#DIV/0!"},{"$error":"#DIV/0!"},{"$error":"#DIV/0!"},{"$error":"#DIV/0!"},{"$error":"#DIV/0!"},{"$error":"#DIV/0!"},{"$error":"#DIV/0!"}]
["Custo",null,null,{"$f":"$O$29*D24","v":{"$error":"#DIV/0!"}},{"$f":"$O$29*E24","v":{"$error":"#DIV/0!"}},{"$f":"$O$29*F24","v":{"$error":"#DIV/0!"}},{"$error":"#DIV/0!"},{"$error":"#DIV/0!"},{"$error":"#DIV/0!"},{"$error":"#DIV/0!"},{"$error":"#DIV/0!"},{"$error":"#DIV/0!"},{"$error":"#DIV/0!"},{"$error":"#DIV/0!"},{"$error":"#DIV/0!"}]
["Porcentagem Acumulado",null,null,{"$f":"D24","v":{"$error":"#DIV/0!"}},{"$f":"D26+E24","v":{"$error":"#DIV/0!"}},{"$f":"E26+F24","v":{"$error":"#DIV/0!"}},{"$error":"#DIV/0!"},{"$error":"#DIV/0!"},{"$error":"#DIV/0!"},{"$error":"#DIV/0!"},{"$error":"#DIV/0!"},{"$error":"#DIV/0!"},{"$error":"#DIV/0!"},{"$error":"#DIV/0!"},{"$f":"N26+O24","v":{"$error":"#DIV/0!"}}]
["Custo Acumulado",null,null,{"$f":"D25","v":{"$error":"#DIV/0!"}},{"$f":"D27+E25","v":{"$error":"#DIV/0!"}},{"$error":"#DIV/0!"},{"$error":"#DIV/0!"},{"$error":"#DIV/0!"},{"$error":"#DIV/0!"},{"$error":"#DIV/0!"},{"$error":"#DIV/0!"},{"$error":"#DIV/0!"},{"$error":"#DIV/0!"},{"$error":"#DIV/0!"},{"$error":"#DIV/0!"}]
[]
[null,null,null,"Total Geral",{"$nulls":9},"R$",{"$f":"C6+C8+C10+C12+C14+C16+C18+C20+C22","v":0}]
[]
[]
[{"$nulls":14},{"$f":"O27-O29","v":{"$error":"#DIV/0!"}}]
[]
[{"$nulls":14},{"$f":"'1.MONTES CLAROS'!N49","v":0}]
[]
[{"$nulls":14},{"$f":"O29-O34","v":0}]

{"sheet":"MOB","index":9,"n_rows":67,"n_cols":9,"rows_kept":67,"cut":false,"hidden":false,"merged":[[0,0,2,7],[3,0,3,7],[4,0,8,4],[5,5,6,6],[5,7,6,7],[7,5,8,6],[7,7,8,7],[4,5,4,6],[10,6,10,7],[60,0,60,1],[10,0,11,0],[10,1,11,1],[10,2,11,2],[10,3,11,3],[10,4,11,4],[10,5,11,5]]}
["LOGOTIPO DA EMPRESA"]
[]
[]
["CONTRATAÇÃO DE SERVIÇOS DE EXECUÇÃO DE CAPA ASFÁLTICA COM CONCRETO BETUMINOSO USINADO A QUENTE (CBUQ) EM VIAS URBANAS E RURAIS INSERIDAS NA ÁREA DE ATUAÇÃO DA 1ª SUPERINTENDÊNCIA REGIONAL DA CODEVASF, NO ESTADO DE MINAS GERAIS - ITEM X - REGIÃO: XXXXXXXXXXXX/MG"]
["MOBILIZAÇÃO/DESMOBILIZAÇÃO (MOB)",{"$nulls":4},"Frentes de serviços"]
[{"$nulls":5},"Distância da Capital ao Canteiro:",null,null,"Fica a cargo de cada SR colocar a distancia adequada de acordo com o historico de mobilização"]
[]
[{"$nulls":5},"Velocidade média de transporte (pavim.):"]
[]
["Transporte dos equipamentos"]
["CODIGO","EQUIPAMENTO","VEÍCULO TRANSPORTADOR","QTDE","K","FU","CUSTO DO TRANSPORTE"]
[{"$nulls":6},"(R$/h)","(R$)/km"]
["E9524","Motoniveladora - 93 kW","E9665",{"$nulls":4},{"$f":"((D13*E13*F13)/$H$8)*G13","v":{"$error":"#DIV/0!"}}]
["E9526","Retroescavadeira de pneus - capacidade da caçamba da pá-carregadeira de 0,76 m³ e da retroescavadeira de 0,29 m³ - 58 kW ","E9665",{"$nulls":4},{"$f":"((D14*E14*F14)/$H$8)*G14","v":{"$error":"#DIV/0!"}}]
["E9577","Trator agrícola sobre pneus - 77 kW","E9665",{"$nulls":4},{"$error":"#DIV/0!"}]
["E9518","Grade de 24 discos rebocável de D = 60 cm (24\")","Veículo(s) da própria frota.",{"$nulls":4},{"$error":"#DIV/0!"}]
["E9615","Usina misturadora de solos com capacidade de 300 t/h - 44 kW","E9018",{"$nulls":4},{"$error":"#DIV/0!"}]
["E9689","Usina de asfalto a quente gravimétrica com capacidade de 100/140 t/h - 260 kW","E9666",{"$nulls":4},{"$error":"#DIV/0!"}]
["E9530","Rolo compactador liso vibratório autopropelido por pneus de 11 t - 97 kW","E9666",{"$nulls":4},{"$error":"#DIV/0!"}]
["E9558","Tanque de estocagem de asfalto com capacidade de 30.000 l","E9665",{"$nulls":4},{"$error":"#DIV/0!"}]
["E9758","Vibroacabadora de asfalto sobre pneus - 82 kW","E9018",{"$nulls":4},{"$error":"#DIV/0!"}]
["E9685","Rolo compactador pé de carneiro vibratório autopropelido por pneus de 11,6 t - 82 kW","E9666",{"$nulls":4},{"$error":"#DIV/0!"}]
["E9605","Caminhão tanque com capacidade de 6.000 l - 136 kW","E9605",{"$nulls":4},{"$error":"#DIV/0!"}]
["E9579","Caminhão basculante com capacidade de 10 m³ - 210 kW","E9579",{"$nulls":4},{"$error":"#DIV/0!"}]
["E9509","Caminhão tanque distribuidor de asfalto com capacidade de 6.000 l - 7 kW/136 kW","E9509",{"$nulls":4},{"$error":"#DIV/0!"}]
["E9762","Rolo compactador de pneus autopropelido de 27 t - 85 kW","E9666",{"$nulls":4},{"$error":"#DIV/0!"}]
["E9681","Rolo compactador liso tandem vibratório autopropelido de 10,4 t - 82 kW","E9666",{"$nulls":4},{"$error":"#DIV/0!"}]
["E9545","Vibroacabadora de asfalto sobre esteiras - 82 kW","E9018",{"$nulls":4},{"$error":"#DIV/0!"}]
["E9571","Caminhão tanque com capacidade de 10.000 l - 188 kW","E9571",{"$nulls":4},{"$error":"#DIV/0!"}]
["E9514","Distribuidor de agregados sobre pneus autopropelido - 130 kW","E9665",{"$nulls":4},{"$error":"#DIV/0!"}]
["E9511","Carregadeira de pneus com capacidade de 3,40 m³ - 195 kW","E9665",{"$nulls":4},{"$error":"#DIV/0!"}]
["E9779","Grupo gerador - 113 kVA","Veículo(s) da própria frota.",{"$nulls":4},{"$error":"#DIV/0!"}]
["E9559","Aquecedor de fluido térmico - 12 kW","Veículo(s) da própria frota.",{"$nulls":4},{"$error":"#DIV/0!"}]
["E9584","Carregadeira de pneus com capacidade de 1,72 m³ - 113 kW","E9665",{"$nulls":4},{"$error":"#DIV/0!"}]
["E9021","Grupo gerador - 456 kVA","E9508",{"$nulls":4},{"$error":"#DIV/0!"}]
["E9687","Caminhão carroceria com capacidade de 5 t - 115 kW","E9687",{"$nulls":4},{"$error":"#DIV/0!"}]
["E9667","Caminhão basculante com capacidade de 14 m³ - 210 kW","E9667",{"$nulls":4},{"$error":"#DIV/0!"}]
["E9644","Caminhão demarcador de faixas com sistema de pintura a frio - 28 kW/115 kW","E9644",{"$nulls":4},{"$error":"#DIV/0!"}]
["E9592","Caminhão carroceria com capacidade de 15 t - 188 kW","E9592",{"$nulls":4},{"$error":"#DIV/0!"}]
["E9540","Trator sobre esteiras com lâmina - 127 kW","E9018",{"$nulls":4},{"$error":"#DIV/0!"}]
["E9515","Escavadeira hidráulica sobre esteiras com caçamba com capacidade de 1,56 m³ - 118 kW","E9666",{"$nulls":4},{"$error":"#DIV/0!"}]
["E9506","Caminhão basculante com capacidade de 6 m³ - 136 kW","E9506",{"$nulls":4},{"$error":"#DIV/0!"}]
["E9256","Equipamento para pintura com cal rebocável com dois bicos aplicadores e capacidade de 2.200 l","Veículo(s) da própria frota.",{"$nulls":4},{"$error":"#DIV/0!"}]
["E9156","Soprador de ar costal - 2,6 kW","Veículo(s) da própria frota.",{"$nulls":4},{"$error":"#DIV/0!"}]
["E9146","Caminhão silo com capacidade de 30 m³ - 265 kW","E9146",{"$nulls":4},{"$error":"#DIV/0!"}]
["E9010","Balança plataforma digital à bateria, com mesa de 75 x 75 cm e capacidade de 500 kg","Veículo(s) da própria frota.",{"$nulls":4},{"$error":"#DIV/0!"}]
["E9519","Betoneira com motor a gasolina com capacidade de 600 l - 10 kW","Veículo(s) da própria frota.",{"$nulls":4},{"$error":"#DIV/0!"}]
["E9071","Transportador manual carrinho de mão com capacidade de 80 l","Veículo(s) da própria frota.",{"$nulls":4},{"$error":"#DIV/0!"}]
["E9064","Transportador manual gerica com capacidade de 180 l","Veículo(s) da própria frota.",{"$nulls":4},{"$error":"#DIV/0!"}]
["E9066","Grupo gerador - 14 kVA","Veículo(s) da própria frota.",{"$nulls":4},{"$error":"#DIV/0!"}]
["E9535","Serra circular com bancada - D = 30 cm - 4 kW","Veículo(s) da própria frota.",{"$nulls":4},{"$error":"#DIV/0!"}]
["E9507","Plotadora de recorte com computador e programa computacional","Veículo(s) da própria frota.",{"$nulls":4},{"$error":"#DIV/0!"}]
["E9568","Furadeira de impacto de 12,5 mm - 0,80 kW","Veículo(s) da própria frota.",{"$nulls":4},{"$error":"#DIV/0!"}]
["E9753","Grupo gerador - 23 kVA","Veículo(s) da própria frota.",{"$nulls":4},{"$error":"#DIV/0!"}]
["E9623","Máquina de bancada guilhotina - 4,00 kW","Veículo(s) da própria frota.",{"$nulls":4},{"$error":"#DIV/0!"}]
["E9622","Máquina de bancada universal para corte de chapa - 1,50 kW","Veículo(s) da própria frota.",{"$nulls":4},{"$error":"#DIV/0!"}]
["E9678","Fresadora a frio - 455 kW","E9666",{"$nulls":4},{"$error":"#DIV/0!"}]
[{"$nulls":6},"TOTAL",{"$f":"SUM(H13:H57)","v":{"$error":"#DIV/0!"}}]
[]
[]
["CUSTO TOTAL MOBILIZAÇÃO E DESMOBILIZAÇÃO"]
["DESCRIÇÃO","VALOR"]
["Custo Mobilização (km)",{"$f":"H58","v":{"$error":"#DIV/0!"}}]
["BDI (%)",{"$f":"BDI!C16","v":0}]
["Custo Mobilização (R$/km) com BDI",{"$f":"B63+(B63*B64)","v":{"$error":"#DIV/0!"}}]
["Total de Frentes",{"$f":"#REF!","v":{"$error":"#REF!"}}]
["Custo Mobilização (frentes x distancia)",{"$f":"B65*H6*B66","v":{"$error":"#DIV/0!"}}]

{"sheet":"CANT","index":10,"n_rows":13,"n_cols":6,"rows_kept":13,"cut":false,"hidden":false,"merged":[[0,0,2,5],[9,3,9,4],[3,0,3,5],[3,9,4,9],[4,7,4,8],[12,3,12,4]]}
["LOGOTIPO DA EMPRESA"]
[]
[]
["CANTEIRO DE OBRAS PARA CONSTRUÇAO RODOVIÁRIA"]
["Descrição dos serviços","Tipo de container","Unidade","Quantidade","Preço unitário (R$)","Total (R$)"]
["Escritório e seção técnica"]
["LOCACAO DE CONTAINER 2,30 X 6,00 M, ALT. 2,50 M, PARA ESCRITORIO, SEM DIVISORIAS INTERNAS E SEM SANITARIO (NAO INCLUI MOBILIZACAO/DESMOBILIZACAO)                                                                                                                                                                                                                                                                                                                                                         ",10776,"und",null,null,{"$f":"TRUNC(D7*E7,2)","v":0}]
["Banheiro e vestiário"]
["LOCACAO DE CONTAINER 2,30 X 4,30 M, ALT. 2,50 M, PARA SANITARIO, COM 3 BACIAS, 4 CHUVEIROS, 1 LAVATORIO E 1 MICTORIO (NAO INCLUI MOBILIZACAO/DESMOBILIZACAO)                                                                                                                                                                                                                                                                                                                                              ",10777,"und",null,null,{"$f":"TRUNC(D9*E9,2)","v":0}]
[null,null,null,"TOTAL DO CANTEIRO",null,{"$f":"SUM(F7:F9)","v":0}]
[null,null,null,"DURAÇÃO (MESES)",null,{"$f":"F10*E11","v":0}]
[null,null,null,"BDI",null,{"$f":"BDI!C16","v":0}]
[null,null,null,"TOTAL DO CANTEIRO (com BDI)",null,{"$f":"F11+(F11*F12)","v":0}]

{"sheet":"ADM.LOC","index":11,"n_rows":251,"n_cols":10,"rows_kept":251,"cut":false,"hidden":false,"merged":[[3,0,3,8],[4,3,4,4],[4,5,4,6],[4,7,4,8],[5,3,5,4],[5,5,5,6],[5,7,5,8],[8,3,8,4],[8,5,8,6],[8,7,8,8],[9,3,9,4],[9,5,9,6],[9,7,9,8],[6,3,6,4],[6,5,6,6],[6,7,6,8],[7,3,7,4],[7,5,7,6],[7,7,7,8],[12,3,12,4],[12,5,12,6],[12,7,12,8],[13,3,13,4],[13,5,13,6],[13,7,13,8],[10,3,10,4],[10,5,10,6],[10,7,10,8],[11,3,11,4],[11,5,11,6],[11,7,11,8],[16,3,16,4],[16,5,16,6],[16,7,16,8],[17,3,17,4],[17,5,17,6],[17,7,17,8],[14,3,14,4],[14,5,14,6],[14,7,14,8],[15,3,15,4],[15,5,15,6],[15,7,15,8],[20,3,20,4],[20,5,20,6],[20,7,20,8],[21,3,21,4],[21,5,21,6],[21,7,21,8],[18,3,18,4],[18,5,18,6],[18,7,18,8],[19,3,19,4],[19,5,19,6],[19,7,19,8],[24,3,24,4],[24,5,24,6],[24,7,24,8],[25,3,25,4],[25,5,25,6],[25,7,25,8],[22,3,22,4],[22,5,22,6],[22,7,22,8],[23,3,23,4],[23,5,23,6],[23,7,23,8],[28,3,28,4],[28,5,28,6],[28,7,28,8],[29,3,29,4],[29,5,29,6],[29,7,29,8],[26,3,26,4],[26,5,26,6],[26,7,26,8],[27,3,27,4],[27,5,27,6],[27,7,27,8],[52,5,52,6],[52,7,52,8],[32,0,32,8],[48,0,48,8],[49,3,49,4],[49,5,49,6],[49,7,49,8],[50,3,50,4],[50,5,50,6],[50,7,50,8],[51,3,51,4],[51,5,51,6],[51,7,51,8],[52,3,52,4],[96,0,96,8],[62,3,62,4],[62,5,62,6],[62,7,62,8],[63,3,63,4],[63,5,63,6],[63,7,63,8],[72,0,72,8],[73,3,73,4],[73,5,73,6],[73,7,73,8],[74,3,74,4],[74,5,74,6],[74,7,74,8],[75,3,75,4],[75,5,75,6],[75,7,75,8],[76,3,76,4],[76,5,76,6],[99,3,99,4],[99,5,99,6],[99,7,99,8],[100,3,100,4],[100,5,100,6],[100,7,100,8],[97,3,97,4],[97,5,97,6],[97,7,97,8],[98,3,98,4],[98,5,98,6],[98,7,98,8],[110,3,110,4],[110,5,110,6],[110,7,110,8],[111,3,111,4],[111,5,111,6],[111,7,111,8],[101,3,101,4],[101,5,101,6],[101,7,101,8],[102,5,102,6],[102,7,102,8],[109,0,109,8],[114,3,114,4],[114,5,114,6],[114,7,114,8],[115,3,115,4],[115,5,115,6],[115,7,115,8],[112,3,112,4],[112,5,112,6],[112,7,112,8],[113,3,113,4],[113,5,113,6],[113,7,113,8],[120,3,120,4],[120,5,120,6],[120,7,120,8],[121,3,121,4],[121,5,121,6],[121,7,121,8],[116,5,116,6],[116,7,116,8],[118,0,118,8],[119,3,119,4],[119,5,119,6],[119,7,119,8],[126,3,126,4],[126,5,126,6],[126,7,126,8],[127,3,127,4],[127,5,127,6],[127,7,127,8],[122,3,122,4],[122,5,122,6],[122,7,122,8],[123,5,123,6],[123,7,123,8],[125,0,125,8],[130,3,130,4],[130,5,130,6],[130,7,130,8],[131,5,131,6],[131,7,131,8],[133,0,133,8],[128,3,128,4],[128,5,128,6],[128,7,128,8],[129,3,129,4],[129,5,129,6],[129,7,129,8],[136,3,136,4],[136,5,136,6],[136,7,136,8],[137,3,137,4],[137,5,137,6],[137,7,137,8],[134,3,134,4],[134,5,134,6],[134,7,134,8],[135,3,135,4],[135,5,135,6],[135,7,135,8],[140,5,140,6],[140,7,140,8],[142,0,142,8],[143,3,143,4],[143,5,143,6],[143,7,143,8],[138,3,138,4],[138,5,138,6],[138,7,138,8],[139,3,139,4],[139,5,139,6],[139,7,139,8],[144,3,144,4],[144,5,144,6],[144,7,144,8],[147,3,147,4],[147,5,147,6],[147,7,147,8],[146,7,146,8],[145,3,145,4],[145,5,145,6],[145,7,145,8],[146,3,146,4],[146,5,146,6],[152,3,152,4],[152,5,152,6],[152,7,152,8],[153,3,153,4],[153,5,153,6],[153,7,153,8],[154,7,154,8],[148,5,148,6],[148,7,148,8],[150,0,150,8],[151,3,151,4],[151,5,151,6],[151,7,151,8],[154,3,154,4],[154,5,154,6],[157,5,157,6],[157,7,157,8],[159,0,159,8],[160,0,160,8],[161,1,161,4],[174,0,174,8],[155,3,155,4],[155,5,155,6],[155,7,155,8],[156,3,156,4],[156,5,156,6],[156,7,156,8],[195,0,195,8],[196,1,196,4],[197,1,197,4],[198,1,198,4],[201,0,201,8],[175,0,175,8],[176,1,176,4],[189,0,189,8],[190,1,190,4],[191,1,191,4],[192,1,192,4],[204,3,204,4],[204,5,204,6],[204,7,204,8],[205,3,205,4],[205,5,205,6],[205,7,205,8],[202,3,202,4],[202,5,202,6],[202,7,202,8],[203,3,203,4],[203,5,203,6],[203,7,203,8],[208,3,208,4],[208,5,208,6],[208,7,208,8],[210,3,210,4],[210,5,210,6],[210,7,210,8],[206,3,206,4],[206,5,206,6],[206,7,206,8],[207,3,207,4],[207,5,207,6],[207,7,207,8],[213,3,213,4],[213,5,213,6],[213,7,213,8],[214,3,214,4],[214,5,214,6],[214,7,214,8],[211,3,211,4],[211,5,211,6],[211,7,211,8],[212,3,212,4],[212,5,212,6],[212,7,212,8],[226,3,226,4],[226,5,226,6],[226,7,226,8],[227,3,227,4],[227,5,227,6],[227,7,227,8],[230,3,230,4],[230,5,230,6],[230,7,230,8],[229,3,229,4],[229,5,229,6],[229,7,229,8],[228,3,228,4],[228,5,228,6],[228,7,228,8],[232,3,232,4],[232,5,232,6],[232,7,232,8],[233,3,233,4],[233,5,233,6],[233,7,233,8],[231,3,231,4],[231,5,231,6],[231,7,231,8],[225,3,225,4],[225,5,225,6],[246,7,246,8],[247,3,247,4],[247,5,247,6],[247,7,247,8],[248,3,248,4],[248,5,248,6],[248,7,248,8],[244,3,244,4],[244,5,244,6],[244,7,244,8],[245,3,245,4],[245,5,245,6],[245,7,245,8],[237,3,237,4],[237,5,237,6],[237,7,237,8],[234,3,234,4],[234,5,234,6],[234,7,234,8],[235,3,235,4],[235,5,235,6],[235,7,235,8],[238,3,238,4],[238,5,238,6],[238,7,238,8],[239,3,239,4],[239,5,239,6],[239,7,239,8],[236,3,236,4],[236,5,236,6],[236,7,236,8],[249,3,249,4],[249,5,249,6],[250,3,250,4],[250,5,250,6],[240,5,240,6],[240,7,240,8],[241,3,241,4],[241,5,241,6],[241,7,241,8],[242,3,242,4],[242,5,242,6],[242,7,242,8],[243,3,243,4],[243,5,243,6],[243,7,243,8],[240,3,240,4],[225,7,225,8],[0,0,2,8],[87,3,87,4],[87,5,87,6],[87,7,87,8],[88,3,88,4],[88,5,88,6],[88,7,88,8],[89,5,89,6],[89,7,89,8],[64,3,64,4],[64,5,64,6],[64,7,64,8],[65,5,65,6],[65,7,65,8],[53,5,53,6],[53,7,53,8],[60,0,60,8],[61,3,61,4],[222,3,222,4],[222,5,222,6],[222,7,222,8],[61,5,61,6],[61,7,61,8],[224,3,224,4],[224,5,224,6],[224,7,224,8],[223,3,223,4],[76,7,76,8],[77,5,77,6],[77,7,77,8],[84,0,84,8],[85,3,85,4],[85,5,85,6],[85,7,85,8],[86,3,86,4],[86,5,86,6],[86,7,86,8],[223,5,223,6],[223,7,223,8],[215,3,215,4],[215,5,215,6],[215,7,215,8],[216,7,216,8],[220,0,220,8],[221,3,221,4],[221,5,221,6],[221,7,221,8]]}
["LOGOTIPO DA EMPRESA"]
[]
[]
["parcela fixa da administração local \n(mão de obra)"]
["Código","Discriminação ","Unidade"," Quantidade ",null,"Custo Unitário (R$)",null," Custo Total (R$)"]
[null,"Mão de Obra"]
[null,"Gerência Técnica"]
[null,"Geral"]
["P9955","Engenheiro chefe","mês",{"$nulls":4},{"$f":"F9*D9","v":0}]
["P9840","Encarregado geral","mês",{"$nulls":4},{"$f":"F10*D10","v":0}]
["P9897","Técnico de meio ambiente","mês",{"$nulls":4},{"$f":"F11*D11","v":0}]
["P9948","Motorista","mês",{"$nulls":4},{"$f":"F12*D12","v":0}]
["P9878","Secretária","mês",{"$nulls":4},{"$f":"F13*D13","v":0}]
[{"$nulls":5},"Subtotal do Item 1.1",null,{"$f":"SUM(H9:I13)","v":0}]
[null,"Auxiliar"]
["P9946","Engenheiro auxiliar","mês",{"$nulls":4},{"$f":"D16*F16","v":0}]
["P9903","Auxiliar técnico","mês",{"$nulls":4},{"$f":"D17*F17","v":0}]
[{"$nulls":5},"Subtotal do Item 1.2",null,{"$f":"SUM(H16:I17)","v":0}]
[null,"Gerência Administrativa"]
[null,"Geral"]
["P9883","Chefe do setor administrativo","mês",{"$nulls":4},{"$f":"F21*D21","v":0}]
["P9809","Encarregado administrativo","mês",{"$nulls":4},{"$f":"F22*D22","v":0}]
["P9826","Porteiro","mês",{"$nulls":4},{"$f":"F23*D23","v":0}]
["P9827","Vigia","mês",{"$nulls":4},{"$f":"F24*D24","v":0}]
["P9948","Motorista","mês",{"$nulls":4},{"$f":"F25*D25","v":0}]
[{"$nulls":5},"Subtotal do Item 1.3",null,{"$f":"SUM(H21:I25)","v":0}]
[null,"Auxiliar"]
["P9806","Auxiliar administrativo","mês",{"$nulls":4},{"$f":"F28*D28","v":0}]
["P9842","Faxineiro","mês",{"$nulls":4},{"$f":"F29*D29","v":0}]
[{"$nulls":5},"Subtotal do Item 1.4",null,{"$f":"SUM(H28:I29)","v":0}]
[{"$nulls":7},"Total da Mão de Obra da Parcela Fixa",{"$f":"H30+H26+H18+H14","v":0}]
[]
["parcela fixa da administração local \n(veículos)"]
["Código","Discriminação ","Unidade"," Quantidade ","Utilização Produtiva","Utilização Improdutiva","Custo Horário \nProdutivo (R$)","Custo Horário Improdutivo (R$)","Custo Total (R$)"]
[2,"Veículos"]
[null,"Gerência Técnica"]
["2.1","Geral"]
["E9093","Veículo Leve 53 kw","mês",{"$nulls":5},{"$f":"((E38*G38)+(F38*H38))*D38","v":0}]
["E9560","Ônibus coletivo - 175 kw","mês",{"$nulls":5},{"$f":"((E39*G39)+(F39*H39))*D39","v":0}]
[{"$nulls":7},"Subtotal do Item 2",{"$f":"SUM(I38:I39)","v":0}]
["2.2","Auxiliar"]
["E9093","Veículo Leve 53 kw","mês",null,null,null,{"$f":"G38","v":0},{"$f":"H38","v":0},{"$f":"((E42*G42)+(F42*H42))*D42","v":0}]
[{"$nulls":7},"Subtotal do Item 2",{"$f":"SUM(I42)","v":0}]
["2.3","Gerência Administrativa"]
["E9093","Veículo Leve 53 kw","mês",null,null,null,{"$f":"G38","v":0},{"$f":"H38","v":0},{"$f":"((E45*G45)+(F45*H45))*D45","v":0}]
[{"$nulls":7},"Subtotal do Item 2",{"$f":"I45","v":0}]
[{"$nulls":7},"Total dos Veículos da Parcela Fixa",{"$f":"I46+I43+I40","v":0}]
[]
["Composição de custo da equipe de produção de terraplenagem"]
["Código","Discriminação ","Unidade"," Quantidade ",null,"Custo Unitário (R$)",null," Custo Total (R$)"]
[null,"Equipe de Produção de Terraplenagem"]
["3.1","Mão de Obra"]
["P9884","Encarregado de produção ","mês",null,null,{"$f":"VLOOKUP(A53,#REF!,6,0)","v":{"$error":"#REF!"}},null,{"$f":"F53*D53","v":{"$error":"#REF!"}}]
[{"$nulls":5},"Subtotal do Item 3.1",null,{"$f":"SUM(H53:H53)","v":{"$error":"#REF!"}}]
["Código","Discriminação ","Unidade"," Quantidade ","Utilização Produtiva","Utilização Improdutiva","Custo Horário \nProdutivo (R$)","Custo Horário Improdutivo (R$)","Custo Total (R$)"]
["3.2","Veículos"]
[null,"Veículo Leve 53 kw","mês",null,null,null,{"$f":"G38","v":0},{"$f":"H38","v":0},{"$f":"((E57*G57)+(F57*H57))*D57","v":0}]
[{"$nulls":7},"Subtotal do Item 3.2",{"$f":"SUM(I57:I57)","v":0}]
[{"$nulls":7},"Total da Equipe de Produção de Terraplenagem",{"$f":"I58+H54","v":{"$error":"#REF!"}}]
[]
["Composição de custo da equipe de produção de pavimentação"]
["Código","Discriminação ","Unidade"," Quantidade ",null,"Custo Unitário (R$)",null," Custo Total (R$)"]
[null,"Equipe de Produção de Pavimentação"]
["3.1","Mão de Obra"]
["P9893","Encarregado de produção ","mês",{"$nulls":4},{"$f":"F65*D65","v":0}]
[{"$nulls":5},"Subtotal do Item 3.1",null,{"$f":"SUM(H65:H65)","v":0}]
["Código","Discriminação ","Unidade"," Quantidade ","Utilização Produtiva","Utilização Improdutiva","Custo Horário \nProdutivo (R$)","Custo Horário Improdutivo (R$)","Custo Total (R$)"]
["3.2","Veículos"]
[null,"Veículo Leve 53 kw","mês",null,null,null,{"$f":"$G$38","v":0},{"$f":"$H$38","v":0},{"$f":"((E69*G69)+(F69*H69))*D69","v":0}]
[{"$nulls":7},"Subtotal do Item 3.2",{"$f":"SUM(I69:I69)","v":0}]
[{"$nulls":7},"Total da Equipe de Produção de Pavimentação",{"$f":"I70+H66","v":0}]
[]
["Composição de custo da equipe de produção de drenagem"]
["Código","Discriminação ","Unidade"," Quantidade ",null,"Custo Unitário (R$)",null," Custo Total (R$)"]
[null,"Equipe de Produção de Pavimentação"]
["3.1","Mão de Obra"]
["P9893","Encarregado de produção ","mês",{"$nulls":4},{"$f":"F77*D77","v":0}]
[{"$nulls":5},"Subtotal do Item 3.1",null,{"$f":"SUM(H77:H77)","v":0}]
["Código","Discriminação ","Unidade"," Quantidade ","Utilização Produtiva","Utilização Improdutiva","Custo Horário \nProdutivo (R$)","Custo Horário Improdutivo (R$)","Custo Total (R$)"]
["3.2","Veículos"]
[null,"Veículo Leve 53 kw","mês",null,null,null,{"$f":"$G$38","v":0},{"$f":"$H$38","v":0},{"$f":"((E81*G81)+(F81*H81))*D81","v":0}]
[{"$nulls":7},"Subtotal do Item 3.2",{"$f":"SUM(I81:I81)","v":0}]
[{"$nulls":7},"Total da Equipe de Produção de Pavimentação",{"$f":"I82+H78","v":0}]
[]
["Composição de custo da equipe de produção de sinalização"]
["Código","Discriminação ","Unidade"," Quantidade ",null,"Custo Unitário (R$)",null," Custo Total (R$)"]
[null,"Equipe de Produção de Pavimentação"]
["3.1","Mão de Obra"]
["P9893","Encarregado de produção ","mês",{"$nulls":4},{"$f":"F89*D89","v":0}]
[{"$nulls":5},"Subtotal do Item 3.1",null,{"$f":"SUM(H89:H89)","v":0}]
["Código","Discriminação ","Unidade"," Quantidade ","Utilização Produtiva","Utilização Improdutiva","Custo Horário \nProdutivo (R$)","Custo Horário Improdutivo (R$)","Custo Total (R$)"]
["3.2","Veículos"]
[null,"Veículo Leve 53 kw","mês",null,null,null,{"$f":"$G$38","v":0},{"$f":"$H$38","v":0},{"$f":"((E93*G93)+(F93*H93))*D93","v":0}]
[{"$nulls":7},"Subtotal do Item 3.2",{"$f":"SUM(I93:I93)","v":0}]
[{"$nulls":7},"Total da Equipe de Produção de Pavimentação",{"$f":"I94+H90","v":0}]
[]
["Composição de custo da equipe topografia"]
["Código","Discriminação ","Unidade"," Quantidade ",null,"Custo Unitário (R$)",null," Custo Total (R$)"]
[null,"Equipe de Topografia"]
["3.1","Mão de Obra"]
["P9949","Topográfo","mês",{"$nulls":4},{"$f":"F101*D101","v":0}]
["P9950","Auxiliar de topografia","mês",{"$nulls":4},{"$f":"F102*D102","v":0}]
[{"$nulls":5},"Subtotal do Item 3.1",null,{"$f":"SUM(H101:I102)","v":0}]
["Código","Discriminação ","Unidade"," Quantidade ","Utilização Produtiva","Utilização Improdutiva","Custo Horário \nProdutivo (R$)","Custo Horário Improdutivo (R$)","Custo Total (R$)"]
["3.2","Veículos"]
[null,"Veículo Leve 53 kw","mês",null,null,null,{"$f":"G38","v":0},{"$f":"H38","v":0},{"$f":"((E106*G106)+(F106*H106))*D106","v":0}]
[{"$nulls":7},"Subtotal do Item 3.2",{"$f":"SUM(I106:I106)","v":0}]
[{"$nulls":7},"Total da Equipe de Produção de Topografia",{"$f":"I107+H103","v":0}]
[]
["Composição de custo do setor de medicina e segurança do trabalho"]
["Código","Discriminação ","Unidade"," Quantidade ",null,"Custo Unitário (R$)",null," Custo Total (R$)"]
[4,"Setor de Medicina e Segurança do Trabalho"]
["P9876","Técnico de segurança do trabalho","mês",{"$nulls":4},{"$f":"F113*D113","v":0}]
["P9864","Engenheiro de segurança do trabalho","mês",{"$nulls":4},{"$f":"F114*D114","v":0}]
["P9851","Médico do trabalho","mês",{"$nulls":4},{"$f":"F115*D115","v":0}]
["P9951","Médico de câmara hiperbárica","mês",{"$nulls":4},{"$f":"F116*D116","v":0}]
[{"$nulls":5},"Subtotal do Item 4",null,{"$f":"SUM(H113:I116)","v":0}]
[]
["Parcela Variável - Composição de custo da equipe de frente de serviço"]
["Código","Discriminação ","Unidade"," Quantidade ",null,"Custo Unitário (R$)",null," Custo Total (R$)"]
[5,"Equipe de Frente de Serviço","equipexmês"]
["P9875","Encarregado de Turma","mês",{"$nulls":4},{"$f":"F122*D122","v":0}]
["P9804","Apontador","mês",{"$nulls":4},{"$f":"F123*D123","v":0}]
[{"$nulls":5},"Subtotal do Item 5",null,{"$f":"SUM(H122:I123)","v":0}]
[]
["Parcela Variável - Composição de custo da equipe de frente de serviço (Terraplenagem) - Somente Compactação "]
["Código","Discriminação ","Unidade"," Quantidade ",null,"Produção Horária \n(und/h)",null,"Efs"]
["5.1","Equipe de Frente de Serviço","equipexmês"]
[null,null,"mês",{"$nulls":4},{"$f":"(D129)/(F129*182.49)","v":{"$error":"#DIV/0!"}}]
[null,null,"mês",{"$nulls":4},{"$f":"(D130)/(F130*182.49)","v":{"$error":"#DIV/0!"}}]
[null,null,"mês",{"$nulls":4},{"$f":"(D131)/(F131*182.49)","v":{"$error":"#DIV/0!"}}]
[{"$nulls":5},"Total de Equipes para Terraplenagem",null,{"$f":"SUM(H131:I131)","v":{"$error":"#DIV/0!"}}]
[]
["Parcela Variável - Composição de custo da acompanhamento das frentes de serviço de pavimentação"]
["Código","Discriminação ","Unidade"," Quantidade ",null,"Produção Horária \n(und/h)",null,"Efs"]
["5.2","Equipe de Frente de Serviço","equipe x mês"]
[4011463,"Concreto asfáltico - faixa C - areia e brita comerciais","t",{"$f":"'1.MONTES CLAROS'!J19","v":11760},null,null,null,{"$f":"(D137)/(F137*182.49)","v":{"$error":"#DIV/0!"}}]
[4011353,"Imprimação com asfalto diluído","m²",{"$f":"'1.MONTES CLAROS'!J20","v":98000},null,null,null,{"$error":"#DIV/0!"}]
[4915663,"Pintura de ligação","m³",{"$f":"'1.MONTES CLAROS'!J21","v":490},null,null,null,{"$error":"#DIV/0!"}]
[4915618,"Base estabilizada granulometricamente com mistura de solos na pista com material de jazida","m²",{"$f":"'1.MONTES CLAROS'!J22","v":9800},null,null,null,{"$error":"#DIV/0!"}]
[{"$nulls":5},"Total de Equipes para Pavimentação",null,{"$f":"SUM(H137:I140)","v":{"$error":"#DIV/0!"}}]
[]
["Parcela Variável - Composição de custo da acompanhamento das frentes de serviço de drenagem"]
["Código","Discriminação ","Unidade"," Quantidade ",null,"Efsdu",null,"Efs"]
["5.3","Frentes de Serviço para Drenagem","equipe x mês"]
[4915777,"Reassentamento manual de meio-fio com material arrancado da pista","m",{"$f":"'1.MONTES CLAROS'!J34","v":2800},null,null,null,{"$f":"D146*F146","v":0}]
[4915708,"Limpeza de sarjeta e meio-fio","m",{"$f":"'1.MONTES CLAROS'!J35","v":3360},null,null,null,{"$f":"D147*F147","v":0}]
[4915724,"Caiação mecanizada com fixador de cal","m",{"$f":"'1.MONTES CLAROS'!J36","v":3360},null,null,null,{"$f":"D148*F148","v":0}]
[{"$nulls":5},"Total de Equipes para Drenagem",null,{"$f":"SUM(H146:I148)","v":0}]
[]
["Parcela Variável - Composição de custo da acompanhamento das frentes de serviço de sinalização"]
["Código","Discriminação ","Unidade"," Quantidade ",null,"Produção Horária (und/h)",null,"Efs"]
["5.4","Frentes de Serviço para Sinalização","equipe x mês"]
[5213440,"Placa de regulamentação em aço D = 0,60 m - película retrorrefletiva tipo I + SI - fornecimento e implantação","Unidade",{"$f":"'1.MONTES CLAROS'!J29","v":42},null,null,null,{"$f":"0.2*((D154)/(F154*182.49))","v":{"$error":"#DIV/0!"}}]
[5213464,"Placa de advertência em aço, lado de 0,60 m - película retrorrefletiva tipo I + SI - fornecimento e implantação","Unidade",{"$f":"'1.MONTES CLAROS'!J30","v":42},null,null,null,{"$f":"0.2*((D155)/(F155*182.49))","v":{"$error":"#DIV/0!"}}]
[5213863,"Suporte metálico galvanizado para placa de advertência ou regulamentação - lado ou diâmetro de 0,60 m - fornecimento e implantação","Unidade",{"$f":"'1.MONTES CLAROS'!J31","v":84},null,null,null,{"$f":"0.2*((D156)/(F156*182.49))","v":{"$error":"#DIV/0!"}}]
[5213400,"Pintura de faixa com tinta acrílica - espessura de 0,4 mm","m²",{"$f":"'1.MONTES CLAROS'!J32","v":3360},null,null,null,{"$error":"#DIV/0!"}]
[{"$nulls":5},"Total de Equipes para Sinalização",null,{"$f":"SUM(H154:I157)","v":{"$error":"#DIV/0!"}},null,{"$f":"H158+H149","v":{"$error":"#DIV/0!"}}]
[]
["3. PARCELA VARIÁVEL - EQUIPE DE CONTROLE TECNOLÓGICO"]
["LABORATÓRIO DE SOLOS"]
["Item","Discriminação",null,null,null,"Unidade","Quantidade","Custo Unitário (R$)","Custo Total (R$)"]
[null,"Laboratório de Solos (equipe x mês)"]
[null,"Mão de Obra"]
["P9858","Laboratorista",null,null,null,"func./mês",null,null,{"$f":"TRUNC(G165*H165,2)","v":0}]
["P9833","Auxiliar de laboratório",null,null,null,"func./mês",null,null,{"$f":"TRUNC(G166*H166,2)","v":0}]
[{"$nulls":7},"Subtotal do Item",{"$f":"SUM(I165:I166)","v":0}]
["Item","Discriminação","Und","Quant","Utilização Produtiva","Utilização Improdutiva","Horário Produtivo (R$)","Horário Improdutivo (R$)","Total (R$)"]
[null,"Equipe de Controle Tecnológico"]
[null,"Veículos"]
["E9125","Van furgão a diesel - 93 kW","veic./mês",{"$nulls":5},{"$f":"D171*((E171*G171)+(F171*H171))","v":0}]
[{"$nulls":7},"Subtotal do Item",{"$f":"SUM(I171:I171)","v":0}]
[{"$nulls":7},"Total da Equipe do Laboratório de Solos",{"$f":"I167+I172","v":0}]
[]
["3. PARCELA VARIÁVEL - EQUIPE DE CONTROLE TECNOLÓGICO"]
["LABORATÓRIO DE ASFALTOS"]
["Item","Discriminação",null,null,null,"Unidade","Quantidade","Custo Unitário (R$)","Custo Total (R$)"]
[null,"Laboratório de Solos (equipe x mês)"]
[null,"Mão de Obra"]
["P9858","Laboratorista",null,null,null,"func./mês",null,null,{"$f":"TRUNC(G180*H180,2)","v":0}]
["P9833","Auxiliar de laboratório",null,null,null,"func./mês",null,null,{"$f":"TRUNC(G181*H181,2)","v":0}]
[{"$nulls":7},"Subtotal do Item",{"$f":"SUM(I180:I181)","v":0}]
["Item","Discriminação","Und","Quant","Utilização Produtiva","Utilização Improdutiva","Horário Produtivo (R$)","Horário Improdutivo (R$)","Total (R$)"]
[null,"Equipe de Controle Tecnológico"]
[null,"Veículos"]
["E9125","Van furgão a diesel - 93 kW","veic./mês",{"$nulls":5},{"$f":"D186*((E186*G186)+(F186*H186))","v":0}]
[{"$nulls":7},"Subtotal do Item",{"$f":"SUM(I186:I186)","v":0}]
[{"$nulls":7},"Total da Equipe do Laboratório de Asfaltos",{"$f":"I182+I187","v":0}]
[]
["Equipes de laboratório de solos para pavimentação"]
["Item","Discriminação",null,null,null,"Und","Quant","QE","Els"]
["-","-",null,null,null,"-","-","-","-"]
["-","-",null,null,null,"-","-","-","-"]
[{"$nulls":7},"Total de equipes de Laboratório de Solos para Pavimentação","-"]
[]
["Equipes de laboratório de Asfalto"]
["Item","Discriminação",null,null,null,"Und","Quant","QE","Ela"]
[4011463,"Concreto asfáltico - faixa C - areia e brita comerciais",null,null,null,"t",{"$f":"'1.MONTES CLAROS'!J19","v":11760},null,{"$f":"G198/H198","v":{"$error":"#DIV/0!"}}]
[4011353,"Pintura de ligação",null,null,null,"m²",{"$f":"'1.MONTES CLAROS'!J20","v":98000},null,{"$f":"G199/H199","v":{"$error":"#DIV/0!"}}]
[{"$nulls":7},"Total de equipes de Laboratório de Asfaltos",{"$f":"SUM(I198:I199)","v":{"$error":"#DIV/0!"}}]
[]
["manutenção do canteiro de obras e acampamentos"]
["Código","Discriminação ","Unidade"," Quantidade ",null,"Custo Unitário (R$)",null," Custo Total (R$)"]
[null,"Manutenção do Canteiro de Obras e Acampamentos"]
["6.1","Mão de Obra"]
["P9952","Pedreiro","mês",{"$nulls":4},{"$f":"F206*D206","v":0}]
["P9954","Servente","mês",{"$nulls":4},{"$f":"F207*D207","v":0}]
["P9953","Eletricista","mês",{"$nulls":4},{"$f":"F208*D208","v":0}]
[{"$nulls":5},"Subtotal do Item 6.1",null,{"$f":"SUM(H206:I208)","v":0}]
[]
["Código","Discriminação ","Unidade"," Quantidade ",null,"Custo Produtivo (R$)",null," Custo Total (R$)"]
["6.2","Equipamentos"]
[null,"Caminhão guindauto de 6 toneladas","h/mês",{"$nulls":4},{"$f":"F213*D213","v":0}]
[null,"Caminhão tanque de 8.000 litros","h/mês",{"$nulls":4},{"$f":"F214*D214","v":0}]
["E9524","Motoniveladora","h/mês",{"$nulls":4},{"$f":"F215*D215","v":0}]
[{"$nulls":5},"Subtotal do Item 6.2",null,{"$f":"SUM(H213:I215)","v":0}]
[{"$nulls":6},"Total da Manutenção do Canteiro de Obras e Acampamentos",{"$f":"H216+H209","v":0}]
[]
[]
[]
["Resumo das parcelas de administração local"]
["Código","Discriminação ","Unidade"," Quantidade ",null,"Custo Unitário (R$)",null," Custo Total (R$)"]
[null,"Parcela Fixa"]
[null,"Mão de Obra","mês",null,null,{"$f":"H14+H18+H26+H30","v":0},null,{"$f":"F224*D224","v":0}]
[null,"Veículos","mês",null,null,{"$f":"I47","v":0},null,{"$f":"F225*D225","v":0}]
[{"$nulls":5},"Subtotal do Item 1",null,{"$f":"SUM(H224:I225)","v":0}]
[null,"Parcela Vinculada"]
[null,"Equipe de produção de terraplenagem","mês",null,null,{"$f":"I59","v":{"$error":"#REF!"}},null,{"$f":"F228*D228","v":{"$error":"#REF!"}}]
[null,"Equipe de produção de pavimentação","mês",null,null,{"$f":"I71","v":0},null,0]
[null,"Equipe de produção de drenagem","mês",null,null,{"$f":"I83","v":0},null,0]
[null,"Equipe de produção de sinalização","mês",null,null,{"$f":"I95","v":0},null,0]
[null,"Equipe de topografia","mês",null,null,{"$f":"I108","v":0},null,0]
[null,"Equipe de medicina e segurança do trabalho","mês",null,null,{"$f":"H117","v":0},null,0]
[null,"Técnicos especializados","mês",{"$nulls":4},0]
[{"$nulls":5},"Subtotal do Item 2",null,{"$f":"SUM(H228:I234)","v":{"$error":"#REF!"}}]
[null,"Parcela Variável"]
[null,"Acompanhamento da Terraplenagem","equipe x mês",null,null,{"$f":"$H$124","v":0},null,"-"]
[null,"Acompanhamento da Pavimentação","equipe x mês",null,null,{"$f":"$H$124","v":0},null,{"$f":"F238*D238","v":0}]
[null,"Acompanhamento da Drenagem","equipe x mês",null,null,0,null,{"$f":"F239*D239","v":0}]
[null,"Acompanhamento da Sinalização","equipe x mês",null,null,0,null,{"$f":"F240*D240","v":0}]
[null,"Laboratório de Solos","equipe x mês",null,null,{"$f":"I173","v":0},null,"-"]
[null,"Laboratório de asfaltos","equipe x mês",null,null,{"$f":"I188","v":0},null,{"$f":"F242*D242","v":0}]
[{"$nulls":5},"Subtotal do Item 3",null,{"$f":"SUM(H237:I242)","v":0}]
[null,"Manutenção dos Canteiros de Obras e Acampamentos"]
[null,"Equipe de manutenção","mês",null,null,{"$f":"H217","v":0},null,{"$f":"F245*D245","v":0}]
[{"$nulls":5},"Subtotal do Item 4",null,{"$f":"SUM(H245:I245)","v":0}]
[{"$nulls":6},"Subtotal",{"$f":"H246+H243+H235+H226","v":{"$error":"#REF!"}}]
[null,"Despesas Diversas","%",null,null,"-",null,{"$f":"D248*H247","v":{"$error":"#REF!"}}]
[{"$nulls":5},"TOTAL",null,{"$f":"H247+H248","v":{"$error":"#REF!"}},null,{"$f":"H249","v":{"$error":"#REF!"}}]
[{"$nulls":5},"BDI",null,null,{"$f":"BDI!C16","v":0}]
[{"$nulls":5},"TOTAL COM BDI",null,null,{"$f":"H249+(H249*I250)","v":{"$error":"#REF!"}}]

{"sheet":"PROJ.EXEC.","index":12,"n_rows":29,"n_cols":7,"rows_kept":29,"cut":false,"hidden":false,"merged":[[0,0,2,6],[26,0,26,1],[27,0,27,1],[3,0,3,6],[4,2,6,4],[5,0,5,1],[16,0,16,1],[20,0,20,1],[25,0,25,1]]}
["LOGOTIPO DA EMPRESA"]
[]
[]
["COMPOSIÇAO PREÇO PROJETO EXECUTIVO"]
[]
["DISCRIMINAÇAO",{"$nulls":4},"Pr. Unit.","Pr. Total"]
[]
["A· EOUIPE TECNICA",{"$nulls":5},{"$f":"G9+G12","v":0}]
[null,"A. 1 - Pessoal de Nível Superior","Unidade","Quantitativo","SICRO e Rel.Custos Gerais",null,{"$f":"G10+G11","v":0}]
[null,"Engenheiro","mês",null,"P9812",null,{"$f":"F10*D10","v":0}]
[null,"Topógrafo","mês",null,"P9949",null,{"$f":"F11*D11","v":0}]
[null,"A.2 - Pessoal de Nível Técnico e Aux.",{"$nulls":4},{"$f":"G13+G14","v":0}]
[null,"Auxiliar de topógrafo","mês",null,"P9950",null,{"$f":"F13*D13","v":0}]
[null,"Auxiliar Técnico/Assistente de Engenharia ","mês",null,"P9903",null,{"$f":"F14*D14","v":0}]
["B - ENCARGOS SOCIAIS",{"$nulls":5},{"$f":"G16","v":0}]
[null,{"$f":"CONCATENATE(\"Taxas \",'ENC. SOCIAIS'!E51,\"%\")","v":"Taxas %"},"JÁ INCLUSAS EM \"A\""]
["C - DESPESAS GERAIS",{"$nulls":5},{"$f":"G18+G20+G19","v":0}]
[null,"C.1 - MATERIAIS DE CONSUMO","Estimativa % como referência de equipe técnica com encargos sociais ",null,null,null,{"$f":"F18*D18","v":0}]
[null,"C.2 - VEÍCULOS (Veículo leve picape 4 x 4 com capacidade de 1,10 t - 147 kW)","h",null,"E9684",null,{"$f":"F19*D19","v":0}]
[null,"C.3 - Estação total eletrônica com alcance máximo de 3.000 m","h",null,"E9553",null,{"$f":"F20*D20","v":0}]
["D - ENSAIOS",{"$nulls":5},{"$f":"SUM(G22:G25)","v":0}]
[null,"Laboratorista","mês",null,"P9858",null,{"$f":"F22*D22","v":0}]
[null,"Auxiliar de Laboratório","mês",null,"P9833",null,{"$f":"F23*D23","v":0}]
[null,"Laboratório de solos","mês",null,"B8957",null,{"$f":"F24*D24","v":0}]
[null,"Laboratório de asfalto","mês",null,"B8955",null,{"$f":"F25*D25","v":0}]
["I - SOMA (A+B+C+D)",{"$nulls":5},{"$f":"G8+G15+G17+G21","v":0}]
["II - CUSTOS ADMINISTRATIVOS",null,null,{"$f":"BDI!C17","v":0},null,null,{"$f":"D27*G26","v":0}]
[" TOTAL",{"$nulls":5},{"$f":"G26+G27","v":0}]
[{"$nulls":5},"Por m²:",{"$f":"G28/(#REF!*#REF!)","v":{"$error":"#REF!"}}]

{"sheet":"CPU ","index":13,"n_rows":53,"n_cols":9,"rows_kept":53,"cut":false,"hidden":false,"merged":[[35,7,36,7],[38,4,38,6],[41,5,41,6],[35,0,36,0],[35,1,36,1],[35,2,36,2],[35,3,36,3],[35,4,36,4],[35,5,36,5],[35,6,36,6],[26,5,27,5],[26,6,27,6],[26,7,27,7],[29,4,29,6],[32,5,32,6],[17,0,18,0],[17,1,18,1],[17,2,18,2],[17,3,18,3],[17,4,18,4],[11,4,11,6],[14,5,14,6],[17,7,18,7],[20,4,20,6],[23,5,23,6],[17,5,18,5],[17,6,18,6],[8,4,9,4],[8,5,9,5],[8,6,9,6],[8,7,9,7],[7,0,7,7],[8,0,9,0],[8,1,9,1],[8,2,9,2],[8,3,9,3],[0,0,2,7],[3,0,3,7],[4,0,6,3],[4,6,4,7],[5,4,6,5],[26,0,27,0],[26,1,27,1],[26,2,27,2],[26,3,27,3],[26,4,27,4],[43,7,44,7],[49,4,49,6],[52,5,52,6],[43,0,44,0],[43,1,44,1],[43,2,44,2],[43,3,44,3],[43,4,44,4],[43,5,44,5],[43,6,44,6]]}
["LOGOTIPO DA EMPRESA"]
[]
[]
["CONTRATAÇÃO DE SERVIÇOS DE EXECUÇÃO DE CAPA ASFÁLTICA COM CONCRETO BETUMINOSO USINADO A QUENTE (CBUQ) EM VIAS URBANAS E RURAIS INSERIDAS NA ÁREA DE ATUAÇÃO DA 1ª SUPERINTENDÊNCIA REGIONAL DA CODEVASF, NO ESTADO DE MINAS GERAIS - ITEM X - REGIÃO: XXXXXXXXXXXX/MG"]
[{"$nulls":5},"BDI %:",{"$f":"BDI!C16","v":0}]
[{"$nulls":4},"Encargos Sociais:",null,"Horista","Mensalista"]
[{"$nulls":6},{"$f":"'ENC. SOCIAIS'!E47/100","v":0},{"$f":"'ENC. SOCIAIS'!F47/100","v":0}]
["COMPOSIÇÕES DE CUSTO UNITARIO"]
["CPU-13","CODEVASF",null,"AQUISIÇÃO DE CIMENTO ASFALTICO CAP 50/70","t","COEF.","PRECO UNITÁRIO (R$)","TOTAL (R$)"]
[]
[null,null,null,"CIMENTO ASFALTICO 50/70","t",null,null,{"$f":"F11*G11","v":0}]
[{"$nulls":4},"Sub total:",null,null,{"$f":"SUM(H11)","v":0}]
[{"$nulls":5},"BDI",0.15,{"$f":"H12*G13","v":0}]
[{"$nulls":6},"Total Serviços:",{"$f":"H12+H13","v":0}]
[{"$nulls":4},{"$f":"A9","v":"CPU-13"},"PREÇO UNITÁRIO TOTAL:",null,{"$f":"H14","v":0},{"$f":"H12","v":0}]
[]
[]
["CPU-15","CODEVASF",null,"AQUISIÇÃO DE EMULSÃO ASFÁLTICA RR-1C","t","COEF.","PRECO UNITÁRIO (R$)","TOTAL (R$)"]
[]
[null,null,null,"EMULSÃO ASFÁLTICA RR-1C","t",null,null,{"$f":"F20*G20","v":0}]
[{"$nulls":4},"Sub total:",null,null,{"$f":"SUM(H20)","v":0}]
[{"$nulls":5},"BDI",0.15,{"$f":"H21*G22","v":0}]
[{"$nulls":6},"Total Serviços:",{"$f":"H21+H22","v":0}]
[{"$nulls":4},{"$f":"A18","v":"CPU-15"},"PREÇO UNITÁRIO TOTAL:",null,{"$f":"H23","v":0},{"$f":"H21","v":0}]
[]
[]
["CPU-17","CODEVASF",null,"TRANSPORTE DE CIMENTO ASFALTICO CAP 50/70","t","COEF.","PRECO UNITÁRIO (R$)","TOTAL (R$)"]
[]
[null,null,null,"TRANSPORTE DE CIMENTO ASFALTICO 50/70","t",null,null,{"$f":"F29*G29","v":0}]
[{"$nulls":4},"Sub total:",null,null,{"$f":"SUM(H29)","v":0}]
[{"$nulls":5},"BDI",0.15,{"$f":"ROUND(H30*G31,2)","v":0}]
[{"$nulls":6},"Total Serviços:",{"$f":"H30+H31","v":0}]
[{"$nulls":4},{"$f":"A27","v":"CPU-17"},"PREÇO UNITÁRIO TOTAL:",null,{"$f":"H32","v":0},{"$f":"H30","v":0}]
[]
[]
["CPU-19","CODEVASF",null,"TRANSPORTE DE EMULSÃO ASFÁLTICA RR-1C","UNID","COEF.","PRECO UNITÁRIO (R$)","TOTAL (R$)"]
[]
[null,null,null,"TRANSPORTE DE EMULSÃO ASFÁLTICA RR-1C","t",null,null,{"$f":"F38*G38","v":0}]
[{"$nulls":4},"Sub total:",null,null,{"$f":"SUM(H38)","v":0}]
[{"$nulls":5},"BDI",0.15,{"$f":"H39*G40","v":0}]
[{"$nulls":6},"Total Serviços:",{"$f":"H39+H40","v":0}]
[{"$nulls":4},{"$f":"A36","v":"CPU-19"},"PREÇO UNITÁRIO TOTAL:",null,{"$f":"H41","v":0},{"$f":"H39","v":0}]
[]
["CPU-20","CODEVASF",null,"CONTROLE TECNOLÓGICO - PROJETO","m²","COEF.","PRECO UNITÁRIO (R$)","TOTAL (R$)"]
[]
["Composição","SICRO","P9858","Laboratorista","mês",null,null,{"$f":"F46*G46","v":0}]
["Composição","SICRO","P9833","Auxiliar de Laboratório","mês",null,null,0]
["Composição","SICRO","*B8957","Laboratório de Solos","mês",null,null,0]
["Composição","SICRO","*B8955","Laboratório de Asfalto","mês",null,null,0]
[null,"*Relatório de Custos Gerais do DNIT, página 1",null,null,"Sub total:",null,null,{"$f":"SUM(H46:H49)","v":0}]
[{"$nulls":5},"BDI",{"$f":"BDI!$C$16","v":0},{"$f":"G51*H50","v":0}]
[{"$nulls":6},{"$f":"G41","v":"Total Serviços:"},{"$f":"H50+H51","v":0}]
[{"$nulls":4},"CPU-20","PREÇO UNITÁRIO TOTAL:",null,{"$f":"H50+H51","v":0},{"$f":"H50","v":0}]

{"sheet":"BDI","index":14,"n_rows":31,"n_cols":3,"rows_kept":31,"cut":false,"hidden":false,"merged":[[0,0,2,3],[19,1,19,2],[3,0,3,2],[16,0,16,2],[17,0,17,3],[18,0,18,3],[4,0,4,2]]}
["LOGOTIPO DA EMPRESA"]
[]
[]
["DETALHAMENTO DO BDI  - SEM DESONERAÇÃO"]
["CONTRATAÇÃO DE SERVIÇOS DE EXECUÇÃO DE CAPA ASFÁLTICA COM CONCRETO BETUMINOSO USINADO A QUENTE (CBUQ) EM VIAS URBANAS E RURAIS INSERIDAS NA ÁREA DE ATUAÇÃO DA 1ª SUPERINTENDÊNCIA REGIONAL DA CODEVASF, NO ESTADO DE MINAS GERAIS - ITEM X - REGIÃO: XXXXXXXXXXXX/MG"]
["Descrição dos serviços","Preço de Venda (%)","Custo Direto (%)"]
["ADMINISTRAÇÃO CENTRAL"]
["CUSTOS FINANCEIROS"]
["RISCOS"]
["SEGUROS E GARANTIAS CONTRATUAIS"]
["LUCRO OPERACIONAL"]
["PIS"]
["COFINS"]
["ISSQN"]
["Contribuição Previdenciaria"]
[null,"BDI",{"$f":"ROUND(((1+(C7+C11))/(1-(B8+B9+B10+B12+B13+B14+B15))-1),4)","v":0}]
[]
["DETALHAMENTO DO BDI DIFERENCIADO  - SEM DESONERAÇÃO"]
[{"$f":"A5","v":"CONTRATAÇÃO DE SERVIÇOS DE EXECUÇÃO DE CAPA ASFÁLTICA COM CONCRETO BETUMINOSO USINADO A QUENTE (CBUQ) EM VIAS URBANAS E RURAIS INSERIDAS NA ÁREA DE ATUAÇÃO DA 1ª SUPERINTENDÊNCIA REGIONAL DA CODEVASF, NO ESTADO DE MINAS GERAIS - ITEM X - REGIÃO: XXXXXXXXXXXX/MG"}]
[]
["DESCRIÇÃO DOS SERVIÇOS","PREÇO DE VENDA (%)","CUSTO DIRETO (%)"]
["ADMINISTRAÇÃO CENTRAL"]
["DESPESA FINANCEIRAS"]
["SEGUROS E GARANTIAS CONTRATUAIS"]
["RISCOS"]
["LUCRO OPERACIONAL"]
["PIS"]
["COFINS"]
["ISSQN"]
["Contribuição Previdenciaria"]
[null,"BDI",{"$f":"ROUND((1+(C22+C26))/(1-(B23+B24+B25+B27+B28+B29+B30))-1,4)","v":0}]

{"sheet":"ENC. SOCIAIS","index":15,"n_rows":51,"n_cols":13,"rows_kept":51,"cut":false,"hidden":false,"merged":[[0,0,3,5],[4,0,5,5],[46,0,46,1],[6,0,6,5],[7,2,7,3],[7,4,7,5],[8,0,8,5],[9,0,10,1],[9,2,10,2],[9,3,10,3],[9,4,10,4],[9,5,10,5],[11,0,11,5],[22,0,22,5],[34,0,34,5],[41,0,41,5],[45,0,45,5]]}
["LOGOTIPO DA EMPRESA"]
[]
[]
[]
["CONTRATAÇÃO DE SERVIÇOS DE EXECUÇÃO DE CAPA ASFÁLTICA COM CONCRETO BETUMINOSO USINADO A QUENTE (CBUQ) EM VIAS URBANAS E RURAIS INSERIDAS NA ÁREA DE ATUAÇÃO DA 1ª SUPERINTENDÊNCIA REGIONAL DA CODEVASF, NO ESTADO DE MINAS GERAIS - ITEM X - REGIÃO: XXXXXXXXXXXX/MG"]
[]
["DETALHAMENTO DOS ENCARGOS SOCIAIS (%)"]
["VIGÊNCIA A PARTIR DE 12/2023",null,"COM DESONERAÇÃO",null,"SEM DESONERAÇÃO"]
[]
[null,null,"HORISTA","MENSALISTA","HORISTA","MENSALISTA"]
[]
["GRUPO A"]
["A1","INSS",0,0]
["A2","SESI",1.5,1.5]
["A3","SENAI",1,1]
["A4","INCRA",0.2,0.2]
["A5","SEBRAE",0.6,0.6]
["A6","Salário Educação",2.5,2.5]
["A7","Seguro Contra Acidentes de Trabalho",3,3]
["A8","FGTS",8,8]
["A9","SECONCI",1,1]
["A","Total",{"$f":"SUM(C13:C21)","v":17.8},{"$f":"SUM(D13:D21)","v":17.8},{"$f":"SUM(E13:E21)","v":0},{"$f":"SUM(F13:F21)","v":0}]
["GRUPO B"]
["B1","Repouso Semanal Remunerado",17.88,"-"]
["B2","Feriados",3.94,"-"]
["B3","Auxílio-enfermidade",0.91,0.69]
["B4","13° salário",10.98,8.33]
["B5","Licença-paternidade",7.0000000000000007E-2,0.06]
["B6","Faltas Justificadas",0.73,0.56000000000000005]
["B7","Dias de chuva",1.45,"-"]
["B8","Auxílio Acidente de Trabalho",0.11,0.09]
["B9","Férias Gozadas",11.35,8.6199999999999992]
["B10","Salário Maternidade",0.03,0.03,{"$nulls":7},{"$f":"(#REF!)/(1+#REF!)","v":{"$error":"#REF!"}},{"$f":"(#REF!)","v":{"$error":"#REF!"}}]
["B","Total ",{"$f":"SUM(C24:C33)","v":47.45},{"$f":"SUM(D24:D33)","v":18.380000000000003},{"$f":"SUM(E24:E33)","v":0},{"$f":"SUM(F24:F33)","v":0}]
["GRUPO C"]
["C1","Aviso Prévio Indenizado",6.76,5.14]
["C2","Aviso Prévio Trabalhado",0.16,0.12]
["C3","Férias Indenizadas",2.2799999999999998,1.73]
["C4","Depósito Rescisão Sem Justa Causa",3.81,2.89]
["C5","Indenização Adicional",0.56999999999999995,0.43]
["C","Total ",{"$f":"SUM(C36:C40)","v":13.58},{"$f":"SUM(D36:D40)","v":10.31},{"$f":"SUM(E36:E40)","v":0},{"$f":"SUM(F36:F40)","v":0}]
["GRUPO D"]
["D1","Reincidência de A sobre B",8.4499999999999993,3.27]
["D2","Reincidência de Grupo A sobre Aviso Prévio Trabalhado e Reincidência do FGTS sobre Aviso Prévio Indenizado",0.56999999999999995,0.43]
["D","Total",{"$f":"SUM(C43:C44)","v":9.02},{"$f":"SUM(D43:D44)","v":3.7},{"$f":"SUM(E43:E44)","v":0},{"$f":"SUM(F43:F44)","v":0}]
[]
["T O T A L (%)",null,{"$f":"C22+C34+C41+C45","v":87.85},{"$f":"D22+D34+D41+D45","v":50.190000000000012},{"$f":"E22+E34+E41+E45","v":0},{"$f":"F22+F34+F41+F45","v":0}]
[]
[]
[]
[{"$nulls":7},"Fonte: Sinapi Cálculos e Parâmetros 5ª Edição - Atualizada em Agosto 2023"]