{"text_format":"2","workbook":"xlsx","n_sheets":8,"sheets":["Resumo do Orçamento","Orçamento Sintético","Cronograma","BDI","Encacrgos Sociais","Curva ABC de Serviços","CPUs","Memória de cálculo"],"not_rendered":{"charts":0,"images":2,"macros":0,"external_links":2,"defined_names":340,"comments":0,"pivot_tables":0},"unopened":[],"bounds":{"document_bytes":16777216,"sheet_cells":100000,"run_cost":"one","rows_first":2000,"rows_last":500,"rows_between":2000,"halvings":0,"cell_chars":16384,"cell_head_chars":4096},"cells_cut":0,"cells_raw":0,"read":"whole","date_system":"1900"}

{"sheet":"Resumo do Orçamento","index":0,"n_rows":17,"n_cols":12,"rows_kept":17,"cut":false,"hidden":false,"merged":[[16,0,16,2],[16,6,16,7],[16,8,16,10],[12,0,12,2],[12,3,12,8],[13,0,13,2],[13,3,13,8],[14,0,14,2],[14,3,14,8],[9,0,9,10],[10,0,10,2],[10,3,10,8],[11,0,11,2],[11,3,11,8],[4,5,4,7],[4,8,4,10],[0,0,3,10],[5,5,5,7],[5,8,5,10]]}
["LOGO DA EMPRESA"]
[]
[]
[]
[null,null,null,"Obra","Bancos","B.D.I.",null,null,"Encargos Sociais"]
[null,null,null,"Espaço Multiuso - Tipo 02","SINAPI - 08/2024 - Sergipe\nORSE - 06/2024 - Sergipe\n","23,54%",null,null,"Não Desonerado: \nHorista: 112,54%\nMensalista: 70,11%"]
[]
[{"$nulls":10},"Desconto"]
[{"$nulls":10},0,"Inserir o desconto aqui"]
["Planilha Orçamentária Resumida"]
{"$rows_left_out":8}
{"sheet":"Orçamento Sintético","index":1,"n_rows":88,"n_cols":10,"rows_kept":88,"cut":false,"hidden":false,"merged":[[0,0,2,8],[4,4,4,5],[4,6,4,7],[8,0,8,8],[3,4,3,5],[3,6,3,7]]}
["LOGO DA EMPRESA"]
[]
[]
[null,null,null,"Obra","Bancos",null,"B.D.I.",null,"Encargos Sociais"]
[null,null,null,"Espaço Multiuso - Tipo 02","SINAPI - 08/2024 - Sergipe\nORSE - 06/2024 - Sergipe\n",null,"23,54%",null,"Não Desonerado: \nHorista: 112,54%\nMensalista: 70,11%"]
[]
[{"$nulls":8},"Desconto"]
[{"$nulls":8},{"$f":"'Resumo do Orçamento'!K9","v":0},"Inserir o desconto na aba Resumo, não aqui!"]
["Orçamento Sintético"]
["Item","Código","Banco","Descrição","Und","Quant.","Valor Unit","Valor Unit com BDI","Total"]
{"$rows_left_out":79}
{"sheet":"Cronograma","index":2,"n_rows":25,"n_cols":10,"rows_kept":25,"cut":false,"hidden":false,"merged":[[4,0,4,8],[5,0,5,8],[6,0,6,8],[8,0,9,0],[8,1,9,1],[8,2,9,2],[8,4,8,8],[11,0,12,0],[11,1,12,1],[11,2,12,2],[13,0,14,0],[13,1,14,1],[13,2,14,2],[15,0,16,0],[15,1,16,1],[15,2,16,2],[17,0,18,0],[17,1,18,1],[17,2,18,2]]}
[null,"                                               Ministério da Integração e do Desenvolvimento Regional - MIDR "]
[null,"                                               Companhia de Desenvolvimento dos Vales do São Francisco e do Parnaíba "]
[null,"                                               Gerência Regional de Infraestrutura "]
[]
[{"$f":"'Resumo do Orçamento'!D6","v":"Espaço Multiuso - Tipo 02"}]
[]
["CRONOGRAMA FÍSICO E FINANCEIRO"]
[]
["ITEM","DESCRIÇÃO DOS SERVIÇOS","R$",null,"PRAZO (DIAS)"]
[null,null,null,30,60,90,120,150,180]
{"$rows_left_out":16}
{"sheet":"BDI","index":3,"n_rows":31,"n_cols":4,"rows_kept":31,"cut":false,"hidden":false,"merged":[[28,0,29,0],[28,2,29,2],[28,3,29,3],[30,0,34,3],[0,1,0,3],[1,1,1,3],[2,1,2,3],[26,1,26,2],[5,0,5,3],[6,0,6,3],[8,0,9,0],[8,1,9,2],[8,3,9,3],[0,0,2,0]]}
[null,"Ministério da Integração e do Desenvolvimento Regional - MIDR"]
[null,"Companhia de Desenvolvimento dos Vales do São Francisco e do Parnaíba "]
[null,"4ª Gerência Regional de Infraestrutura "]
[]
[null,null,null,"Sem Desoneração"]
[]
["DETALHAMENTO DO BDI"]
[]
["ITEM","DESCRIÇÕES DOS ITENS",null,"%"]
[]
{"$rows_left_out":22}
{"sheet":"Encacrgos Sociais","index":4,"n_rows":44,"n_cols":4,"rows_kept":44,"cut":false,"hidden":false,"merged":[[42,0,42,1],[43,0,43,1],[4,0,4,3],[7,0,8,1],[9,1,9,3],[19,0,19,1],[20,1,20,3],[31,0,31,1],[32,1,32,3],[0,1,0,3],[1,1,1,3],[2,1,2,3],[38,0,38,1],[39,1,39,3]]}
[null,"Ministério da Integração e do Desenvolvimento Regional - MIDR"]
[null,"Companhia de Desenvovimento dos Vales do São Francisco e do Parnaíba"]
[null,"4ª Gerência Regional de Infraestrutura "]
[]
["Detalhamento dos Encargos Sociais – Horista e Mensalista – Não Desonerado"]
[]
[]
["DISCRIMINAÇÃO",null,"HORISTA","MENSALISTA"]
[null,null,"%","%"]
["A","ENCARGOS SOCIAIS BÁSICOS"]
{"$rows_left_out":35}
{"sheet":"Curva ABC de Serviços","index":5,"n_rows":64,"n_cols":10,"rows_kept":64,"cut":false,"hidden":false,"merged":[[0,4,0,6],[0,7,0,9],[1,4,1,6],[1,7,1,9],[2,0,2,9]]}
[null,null,"Obra","Bancos","B.D.I.",null,null,"Encargos Sociais"]
[null,null,"Espaço Multiuso - Tipo 02","SINAPI - 08/2024 - Sergipe\nORSE - 06/2024 - Sergipe\n","23,54%",null,null,"Não Desonerado: \nHorista: 112,54%\nMensalista: 70,11%"]
["Curva ABC de Serviços"]
["Código","Banco","Descrição","Tipo","Und","Quant.","Valor  Unit","Total","Peso (%)","Peso Acumulado (%)"]
[" 94994 ","SINAPI","EXECUÇÃO DE PASSEIO (CALÇADA) OU PISO DE CONCRETO COM CONCRETO MOLDADO IN LOCO, FEITO EM OBRA, ACABAMENTO CONVENCIONAL, ESPESSURA 8 CM, ARMADO. AF_08/2022","PISO - PISOS","m²","648,06",{"$f":"VLOOKUP(A5,'Orçamento Sintético'!$B$13:$H$88,7,FALSE)","v":114.52},{"$f":"TRUNC(F5*G5,2)","v":74215.83},{"$f":"H5/$H$64","v":0.26224537765668227},{"$f":"I5","v":0.26224537765668227}]
[" 97086 ","SINAPI","FABRICAÇÃO, MONTAGEM E DESMONTAGEM DE FORMA PARA RADIER, PISO DE CONCRETO OU LAJE SOBRE SOLO, EM MADEIRA SERRADA, 4 UTILIZAÇÕES. AF_09/2021","FUES - FUNDAÇÕES E ESTRUTURAS","m²","233,75",{"$f":"VLOOKUP(A6,'Orçamento Sintético'!$B$13:$H$88,7,FALSE)","v":150.05000000000001},35074.18,0.12393638365424804,{"$f":"I6+J5","v":0.38618176131093029}]
[" CODEVASF  122 ","Próprio","Administração local de pequenas obras","CANT - CANTEIRO DE OBRAS","und",1,{"$f":"VLOOKUP(A7,'Orçamento Sintético'!$B$13:$H$88,7,FALSE)","v":16797.09},16797.09,5.9353364512440013E-2,0.44553512582337029]
[" 9399 ","ORSE","Concreto simples fabricado na obra, fck=25 mpa, lançado e adensado","Concreto Simples","m³","21,25",{"$f":"VLOOKUP(A8,'Orçamento Sintético'!$B$13:$H$88,7,FALSE)","v":774.31},16454.080000000002,5.8141321381075473E-2,0.50367644720444571]
[" 94991 ","SINAPI","EXECUÇÃO DE PASSEIO (CALÇADA) OU PISO DE CONCRETO COM CONCRETO MOLDADO IN LOCO, USINADO C20, ACABAMENTO CONVENCIONAL, NÃO ARMADO. AF_08/2022","PISO - PISOS","m³","15,56",{"$f":"VLOOKUP(A9,'Orçamento Sintético'!$B$13:$H$88,7,FALSE)","v":856.88},13333.05,4.7113004497361638E-2,0.55078945170180738]
[" 96622 ","SINAPI","LASTRO COM MATERIAL GRANULAR, APLICADO EM PISOS OU LAJES SOBRE SOLO, ESPESSURA DE *5 CM*. AF_01/2024","FUES - FUNDAÇÕES E ESTRUTURAS","m³","32,4",{"$f":"VLOOKUP(A10,'Orçamento Sintético'!$B$13:$H$88,7,FALSE)","v":287.64999999999998},9319.86,3.2932195266257978E-2,0.58372164696806539]
{"$rows_left_out":55}
{"sheet":"CPUs","index":6,"n_rows":1751,"n_cols":10,"rows_kept":1751,"cut":false,"hidden":false,"merged":[[1746,4,1746,5],[1747,4,1747,5],[1748,4,1748,5],[1749,4,1749,5],[1750,4,1750,5],[1752,7,1752,8],[1704,4,1704,5],[1705,4,1705,5],[1706,4,1706,5],[1707,4,1707,5],[1708,4,1708,5],[1731,4,1731,5],[1732,4,1732,5],[1733,4,1733,5],[1735,7,1735,8],[1737,4,1737,5],[1738,4,1738,5],[1725,4,1725,5],[1726,4,1726,5],[1727,4,1727,5],[1728,4,1728,5],[1729,4,1729,5],[1730,4,1730,5],[1717,4,1717,5],[1718,4,1718,5],[1719,4,1719,5],[1720,4,1720,5],[1722,7,1722,8],[1724,4,1724,5],[1709,4,1709,5],[1710,4,1710,5],[1711,4,1711,5],[1712,4,1712,5],[1713,4,1713,5],[1715,7,1715,8],[1739,4,1739,5],[1740,4,1740,5],[1741,4,1741,5],[1742,4,1742,5],[1744,7,1744,8],[1656,4,1656,5],[1657,4,1657,5],[1658,4,1658,5],[1659,4,1659,5],[1660,4,1660,5],[1687,4,1687,5],[1688,4,1688,5],[1690,7,1690,8],[1692,4,1692,5],[1693,4,1693,5],[1694,4,1694,5],[1678,7,1678,8],[1680,4,1680,5],[1681,4,1681,5],[1682,4,1682,5],[1684,7,1684,8],[1686,4,1686,5],[1671,4,1671,5],[1672,4,1672,5],[1673,4,1673,5],[1674,4,1674,5],[1675,4,1675,5],[1676,4,1676,5],[1662,7,1662,8],[1664,4,1664,5],[1665,4,1665,5],[1666,4,1666,5],[1667,4,1667,5],[1669,7,1669,8],[1696,7,1696,8],[1698,4,1698,5],[1699,4,1699,5],[1700,4,1700,5],[1702,7,1702,8],[1616,4,1616,5],[1617,4,1617,5],[1618,4,1618,5],[1619,4,1619,5],[1620,4,1620,5],[1643,4,1643,5],[1644,4,1644,5],[1645,4,1645,5],[1646,4,1646,5],[1647,4,1647,5],[1649,7,1649,8],[1636,7,1636,8],[1638,4,1638,5],[1639,4,1639,5],[1640,4,1640,5],[1641,4,1641,5],[1642,4,1642,5],[1629,4,1629,5],[1630,4,1630,5],[1631,4,1631,5],[1632,4,1632,5],[1633,4,1633,5],[1634,4,1634,5],[1621,4,1621,5],[1623,7,1623,8],[1625,4,1625,5],[1626,4,1626,5],[1627,4,1627,5],[1628,4,1628,5],[1651,4,1651,5],[1652,4,1652,5],[1653,4,1653,5],[1654,4,1654,5],[1655,4,1655,5],[1576,4,1576,5],[1577,4,1577,5],[1578,4,1578,5],[1579,4,1579,5],[1580,4,1580,5],[1603,4,1603,5],[1604,4,1604,5],[1605,4,1605,5],[1606,4,1606,5],[1607,4,1607,5],[1608,4,1608,5],[1595,4,1595,5],[1597,7,1597,8],[1599,4,1599,5],[1600,4,1600,5],[1601,4,1601,5],[1602,4,1602,5],[1589,4,1589,5],[1590,4,1590,5],[1591,4,1591,5],[1592,4,1592,5],[1593,4,1593,5],[1594,4,1594,5],[1581,4,1581,5],[1582,4,1582,5],[1584,7,1584,8],[1586,4,1586,5],[1587,4,1587,5],[1588,4,1588,5],[1610,7,1610,8],[1612,4,1612,5],[1613,4,1613,5],[1614,4,1614,5],[1615,4,1615,5],[1534,4,1534,5],[1535,4,1535,5],[1537,7,1537,8],[1539,4,1539,5],[1540,4,1540,5],[1563,4,1563,5],[1564,4,1564,5],[1565,4,1565,5],[1566,4,1566,5],[1567,4,1567,5],[1568,4,1568,5],[1555,4,1555,5],[1556,4,1556,5],[1558,7,1558,8],[1560,4,1560,5],[1561,4,1561,5],[1562,4,1562,5],[1549,4,1549,5],[1550,4,1550,5],[1551,4,1551,5],[1552,4,1552,5],[1553,4,1553,5],[1554,4,1554,5],[1541,4,1541,5],[1542,4,1542,5],[1543,4,1543,5],[1545,7,1545,8],[1547,4,1547,5],[1548,4,1548,5],[1569,4,1569,5],[1571,7,1571,8],[1573,4,1573,5],[1574,4,1574,5],[1575,4,1575,5],[1488,4,1488,5],[1489,4,1489,5],[1490,4,1490,5],[1491,4,1491,5],[1492,4,1492,5],[1519,4,1519,5],[1520,4,1520,5],[1521,4,1521,5],[1523,7,1523,8],[1525,4,1525,5],[1526,4,1526,5],[1511,4,1511,5],[1512,4,1512,5],[1513,4,1513,5],[1514,4,1514,5],[1516,7,1516,8],[1518,4,1518,5],[1502,7,1502,8],[1504,4,1504,5],[1505,4,1505,5],[1506,4,1506,5],[1507,4,1507,5],[1509,7,1509,8],[1493,4,1493,5],[1495,7,1495,8],[1497,4,1497,5],[1498,4,1498,5],[1499,4,1499,5],[1500,4,1500,5],[1527,4,1527,5],[1529,7,1529,8],[1531,4,1531,5],[1532,4,1532,5],[1533,4,1533,5],[1452,4,1452,5],[1453,4,1453,5],[1454,4,1454,5],[1455,4,1455,5],[1456,4,1456,5],[1475,4,1475,5],[1476,4,1476,5],[1477,4,1477,5],[1478,4,1478,5],[1479,4,1479,5],[1480,4,1480,5],[1469,4,1469,5],[1470,4,1470,5],[1471,4,1471,5],[1472,4,1472,5],[1473,4,1473,5],[1474,4,1474,5],[1463,4,1463,5],[1464,4,1464,5],[1465,4,1465,5],[1466,4,1466,5],[1467,4,1467,5],[1468,4,1468,5],[1457,4,1457,5],[1458,4,1458,5],[1459,4,1459,5],[1460,4,1460,5],[1461,4,1461,5],[1462,4,1462,5],[1481,4,1481,5],[1482,4,1482,5],[1484,7,1484,8],[1486,4,1486,5],[1487,4,1487,5],[1414,4,1414,5],[1415,4,1415,5],[1416,4,1416,5],[1417,4,1417,5],[1418,4,1418,5],[1439,4,1439,5],[1440,4,1440,5],[1441,4,1441,5],[1442,4,1442,5],[1443,4,1443,5],[1444,4,1444,5],[1433,4,1433,5],[1434,4,1434,5],[1435,4,1435,5],[1436,4,1436,5],[1437,4,1437,5],[1438,4,1438,5],[1427,4,1427,5],[1428,4,1428,5],[1429,4,1429,5],[1430,4,1430,5],[1431,4,1431,5],[1432,4,1432,5],[1419,4,1419,5],[1420,4,1420,5],[1421,4,1421,5],[1422,4,1422,5],[1423,4,1423,5],[1425,7,1425,8],[1445,4,1445,5],[1446,4,1446,5],[1448,7,1448,8],[1450,4,1450,5],[1451,4,1451,5],[1378,4,1378,5],[1379,4,1379,5],[1380,4,1380,5],[1381,4,1381,5],[1382,4,1382,5],[1401,4,1401,5],[1402,4,1402,5],[1404,7,1404,8],[1406,4,1406,5],[1407,4,1407,5],[1408,4,1408,5],[1395,4,1395,5],[1396,4,1396,5],[1397,4,1397,5],[1398,4,1398,5],[1399,4,1399,5],[1400,4,1400,5],[1389,4,1389,5],[1390,4,1390,5],[1391,4,1391,5],[1392,4,1392,5],[1393,4,1393,5],[1394,4,1394,5],[1383,4,1383,5],[1384,4,1384,5],[1385,4,1385,5],[1386,4,1386,5],[1387,4,1387,5],[1388,4,1388,5],[1409,4,1409,5],[1410,4,1410,5],[1411,4,1411,5],[1412,4,1412,5],[1413,4,1413,5],[1340,4,1340,5],[1341,4,1341,5],[1342,4,1342,5],[1343,4,1343,5],[1344,4,1344,5],[1365,4,1365,5],[1366,4,1366,5],[1367,4,1367,5],[1368,4,1368,5],[1369,4,1369,5],[1370,4,1370,5],[1359,4,1359,5],[1360,4,1360,5],[1361,4,1361,5],[1362,4,1362,5],[1363,4,1363,5],[1364,4,1364,5],[1353,4,1353,5],[1354,4,1354,5],[1355,4,1355,5],[1356,4,1356,5],[1357,4,1357,5],[1358,4,1358,5],[1345,4,1345,5],[1346,4,1346,5],[1347,4,1347,5],[1348,4,1348,5],[1349,4,1349,5],[1351,7,1351,8],[1371,4,1371,5],[1372,4,1372,5],[1374,7,1374,8],[1376,4,1376,5],[1377,4,1377,5],[1302,4,1302,5],[1303,4,1303,5],[1312,4,1312,5],[1313,4,1313,5],[1314,4,1314,5],[1329,4,1329,5],[1330,4,1330,5],[1331,4,1331,5],[1332,4,1332,5],[1333,4,1333,5],[1334,4,1334,5],[1321,4,1321,5],[1322,4,1322,5],[1323,4,1323,5],[1324,4,1324,5],[1326,7,1326,8],[1328,4,1328,5],[1315,4,1315,5],[1316,4,1316,5],[1317,4,1317,5],[1318,4,1318,5],[1319,4,1319,5],[1320,4,1320,5],[1305,7,1305,8],[1307,4,1307,5],[1308,4,1308,5],[1309,4,1309,5],[1310,4,1310,5],[1311,4,1311,5],[1335,4,1335,5],[1336,4,1336,5],[1337,4,1337,5],[1338,4,1338,5],[1339,4,1339,5],[1260,4,1260,5],[1277,4,1277,5],[1278,4,1278,5],[1279,4,1279,5],[1280,4,1280,5],[1289,4,1289,5],[1290,4,1290,5],[1291,4,1291,5],[1292,4,1292,5],[1294,7,1294,8],[1296,4,1296,5],[1281,4,1281,5],[1283,7,1283,8],[1285,4,1285,5],[1286,4,1286,5],[1287,4,1287,5],[1288,4,1288,5],[1270,7,1270,8],[1272,4,1272,5],[1273,4,1273,5],[1274,4,1274,5],[1275,4,1275,5],[1276,4,1276,5],[1262,7,1262,8],[1264,4,1264,5],[1265,4,1265,5],[1266,4,1266,5],[1267,4,1267,5],[1268,4,1268,5],[1297,4,1297,5],[1298,4,1298,5],[1299,4,1299,5],[1300,4,1300,5],[1301,4,1301,5],[1218,4,1218,5],[1219,4,1219,5],[1228,4,1228,5],[1229,4,1229,5],[1230,4,1230,5],[1247,4,1247,5],[1249,7,1249,8],[1251,4,1251,5],[1252,4,1252,5],[1253,4,1253,5],[1254,4,1254,5],[1240,7,1240,8],[1242,4,1242,5],[1243,4,1243,5],[1244,4,1244,5],[1245,4,1245,5],[1246,4,1246,5],[1232,7,1232,8],[1234,4,1234,5],[1235,4,1235,5],[1236,4,1236,5],[1237,4,1237,5],[1238,4,1238,5],[1221,7,1221,8],[1223,4,1223,5],[1224,4,1224,5],[1225,4,1225,5],[1226,4,1226,5],[1227,4,1227,5],[1255,4,1255,5],[1256,4,1256,5],[1257,4,1257,5],[1258,4,1258,5],[1259,4,1259,5],[1172,4,1172,5],[1173,4,1173,5],[1175,7,1175,8],[1177,4,1177,5],[1178,4,1178,5],[1205,4,1205,5],[1206,4,1206,5],[1207,4,1207,5],[1208,4,1208,5],[1209,4,1209,5],[1210,4,1210,5],[1197,4,1197,5],[1198,4,1198,5],[1199,4,1199,5],[1200,4,1200,5],[1201,4,1201,5],[1203,7,1203,8],[1189,4,1189,5],[1190,4,1190,5],[1191,4,1191,5],[1192,4,1192,5],[1193,4,1193,5],[1195,7,1195,8],[1179,4,1179,5],[1181,7,1181,8],[1183,4,1183,5],[1184,4,1184,5],[1185,4,1185,5],[1187,7,1187,8],[1211,4,1211,5],[1212,4,1212,5],[1214,7,1214,8],[1216,4,1216,5],[1217,4,1217,5],[1121,7,1121,8],[1123,4,1123,5],[1124,4,1124,5],[1125,4,1125,5],[1127,7,1127,8],[1155,4,1155,5],[1157,7,1157,8],[1159,4,1159,5],[1160,4,1160,5],[1161,4,1161,5],[1163,7,1163,8],[1147,4,1147,5],[1148,4,1148,5],[1149,4,1149,5],[1151,7,1151,8],[1153,4,1153,5],[1154,4,1154,5],[1137,4,1137,5],[1139,7,1139,8],[1141,4,1141,5],[1142,4,1142,5],[1143,4,1143,5],[1145,7,1145,8],[1129,4,1129,5],[1130,4,1130,5],[1131,4,1131,5],[1133,7,1133,8],[1135,4,1135,5],[1136,4,1136,5],[1165,4,1165,5],[1166,4,1166,5],[1167,4,1167,5],[1169,7,1169,8],[1171,4,1171,5],[1070,4,1070,5],[1071,4,1071,5],[1073,7,1073,8],[1075,4,1075,5],[1076,4,1076,5],[1105,4,1105,5],[1106,4,1106,5],[1107,4,1107,5],[1109,7,1109,8],[1111,4,1111,5],[1112,4,1112,5],[1095,4,1095,5],[1097,7,1097,8],[1099,4,1099,5],[1100,4,1100,5],[1101,4,1101,5],[1103,7,1103,8],[1087,4,1087,5],[1088,4,1088,5],[1089,4,1089,5],[1091,7,1091,8],[1093,4,1093,5],[1094,4,1094,5],[1077,4,1077,5],[1079,7,1079,8],[1081,4,1081,5],[1082,4,1082,5],[1083,4,1083,5],[1085,7,1085,8],[1113,4,1113,5],[1115,7,1115,8],[1117,4,1117,5],[1118,4,1118,5],[1119,4,1119,5],[1026,4,1026,5],[1027,4,1027,5],[1028,4,1028,5],[1029,4,1029,5],[1030,4,1030,5],[1055,4,1055,5],[1057,7,1057,8],[1059,4,1059,5],[1060,4,1060,5],[1061,4,1061,5],[1062,4,1062,5],[1047,4,1047,5],[1049,7,1049,8],[1051,4,1051,5],[1052,4,1052,5],[1053,4,1053,5],[1054,4,1054,5],[1039,4,1039,5],[1041,7,1041,8],[1043,4,1043,5],[1044,4,1044,5],[1045,4,1045,5],[1046,4,1046,5],[1031,4,1031,5],[1033,7,1033,8],[1035,4,1035,5],[1036,4,1036,5],[1037,4,1037,5],[1038,4,1038,5],[1063,4,1063,5],[1065,7,1065,8],[1067,4,1067,5],[1068,4,1068,5],[1069,4,1069,5],[982,4,982,5],[983,4,983,5],[985,7,985,8],[987,4,987,5],[988,4,988,5],[1013,4,1013,5],[1014,4,1014,5],[1015,4,1015,5],[1016,4,1016,5],[1017,4,1017,5],[1018,4,1018,5],[1005,4,1005,5],[1006,4,1006,5],[1007,4,1007,5],[1009,7,1009,8],[1011,4,1011,5],[1012,4,1012,5],[999,4,999,5],[1000,4,1000,5],[1001,4,1001,5],[1002,4,1002,5],[1003,4,1003,5],[1004,4,1004,5],[989,4,989,5],[991,7,991,8],[993,4,993,5],[994,4,994,5],[995,4,995,5],[997,7,997,8],[1019,4,1019,5],[1021,7,1021,8],[1023,4,1023,5],[1024,4,1024,5],[1025,4,1025,5],[937,7,937,8],[939,4,939,5],[940,4,940,5],[941,4,941,5],[942,4,942,5],[967,4,967,5],[968,4,968,5],[969,4,969,5],[970,4,970,5],[971,4,971,5],[973,7,973,8],[959,4,959,5],[960,4,960,5],[961,4,961,5],[963,7,963,8],[965,4,965,5],[966,4,966,5],[953,4,953,5],[954,4,954,5],[955,4,955,5],[956,4,956,5],[957,4,957,5],[958,4,958,5],[944,7,944,8],[946,4,946,5],[947,4,947,5],[948,4,948,5],[950,7,950,8],[952,4,952,5],[975,4,975,5],[976,4,976,5],[977,4,977,5],[979,7,979,8],[981,4,981,5],[890,4,890,5],[892,7,892,8],[894,4,894,5],[895,4,895,5],[896,4,896,5],[921,4,921,5],[923,7,923,8],[925,4,925,5],[926,4,926,5],[927,4,927,5],[928,4,928,5],[913,4,913,5],[914,4,914,5],[916,7,916,8],[918,4,918,5],[919,4,919,5],[920,4,920,5],[907,4,907,5],[908,4,908,5],[909,4,909,5],[910,4,910,5],[911,4,911,5],[912,4,912,5],[897,4,897,5],[899,7,899,8],[901,4,901,5],[902,4,902,5],[903,4,903,5],[905,7,905,8],[930,7,930,8],[932,4,932,5],[933,4,933,5],[934,4,934,5],[935,4,935,5],[845,7,845,8],[847,4,847,5],[848,4,848,5],[849,4,849,5],[851,7,851,8],[875,4,875,5],[876,4,876,5],[878,7,878,8],[880,4,880,5],[881,4,881,5],[882,4,882,5],[867,4,867,5],[868,4,868,5],[869,4,869,5],[871,7,871,8],[873,4,873,5],[874,4,874,5],[860,7,860,8],[862,4,862,5],[863,4,863,5],[864,4,864,5],[865,4,865,5],[866,4,866,5],[853,4,853,5],[854,4,854,5],[855,4,855,5],[856,4,856,5],[857,4,857,5],[858,4,858,5],[883,4,883,5],[885,7,885,8],[887,4,887,5],[888,4,888,5],[889,4,889,5],[800,4,800,5],[801,4,801,5],[802,4,802,5],[803,4,803,5],[804,4,804,5],[829,4,829,5],[831,7,831,8],[833,4,833,5],[834,4,834,5],[835,4,835,5],[836,4,836,5],[821,4,821,5],[822,4,822,5],[824,7,824,8],[826,4,826,5],[827,4,827,5],[828,4,828,5],[813,4,813,5],[814,4,814,5],[815,4,815,5],[817,7,817,8],[819,4,819,5],[820,4,820,5],[806,7,806,8],[808,4,808,5],[809,4,809,5],[810,4,810,5],[811,4,811,5],[812,4,812,5],[838,7,838,8],[840,4,840,5],[841,4,841,5],[842,4,842,5],[843,4,843,5],[752,4,752,5],[753,4,753,5],[755,7,755,8],[757,4,757,5],[758,4,758,5],[785,4,785,5],[786,4,786,5],[788,7,788,8],[790,4,790,5],[791,4,791,5],[792,4,792,5],[776,7,776,8],[778,4,778,5],[779,4,779,5],[780,4,780,5],[782,7,782,8],[784,4,784,5],[767,4,767,5],[768,4,768,5],[770,7,770,8],[772,4,772,5],[773,4,773,5],[774,4,774,5],[759,4,759,5],[760,4,760,5],[761,4,761,5],[762,4,762,5],[764,7,764,8],[766,4,766,5],[793,4,793,5],[794,4,794,5],[795,4,795,5],[797,7,797,8],[799,4,799,5],[704,4,704,5],[705,4,705,5],[706,4,706,5],[708,7,708,8],[710,4,710,5],[736,7,736,8],[738,4,738,5],[739,4,739,5],[740,4,740,5],[742,7,742,8],[744,4,744,5],[727,4,727,5],[728,4,728,5],[730,7,730,8],[732,4,732,5],[733,4,733,5],[734,4,734,5],[719,4,719,5],[720,4,720,5],[721,4,721,5],[722,4,722,5],[724,7,724,8],[726,4,726,5],[711,4,711,5],[712,4,712,5],[713,4,713,5],[715,7,715,8],[717,4,717,5],[718,4,718,5],[745,4,745,5],[746,4,746,5],[748,7,748,8],[750,4,750,5],[751,4,751,5],[662,4,662,5],[664,7,664,8],[666,4,666,5],[667,4,667,5],[668,4,668,5],[691,4,691,5],[692,4,692,5],[693,4,693,5],[694,4,694,5],[695,4,695,5],[696,4,696,5],[683,4,683,5],[684,4,684,5],[686,7,686,8],[688,4,688,5],[689,4,689,5],[690,4,690,5],[677,4,677,5],[678,4,678,5],[679,4,679,5],[680,4,680,5],[681,4,681,5],[682,4,682,5],[669,4,669,5],[670,4,670,5],[671,4,671,5],[673,7,673,8],[675,4,675,5],[676,4,676,5],[697,4,697,5],[699,7,699,8],[701,4,701,5],[702,4,702,5],[703,4,703,5],[621,7,621,8],[623,4,623,5],[624,4,624,5],[625,4,625,5],[626,4,626,5],[649,4,649,5],[651,7,651,8],[653,4,653,5],[654,4,654,5],[655,4,655,5],[656,4,656,5],[643,4,643,5],[644,4,644,5],[645,4,645,5],[646,4,646,5],[647,4,647,5],[648,4,648,5],[635,4,635,5],[636,4,636,5],[637,4,637,5],[638,4,638,5],[660,4,660,5],[661,4,661,5],[580,4,580,5],[581,4,581,5],[582,4,582,5],[583,4,583,5],[584,4,584,5],[607,4,607,5],[608,4,608,5],[609,4,609,5],[610,4,610,5],[611,4,611,5],[613,7,613,8],[600,7,600,8],[602,4,602,5],[603,4,603,5],[604,4,604,5],[605,4,605,5],[606,4,606,5],[593,4,593,5],[594,4,594,5],[615,4,615,5],[616,4,616,5],[617,4,617,5],[618,4,618,5],[619,4,619,5],[639,4,639,5],[641,7,641,8],[627,4,627,5],[628,4,628,5],[630,7,630,8],[632,4,632,5],[633,4,633,5],[634,4,634,5],[567,4,567,5],[568,4,568,5],[569,4,569,5],[570,4,570,5],[571,4,571,5],[572,4,572,5],[657,4,657,5],[658,4,658,5],[659,4,659,5],[559,4,559,5],[560,4,560,5],[561,4,561,5],[563,7,563,8],[565,4,565,5],[566,4,566,5],[595,4,595,5],[596,4,596,5],[597,4,597,5],[598,4,598,5],[586,7,586,8],[588,0,588,9],[589,4,589,5],[590,4,590,5],[591,4,591,5],[592,4,592,5],[529,7,529,8],[573,4,573,5],[575,7,575,8],[577,4,577,5],[578,4,578,5],[579,4,579,5],[520,7,520,8],[522,4,522,5],[551,4,551,5],[552,4,552,5],[553,4,553,5],[554,4,554,5],[556,7,556,8],[558,4,558,5],[543,4,543,5],[544,4,544,5],[545,4,545,5],[547,7,547,8],[549,4,549,5],[550,4,550,5],[536,4,536,5],[538,7,538,8],[540,4,540,5],[541,4,541,5],[542,4,542,5],[497,4,497,5],[498,4,498,5],[499,4,499,5],[500,4,500,5],[531,4,531,5],[532,4,532,5],[533,4,533,5],[534,4,534,5],[535,4,535,5],[492,4,492,5],[501,4,501,5],[510,4,510,5],[523,4,523,5],[524,4,524,5],[525,4,525,5],[526,4,526,5],[527,4,527,5],[515,4,515,5],[516,4,516,5],[517,4,517,5],[518,4,518,5],[491,4,491,5],[448,4,448,5],[449,4,449,5],[451,7,451,8],[453,4,453,5],[454,4,454,5],[455,4,455,5],[457,7,457,8],[481,4,481,5],[482,4,482,5],[483,4,483,5],[484,4,484,5],[486,7,486,8],[488,4,488,5],[512,7,512,8],[514,4,514,5],[471,4,471,5],[472,4,472,5]],"merged_total":1396,"flags":["merged_cut"]}
[null,null,"Composições Analíticas com Preço Unitário",null,"Bancos",null,"B.D.I.",null,"Encargos Sociais"]
[null,null,"Espaço Multiuso - Tipo 02",null,"SINAPI - 08/2024 - Sergipe\nORSE - 06/2024 - Sergipe\n",null,"23,54%",null,"Não Desonerado: \nHorista: 112,54%\nMensalista: 70,11%"]
["Composições Analíticas com Preço Unitário"]
["Composições Principais"]
[" 1.1.1 ","Código","Banco","Descrição","Tipo",null,"Und","Quant.","Valor Unit","Total"]
["Composição"," 00000003 ","Próprio","Mobilização de equipamentos e pessoal (pequenas obras)","CANT - CANTEIRO DE OBRAS",null,"un",1,1309.8,1309.8]
["Composição Auxiliar"," 73467 ","SINAPI","CAMINHÃO TOCO, PBT 14.300 KG, CARGA ÚTIL MÁX. 9.710 KG, DIST. ENTRE EIXOS 3,56 M, POTÊNCIA 185 CV, INCLUSIVE CARROCERIA FIXA ABERTA DE MADEIRA P/ TRANSPORTE GERAL DE CARGA SECA, DIMEN. APROX. 2,50 X 6,50 X 0,50 M - CHP DIURNO. AF_06/2014","CHOR - CUSTOS HORÁRIOS DE MÁQUINAS E EQUIPAMENTOS",null,"CHP",5,235.6,1178]
["Insumo"," 4415 ","ORSE","Veículo leve - Volkswagen:GOL 1000 - automóvel até 100 hp","Equipamento",null,"h",10,13.18,131.80000000000001]
[]
[]
{"$rows_left_out":1742}
{"sheet":"Memória de cálculo","index":7,"n_rows":98,"n_cols":15,"rows_kept":98,"cut":false,"hidden":false,"merged":[[9,0,9,8],[17,0,17,3],[17,5,17,6],[17,7,17,8],[5,0,5,3],[5,5,5,9],[6,0,6,3],[6,5,6,6],[6,7,6,8],[7,0,7,3],[7,5,7,6],[7,7,7,8],[11,0,11,4],[0,2,0,9],[1,2,1,9],[2,0,2,1],[2,2,2,9],[3,0,3,9],[4,1,4,7],[4,8,4,9],[8,0,8,3],[8,5,8,6],[8,7,8,8],[11,6,11,9],[14,0,14,4],[14,6,14,9],[15,0,15,4],[15,6,15,9],[16,0,16,9],[12,0,12,4],[12,6,12,9],[13,0,13,4],[13,6,13,9],[19,0,19,8],[20,0,20,3],[21,0,21,3],[18,0,18,3],[18,5,18,6],[18,7,18,8],[29,0,29,3],[46,0,46,8],[30,0,30,8],[32,0,32,2],[33,0,37,0],[33,1,33,2],[34,1,34,2],[38,0,40,2],[22,0,22,8],[23,0,23,9],[35,1,35,2],[36,1,36,2],[37,1,37,2],[24,0,24,3],[25,0,25,3],[26,0,26,8],[28,0,28,3],[53,0,53,9],[54,0,54,3],[42,0,42,3],[43,0,43,3],[44,0,44,3],[45,0,45,3],[52,0,52,8],[49,0,49,3],[49,5,49,8],[50,0,50,3],[50,5,50,8],[51,0,51,3],[51,5,51,8],[48,0,48,3],[48,5,48,8],[60,0,60,9],[61,0,61,3],[62,0,62,3],[55,0,55,3],[56,0,56,8],[58,0,58,3],[59,0,59,3],[70,0,70,3],[71,0,71,3],[63,0,63,3],[64,0,64,8],[66,0,66,3],[67,0,67,3],[68,0,68,8],[95,0,95,3],[97,0,97,8],[85,0,85,3],[86,0,86,3],[91,0,91,3],[92,0,92,8],[94,0,94,3],[88,0,88,3],[72,0,72,3],[89,0,89,3],[90,0,90,3],[75,0,75,3],[76,0,76,3],[77,0,77,8],[82,0,82,3],[83,0,83,3],[79,0,79,3],[80,0,80,3],[78,0,78,9],[73,0,73,3],[96,0,96,3]]}
[null,null,"Ministério da Integração e do Desenvolvimento Regional - MIDR"]
[null,null,"Companhia de Desenvovimento dos Vales do São Francisco e do Parnaíba"]
[null,null,"4ª Gerência Regional de Infraestrutura "]
["MEMÓRIA DE CÁLCULOS DOS QUANTITATIVOS "]
["OBRA:","CONSTRUÇÃO DE 01 (UM) ESPAÇO MULTIUSO"]
["DESCRIÇÃO DOS SERVIÇOS",null,null,null,"UNID","C Á L C U L O",{"$nulls":5},"DIMENSÕES","COMPRIMENTO\n M","LARGURA\n M","ÁREA\nM2"]
["LIMPEZA/REGULARIZAÇÃO",null,null,null,"M2",null,null,"ESPAÇO",null,"TOTAL",null,"TERRENO",36.43,26.57,{"$f":"M7*N7","v":967.94510000000002}]
["ÁREA CONSTRUÍDA",null,null,null,"M2",null,null,967.95,null,{"$f":"F8+H8","v":967.95},null,"QUADRA",32.130000000000003,20.170000000000002,{"$f":"M8*N8","v":648.0621000000001}]
[]
["TOTAL LIMPEZA/REGULARIZAÇÃO",{"$nulls":8},{"$f":"ROUND(SUM(J8:J9),2)","v":967.95}]
{"$rows_left_out":88}