{"text_format":"2","workbook":"xlsx","n_sheets":9,"sheets":["Resumo do Orçamento","Orçamento Sintético","Cronograma","BDI","Encargos Sociais","Curva ABC de Serviços","CPUs","Memória multiuso","Memória banheiros"],"not_rendered":{"charts":0,"images":3,"macros":0,"external_links":3,"defined_names":375,"comments":0,"pivot_tables":0},"unopened":[],"bounds":{"document_bytes":16777216,"sheet_cells":100000,"run_cost":"one","rows_first":2000,"rows_last":500,"rows_between":2000,"halvings":0,"cell_chars":16384,"cell_head_chars":4096},"cells_cut":0,"cells_raw":0,"read":"whole","date_system":"1900"}

{"sheet":"Resumo do Orçamento","index":0,"n_rows":17,"n_cols":12,"rows_kept":17,"cut":false,"hidden":false,"merged":[[0,0,2,10],[3,5,3,7],[3,8,3,10],[4,5,4,7],[4,8,4,10],[8,0,8,10],[9,0,9,2],[9,3,9,8],[10,0,10,2],[10,3,10,8],[11,0,11,2],[11,3,11,8],[12,0,12,2],[12,3,12,8],[13,0,13,2],[13,3,13,8],[14,0,14,2],[14,3,14,8],[16,0,16,2],[16,6,16,7],[16,8,16,10]]}
["LOGO DA EMPRESA"]
[]
[]
[null,null,null,"Obra","Bancos","B.D.I.",null,null,"Encargos Sociais"]
[null,null,null,"Espaço Multiuso - Tipo 01","SINAPI - 08/2024 - Sergipe\nORSE - 06/2024 - Sergipe\n","23,54%",null,null,"Não Desonerado: \nHorista: 112,54%\nMensalista: 70,11%"]
[]
{"$rows_left_out":12}
{"sheet":"Orçamento Sintético","index":1,"n_rows":155,"n_cols":10,"rows_kept":155,"cut":false,"hidden":false,"merged":[[0,0,2,8],[8,0,8,8],[3,4,3,5],[3,6,3,7],[4,4,4,5],[4,6,4,7]]}
["LOGO DA EMPRESA"]
[]
[]
[null,null,null,"Obra","Bancos",null,"B.D.I.",null,"Encargos Sociais"]
[null,null,null,"Espaço Multiuso - Tipo 01","SINAPI - 08/2024 - Sergipe\nORSE - 06/2024 - Sergipe\n",null,"23,54%",null,"Não Desonerado: \nHorista: 112,54%\nMensalista: 70,11%"]
[]
{"$rows_left_out":150}
{"sheet":"Cronograma","index":2,"n_rows":27,"n_cols":11,"rows_kept":27,"cut":false,"hidden":false,"merged":[[15,0,16,0],[15,1,16,1],[15,2,16,2],[19,0,20,0],[19,1,20,1],[19,2,20,2],[17,0,18,0],[17,1,18,1],[17,2,18,2],[11,0,12,0],[11,1,12,1],[11,2,12,2],[13,0,14,0],[13,1,14,1],[13,2,14,2],[4,0,4,9],[5,0,5,9],[6,0,6,9],[8,0,9,0],[8,1,9,1],[8,2,9,2],[8,4,8,9]]}
[null,"                                               Ministério da Integração e do Desenvolvimento Regional - MIDR "]
[null,"                                               Companhia de Desenvolvimento dos Vales do São Francisco e do Parnaíba "]
[null,"                                               Gerência Regional de Infraestrutura "]
[]
[{"$f":"'Resumo do Orçamento'!D5","v":"Espaço Multiuso - Tipo 01"}]
[]
{"$rows_left_out":22}
{"sheet":"BDI","index":3,"n_rows":31,"n_cols":4,"rows_kept":31,"cut":false,"hidden":false,"merged":[[28,0,29,0],[28,2,29,2],[28,3,29,3],[30,0,34,3],[0,1,0,3],[1,1,1,3],[2,1,2,3],[26,1,26,2],[5,0,5,3],[6,0,6,3],[8,0,9,0],[8,1,9,2],[8,3,9,3]]}
[null,"Ministério da Integração e do Desenvolvimento Regional - MIDR"]
[null,"Companhia de Desenvolvimento dos Vales do São Francisco e do Parnaíba "]
[null,"4ª Gerência Regional de Infraestrutura "]
[]
[null,null,null,"Sem Desoneração"]
[]
{"$rows_left_out":26}
{"sheet":"Encargos Sociais","index":4,"n_rows":44,"n_cols":4,"rows_kept":44,"cut":false,"hidden":false,"merged":[[0,1,0,3],[1,1,1,3],[2,1,2,3],[38,0,38,1],[39,1,39,3],[42,0,42,1],[43,0,43,1],[4,0,4,3],[7,0,8,1],[9,1,9,3],[19,0,19,1],[20,1,20,3],[31,0,31,1],[32,1,32,3]]}
[null,"Ministério da Integração e do Desenvolvimento Regional - MIDR"]
[null,"Companhia de Desenvovimento dos Vales do São Francisco e do Parnaíba"]
[null,"4ª Gerência Regional de Infraestrutura "]
[]
["Detalhamento dos Encargos Sociais – Horista e Mensalista – Não Desonerado"]
[]
{"$rows_left_out":39}
{"sheet":"Curva ABC de Serviços","index":5,"n_rows":112,"n_cols":10,"rows_kept":112,"cut":false,"hidden":false,"merged":[[0,4,0,6],[0,7,0,9],[1,4,1,6],[1,7,1,9],[2,0,2,9]]}
[null,null,"Obra","Bancos","B.D.I.",null,null,"Encargos Sociais"]
[null,null,"Espaço Multiuso - Tipo 01","SINAPI - 08/2024 - Sergipe\nORSE - 06/2024 - Sergipe\n","23,54%",null,null,"Não Desonerado: \nHorista: 112,54%\nMensalista: 70,11%"]
["Curva ABC de Serviços"]
["Código","Banco","Descrição","Tipo","Und","Quant.","Valor  Unit","Total","Peso (%)","Peso Acumulado (%)"]
[" 100777 ","SINAPI","ESTRUTURA TRELIÇADA DE COBERTURA, TIPO SHED, COM LIGAÇÕES PARAFUSADAS, INCLUSOS PERFIS METÁLICOS, CHAPAS METÁLICAS, MÃO DE OBRA E TRANSPORTE COM GUINDASTE - FORNECIMENTO E INSTALAÇÃO. AF_01/2020_PSA","FUES - FUNDAÇÕES E ESTRUTURAS","KG","5.500,0",{"$f":"VLOOKUP(A5,'Orçamento Sintético'!$B$13:$H$155,7,FALSE)","v":14.04},{"$f":"TRUNC(F5*G5,2)","v":77220},{"$f":"H5/$H$112","v":0.13365327270600266},{"$f":"I5","v":0.13365327270600266}]
[" 94994 ","SINAPI","EXECUÇÃO DE PASSEIO (CALÇADA) OU PISO DE CONCRETO COM CONCRETO MOLDADO IN LOCO, FEITO EM OBRA, ACABAMENTO CONVENCIONAL, ESPESSURA 8 CM, ARMADO. AF_08/2022","PISO - PISOS","m²","631,01",{"$f":"VLOOKUP(A6,'Orçamento Sintético'!$B$13:$H$155,7,FALSE)","v":114.52},{"$f":"TRUNC(F6*G6,2)","v":72263.259999999995},{"$f":"H6/$H$112","v":0.12507408955458135},{"$f":"I6+J5","v":0.25872736226058402}]
{"$rows_left_out":107}
{"sheet":"CPUs","index":6,"n_rows":3242,"n_cols":10,"rows_kept":3242,"cut":false,"hidden":false,"merged":[[3243,7,3243,8],[3196,4,3196,5],[3197,4,3197,5],[3198,4,3198,5],[3199,4,3199,5],[3200,4,3200,5],[3227,4,3227,5],[3228,4,3228,5],[3229,4,3229,5],[3231,7,3231,8],[3233,4,3233,5],[3234,4,3234,5],[3217,4,3217,5],[3219,7,3219,8],[3221,4,3221,5],[3222,4,3222,5],[3223,4,3223,5],[3225,7,3225,8],[3210,7,3210,8],[3212,4,3212,5],[3213,4,3213,5],[3214,4,3214,5],[3215,4,3215,5],[3216,4,3216,5],[3201,4,3201,5],[3203,7,3203,8],[3205,4,3205,5],[3206,4,3206,5],[3207,4,3207,5],[3208,4,3208,5],[3235,4,3235,5],[3237,7,3237,8],[3239,4,3239,5],[3240,4,3240,5],[3241,4,3241,5],[3154,4,3154,5],[3155,4,3155,5],[3156,4,3156,5],[3157,4,3157,5],[3158,4,3158,5],[3183,4,3183,5],[3184,4,3184,5],[3185,4,3185,5],[3186,4,3186,5],[3187,4,3187,5],[3188,4,3188,5],[3175,4,3175,5],[3176,4,3176,5],[3177,4,3177,5],[3178,4,3178,5],[3179,4,3179,5],[3195,4,3195,5],[3181,7,3181,8],[3167,4,3167,5],[3168,4,3168,5],[3169,4,3169,5],[3170,4,3170,5],[3172,7,3172,8],[3174,4,3174,5],[3159,4,3159,5],[3160,4,3160,5],[3161,4,3161,5],[3162,4,3162,5],[3164,7,3164,8],[3166,4,3166,5],[3189,4,3189,5],[3190,4,3190,5],[3192,7,3192,8],[3194,4,3194,5],[3111,7,3111,8],[3113,4,3113,5],[3114,4,3114,5],[3115,4,3115,5],[3116,4,3116,5],[3140,7,3140,8],[3142,4,3142,5],[3143,4,3143,5],[3144,4,3144,5],[3145,4,3145,5],[3146,4,3146,5],[3133,4,3133,5],[3134,4,3134,5],[3135,4,3135,5],[3136,4,3136,5],[3137,4,3137,5],[3138,4,3138,5],[3125,4,3125,5],[3126,4,3126,5],[3127,4,3127,5],[3128,4,3128,5],[3129,4,3129,5],[3131,7,3131,8],[3118,7,3118,8],[3120,4,3120,5],[3121,4,3121,5],[3122,4,3122,5],[3123,4,3123,5],[3124,4,3124,5],[3147,4,3147,5],[3148,4,3148,5],[3149,4,3149,5],[3151,7,3151,8],[3153,4,3153,5],[3067,7,3067,8],[3069,4,3069,5],[3070,4,3070,5],[3071,4,3071,5],[3073,7,3073,8],[3098,7,3098,8],[3100,4,3100,5],[3101,4,3101,5],[3102,4,3102,5],[3103,4,3103,5],[3104,4,3104,5],[3091,4,3091,5],[3092,4,3092,5],[3093,4,3093,5],[3094,4,3094,5],[3095,4,3095,5],[3096,4,3096,5],[3083,4,3083,5],[3085,7,3085,8],[3087,4,3087,5],[3088,4,3088,5],[3089,4,3089,5],[3090,4,3090,5],[3075,4,3075,5],[3076,4,3076,5],[3077,4,3077,5],[3079,7,3079,8],[3081,4,3081,5],[3082,4,3082,5],[3105,4,3105,5],[3106,4,3106,5],[3107,4,3107,5],[3108,4,3108,5],[3109,4,3109,5],[3019,7,3019,8],[3021,4,3021,5],[3022,4,3022,5],[3023,4,3023,5],[3025,7,3025,8],[3053,4,3053,5],[3054,4,3054,5],[3055,4,3055,5],[3056,4,3056,5],[3057,4,3057,5],[3058,4,3058,5],[3045,4,3045,5],[3046,4,3046,5],[3047,4,3047,5],[3048,4,3048,5],[3049,4,3049,5],[3051,7,3051,8],[3035,4,3035,5],[3037,7,3037,8],[3039,4,3039,5],[3040,4,3040,5],[3041,4,3041,5],[3043,7,3043,8],[3027,4,3027,5],[3028,4,3028,5],[3029,4,3029,5],[3031,7,3031,8],[3033,4,3033,5],[3034,4,3034,5],[3059,4,3059,5],[3061,7,3061,8],[3063,4,3063,5],[3064,4,3064,5],[3065,4,3065,5],[2976,4,2976,5],[2977,4,2977,5],[2978,4,2978,5],[2979,4,2979,5],[2980,4,2980,5],[3005,4,3005,5],[3006,4,3006,5],[3007,4,3007,5],[3009,7,3009,8],[3011,4,3011,5],[3012,4,3012,5],[2997,4,2997,5],[2998,4,2998,5],[2999,4,2999,5],[3001,7,3001,8],[3003,4,3003,5],[3004,4,3004,5],[2989,4,2989,5],[2990,4,2990,5],[2991,4,2991,5],[2992,4,2992,5],[2994,7,2994,8],[2996,4,2996,5],[2982,7,2982,8],[2984,4,2984,5],[2985,4,2985,5],[2986,4,2986,5],[2987,4,2987,5],[2988,4,2988,5],[3013,4,3013,5],[3014,4,3014,5],[3015,4,3015,5],[3016,4,3016,5],[3017,4,3017,5],[2928,4,2928,5],[2930,7,2930,8],[2932,4,2932,5],[2933,4,2933,5],[2934,4,2934,5],[2961,4,2961,5],[2962,4,2962,5],[2964,7,2964,8],[2966,4,2966,5],[2967,4,2967,5],[2968,4,2968,5],[2952,7,2952,8],[2954,4,2954,5],[2955,4,2955,5],[2956,4,2956,5],[2958,7,2958,8],[2960,4,2960,5],[2943,4,2943,5],[2944,4,2944,5],[2946,7,2946,8],[2948,4,2948,5],[2949,4,2949,5],[2950,4,2950,5],[2935,4,2935,5],[2937,7,2937,8],[2939,4,2939,5],[2940,4,2940,5],[2941,4,2941,5],[2942,4,2942,5],[2970,7,2970,8],[2972,4,2972,5],[2973,4,2973,5],[2974,4,2974,5],[2975,4,2975,5],[2888,4,2888,5],[2890,7,2890,8],[2892,4,2892,5],[2893,4,2893,5],[2894,4,2894,5],[2915,4,2915,5],[2916,4,2916,5],[2917,4,2917,5],[2918,4,2918,5],[2919,4,2919,5],[2920,4,2920,5],[2907,4,2907,5],[2909,7,2909,8],[2911,4,2911,5],[2912,4,2912,5],[2913,4,2913,5],[2914,4,2914,5],[2901,4,2901,5],[2902,4,2902,5],[2903,4,2903,5],[2904,4,2904,5],[2905,4,2905,5],[2906,4,2906,5],[2895,4,2895,5],[2896,4,2896,5],[2897,4,2897,5],[2898,4,2898,5],[2899,4,2899,5],[2900,4,2900,5],[2922,7,2922,8],[2924,4,2924,5],[2925,4,2925,5],[2926,4,2926,5],[2927,4,2927,5],[2852,4,2852,5],[2853,4,2853,5],[2854,4,2854,5],[2855,4,2855,5],[2856,4,2856,5],[2877,4,2877,5],[2878,4,2878,5],[2879,4,2879,5],[2880,4,2880,5],[2881,4,2881,5],[2882,4,2882,5],[2869,4,2869,5],[2871,7,2871,8],[2873,4,2873,5],[2874,4,2874,5],[2875,4,2875,5],[2876,4,2876,5],[2863,4,2863,5],[2864,4,2864,5],[2865,4,2865,5],[2866,4,2866,5],[2867,4,2867,5],[2868,4,2868,5],[2857,4,2857,5],[2858,4,2858,5],[2859,4,2859,5],[2860,4,2860,5],[2861,4,2861,5],[2862,4,2862,5],[2883,4,2883,5],[2884,4,2884,5],[2885,4,2885,5],[2886,4,2886,5],[2887,4,2887,5],[2812,4,2812,5],[2813,4,2813,5],[2814,4,2814,5],[2815,4,2815,5],[2816,4,2816,5],[2839,4,2839,5],[2840,4,2840,5],[2841,4,2841,5],[2842,4,2842,5],[2843,4,2843,5],[2844,4,2844,5],[2833,4,2833,5],[2834,4,2834,5],[2835,4,2835,5],[2836,4,2836,5],[2837,4,2837,5],[2838,4,2838,5],[2825,4,2825,5],[2826,4,2826,5],[2827,4,2827,5],[2828,4,2828,5],[2829,4,2829,5],[2831,7,2831,8],[2818,7,2818,8],[2820,4,2820,5],[2821,4,2821,5],[2822,4,2822,5],[2823,4,2823,5],[2824,4,2824,5],[2845,4,2845,5],[2846,4,2846,5],[2847,4,2847,5],[2848,4,2848,5],[2850,7,2850,8],[2772,4,2772,5],[2773,4,2773,5],[2774,4,2774,5],[2775,4,2775,5],[2776,4,2776,5],[2799,4,2799,5],[2800,4,2800,5],[2801,4,2801,5],[2802,4,2802,5],[2803,4,2803,5],[2805,7,2805,8],[2792,7,2792,8],[2794,4,2794,5],[2795,4,2795,5],[2796,4,2796,5],[2797,4,2797,5],[2798,4,2798,5],[2785,4,2785,5],[2786,4,2786,5],[2787,4,2787,5],[2788,4,2788,5],[2789,4,2789,5],[2790,4,2790,5],[2777,4,2777,5],[2779,7,2779,8],[2781,4,2781,5],[2782,4,2782,5],[2783,4,2783,5],[2784,4,2784,5],[2807,4,2807,5],[2808,4,2808,5],[2809,4,2809,5],[2810,4,2810,5],[2811,4,2811,5],[2730,4,2730,5],[2731,4,2731,5],[2732,4,2732,5],[2734,7,2734,8],[2736,4,2736,5],[2759,4,2759,5],[2760,4,2760,5],[2761,4,2761,5],[2762,4,2762,5],[2763,4,2763,5],[2764,4,2764,5],[2751,4,2751,5],[2753,7,2753,8],[2755,4,2755,5],[2756,4,2756,5],[2757,4,2757,5],[2758,4,2758,5],[2745,4,2745,5],[2746,4,2746,5],[2747,4,2747,5],[2748,4,2748,5],[2749,4,2749,5],[2750,4,2750,5],[2737,4,2737,5],[2738,4,2738,5],[2740,7,2740,8],[2742,4,2742,5],[2743,4,2743,5],[2744,4,2744,5],[2766,7,2766,8],[2768,4,2768,5],[2769,4,2769,5],[2770,4,2770,5],[2771,4,2771,5],[2686,4,2686,5],[2687,4,2687,5],[2688,4,2688,5],[2689,4,2689,5],[2690,4,2690,5],[2715,4,2715,5],[2716,4,2716,5],[2717,4,2717,5],[2718,4,2718,5],[2720,7,2720,8],[2722,4,2722,5],[2707,4,2707,5],[2708,4,2708,5],[2709,4,2709,5],[2710,4,2710,5],[2711,4,2711,5],[2713,7,2713,8],[2699,4,2699,5],[2700,4,2700,5],[2701,4,2701,5],[2703,7,2703,8],[2705,4,2705,5],[2706,4,2706,5],[2691,4,2691,5],[2692,4,2692,5],[2693,4,2693,5],[2695,7,2695,8],[2697,4,2697,5],[2698,4,2698,5],[2723,4,2723,5],[2724,4,2724,5],[2725,4,2725,5],[2727,7,2727,8],[2729,4,2729,5],[2646,4,2646,5],[2647,4,2647,5],[2648,4,2648,5],[2649,4,2649,5],[2650,4,2650,5],[2673,4,2673,5],[2674,4,2674,5],[2675,4,2675,5],[2676,4,2676,5],[2677,4,2677,5],[2678,4,2678,5],[2665,4,2665,5],[2666,4,2666,5],[2667,4,2667,5],[2669,7,2669,8],[2671,4,2671,5],[2672,4,2672,5],[2659,4,2659,5],[2660,4,2660,5],[2661,4,2661,5],[2662,4,2662,5],[2663,4,2663,5],[2664,4,2664,5],[2651,4,2651,5],[2652,4,2652,5],[2653,4,2653,5],[2654,4,2654,5],[2656,7,2656,8],[2658,4,2658,5],[2679,4,2679,5],[2680,4,2680,5],[2682,7,2682,8],[2684,4,2684,5],[2685,4,2685,5],[2606,4,2606,5],[2607,4,2607,5],[2608,4,2608,5],[2609,4,2609,5],[2610,4,2610,5],[2633,4,2633,5],[2634,4,2634,5],[2635,4,2635,5],[2636,4,2636,5],[2637,4,2637,5],[2638,4,2638,5],[2625,4,2625,5],[2626,4,2626,5],[2627,4,2627,5],[2628,4,2628,5],[2630,7,2630,8],[2632,4,2632,5],[2619,4,2619,5],[2620,4,2620,5],[2621,4,2621,5],[2622,4,2622,5],[2623,4,2623,5],[2624,4,2624,5],[2611,4,2611,5],[2612,4,2612,5],[2613,4,2613,5],[2614,4,2614,5],[2615,4,2615,5],[2617,7,2617,8],[2639,4,2639,5],[2640,4,2640,5],[2641,4,2641,5],[2643,7,2643,8],[2645,4,2645,5],[2562,4,2562,5],[2564,7,2564,8],[2566,4,2566,5],[2567,4,2567,5],[2568,4,2568,5],[2591,4,2591,5],[2592,4,2592,5],[2593,4,2593,5],[2594,4,2594,5],[2596,7,2596,8],[2598,4,2598,5],[2583,4,2583,5],[2585,7,2585,8],[2587,4,2587,5],[2588,4,2588,5],[2589,4,2589,5],[2590,4,2590,5],[2577,4,2577,5],[2578,4,2578,5],[2579,4,2579,5],[2580,4,2580,5],[2581,4,2581,5],[2582,4,2582,5],[2569,4,2569,5],[2570,4,2570,5],[2571,4,2571,5],[2572,4,2572,5],[2574,7,2574,8],[2576,4,2576,5],[2599,4,2599,5],[2600,4,2600,5],[2601,4,2601,5],[2602,4,2602,5],[2604,7,2604,8],[2516,4,2516,5],[2517,4,2517,5],[2518,4,2518,5],[2519,4,2519,5],[2520,4,2520,5],[2547,4,2547,5],[2548,4,2548,5],[2550,7,2550,8],[2552,4,2552,5],[2553,4,2553,5],[2554,4,2554,5],[2539,4,2539,5],[2540,4,2540,5],[2541,4,2541,5],[2543,7,2543,8],[2545,4,2545,5],[2546,4,2546,5],[2531,4,2531,5],[2532,4,2532,5],[2533,4,2533,5],[2534,4,2534,5],[2536,7,2536,8],[2538,4,2538,5],[2522,7,2522,8],[2524,4,2524,5],[2525,4,2525,5],[2526,4,2526,5],[2527,4,2527,5],[2529,7,2529,8],[2556,7,2556,8],[2558,4,2558,5],[2559,4,2559,5],[2560,4,2560,5],[2561,4,2561,5],[2468,4,2468,5],[2470,7,2470,8],[2472,4,2472,5],[2473,4,2473,5],[2474,4,2474,5],[2501,4,2501,5],[2502,4,2502,5],[2503,4,2503,5],[2505,7,2505,8],[2507,4,2507,5],[2508,4,2508,5],[2491,4,2491,5],[2493,7,2493,8],[2495,4,2495,5],[2496,4,2496,5],[2497,4,2497,5],[2499,7,2499,8],[2483,4,2483,5],[2484,4,2484,5],[2485,4,2485,5],[2487,7,2487,8],[2489,4,2489,5],[2490,4,2490,5],[2475,4,2475,5],[2476,4,2476,5],[2477,4,2477,5],[2478,4,2478,5],[2479,4,2479,5],[2481,7,2481,8],[2509,4,2509,5],[2511,7,2511,8],[2513,4,2513,5],[2514,4,2514,5],[2515,4,2515,5],[2422,4,2422,5],[2423,4,2423,5],[2424,4,2424,5],[2425,4,2425,5],[2434,4,2434,5],[2453,4,2453,5],[2455,7,2455,8],[2457,4,2457,5],[2458,4,2458,5],[2459,4,2459,5],[2461,7,2461,8],[2445,4,2445,5],[2446,4,2446,5],[2447,4,2447,5],[2449,7,2449,8],[2451,4,2451,5],[2452,4,2452,5],[2435,4,2435,5],[2437,7,2437,8],[2439,4,2439,5],[2440,4,2440,5],[2441,4,2441,5],[2443,7,2443,8],[2427,7,2427,8],[2429,4,2429,5],[2430,4,2430,5],[2431,4,2431,5],[2432,4,2432,5],[2433,4,2433,5],[2463,4,2463,5],[2464,4,2464,5],[2465,4,2465,5],[2466,4,2466,5],[2467,4,2467,5],[2380,4,2380,5],[2381,4,2381,5],[2382,4,2382,5],[2383,4,2383,5],[2385,7,2385,8],[2407,4,2407,5],[2408,4,2408,5],[2409,4,2409,5],[2411,7,2411,8],[2413,4,2413,5],[2414,4,2414,5],[2401,4,2401,5],[2402,4,2402,5],[2403,4,2403,5],[2404,4,2404,5],[2405,4,2405,5],[2406,4,2406,5],[2393,4,2393,5],[2394,4,2394,5],[2395,4,2395,5],[2396,4,2396,5],[2398,7,2398,8],[2400,4,2400,5],[2387,4,2387,5],[2388,4,2388,5],[2389,4,2389,5],[2390,4,2390,5],[2391,4,2391,5],[2392,4,2392,5],[2415,4,2415,5],[2416,4,2416,5],[2417,4,2417,5],[2419,7,2419,8],[2421,4,2421,5],[2340,4,2340,5],[2341,4,2341,5],[2342,4,2342,5],[2343,4,2343,5],[2344,4,2344,5],[2367,4,2367,5],[2368,4,2368,5],[2370,7,2370,8],[2372,4,2372,5],[2373,4,2373,5],[2374,4,2374,5],[2361,4,2361,5],[2362,4,2362,5],[2363,4,2363,5],[2364,4,2364,5],[2365,4,2365,5],[2366,4,2366,5],[2353,4,2353,5],[2354,4,2354,5],[2355,4,2355,5],[2356,4,2356,5],[2358,7,2358,8],[2360,4,2360,5],[2345,4,2345,5],[2347,7,2347,8],[2349,4,2349,5],[2350,4,2350,5],[2351,4,2351,5],[2352,4,2352,5],[2375,4,2375,5],[2376,4,2376,5],[2377,4,2377,5],[2378,4,2378,5],[2379,4,2379,5],[2304,4,2304,5],[2305,4,2305,5],[2306,4,2306,5],[2307,4,2307,5],[2308,4,2308,5],[2329,4,2329,5],[2330,4,2330,5],[2331,4,2331,5],[2332,4,2332,5],[2333,4,2333,5],[2334,4,2334,5],[2323,4,2323,5],[2324,4,2324,5],[2325,4,2325,5],[2326,4,2326,5],[2327,4,2327,5],[2328,4,2328,5],[2317,4,2317,5],[2318,4,2318,5],[2319,4,2319,5],[2320,4,2320,5],[2321,4,2321,5],[2322,4,2322,5],[2309,4,2309,5],[2311,7,2311,8],[2313,4,2313,5],[2314,4,2314,5],[2315,4,2315,5],[2316,4,2316,5],[2335,4,2335,5],[2336,4,2336,5],[2337,4,2337,5],[2338,4,2338,5],[2339,4,2339,5],[2267,7,2267,8],[2269,4,2269,5],[2270,4,2270,5],[2271,4,2271,5],[2272,4,2272,5],[2293,4,2293,5],[2294,4,2294,5],[2295,4,2295,5],[2296,4,2296,5],[2297,4,2297,5],[2298,4,2298,5],[2285,4,2285,5],[2286,4,2286,5],[2288,7,2288,8],[2290,4,2290,5],[2291,4,2291,5],[2292,4,2292,5],[2279,4,2279,5],[2280,4,2280,5],[2281,4,2281,5],[2282,4,2282,5],[2283,4,2283,5],[2284,4,2284,5],[2273,4,2273,5],[2274,4,2274,5],[2275,4,2275,5],[2276,4,2276,5],[2277,4,2277,5],[2278,4,2278,5],[2299,4,2299,5],[2300,4,2300,5],[2301,4,2301,5],[2302,4,2302,5],[2303,4,2303,5],[2230,4,2230,5],[2231,4,2231,5],[2232,4,2232,5],[2233,4,2233,5],[2234,4,2234,5],[2255,4,2255,5],[2256,4,2256,5],[2257,4,2257,5],[2258,4,2258,5],[2259,4,2259,5],[2260,4,2260,5],[2249,4,2249,5],[2250,4,2250,5],[2251,4,2251,5],[2252,4,2252,5],[2253,4,2253,5],[2254,4,2254,5],[2243,4,2243,5],[2244,4,2244,5],[2245,4,2245,5],[2246,4,2246,5],[2247,4,2247,5],[2248,4,2248,5],[2235,4,2235,5],[2237,7,2237,8],[2239,4,2239,5],[2240,4,2240,5],[2241,4,2241,5],[2242,4,2242,5],[2261,4,2261,5],[2262,4,2262,5],[2263,4,2263,5],[2264,4,2264,5],[2265,4,2265,5],[2194,4,2194,5],[2195,4,2195,5],[2196,4,2196,5],[2197,4,2197,5],[2198,4,2198,5],[2219,4,2219,5],[2220,4,2220,5],[2221,4,2221,5],[2222,4,2222,5],[2223,4,2223,5],[2224,4,2224,5],[2213,4,2213,5],[2214,4,2214,5],[2215,4,2215,5],[2216,4,2216,5],[2217,4,2217,5],[2218,4,2218,5],[2205,4,2205,5],[2206,4,2206,5],[2207,4,2207,5],[2208,4,2208,5],[2209,4,2209,5],[2211,7,2211,8],[2199,4,2199,5],[2200,4,2200,5],[2201,4,2201,5],[2202,4,2202,5],[2203,4,2203,5],[2204,4,2204,5],[2225,4,2225,5],[2226,4,2226,5],[2227,4,2227,5],[2228,4,2228,5],[2229,4,2229,5],[2156,4,2156,5],[2157,4,2157,5],[2158,4,2158,5],[2159,4,2159,5],[2160,4,2160,5],[2181,4,2181,5],[2182,4,2182,5],[2183,4,2183,5],[2184,4,2184,5],[2185,4,2185,5],[2186,4,2186,5],[2175,4,2175,5],[2176,4,2176,5],[2177,4,2177,5],[2178,4,2178,5],[2179,4,2179,5],[2180,4,2180,5],[2169,4,2169,5],[2170,4,2170,5],[2171,4,2171,5],[2172,4,2172,5],[2173,4,2173,5],[2174,4,2174,5],[2161,4,2161,5],[2163,7,2163,8],[2165,4,2165,5],[2166,4,2166,5],[2167,4,2167,5],[2168,4,2168,5],[2188,7,2188,8],[2190,4,2190,5],[2191,4,2191,5],[2192,4,2192,5],[2193,4,2193,5],[2116,4,2116,5],[2117,4,2117,5],[2118,4,2118,5],[2119,4,2119,5],[2120,4,2120,5],[2145,4,2145,5],[2146,4,2146,5],[2147,4,2147,5],[2148,4,2148,5],[2149,4,2149,5],[2150,4,2150,5],[2137,4,2137,5],[2138,4,2138,5],[2139,4,2139,5],[2140,4,2140,5],[2142,7,2142,8],[2144,4,2144,5],[2129,4,2129,5],[2131,7,2131,8],[2133,4,2133,5],[2134,4,2134,5],[2135,4,2135,5],[2136,4,2136,5],[2122,7,2122,8],[2124,4,2124,5],[2125,4,2125,5],[2126,4,2126,5],[2127,4,2127,5],[2128,4,2128,5],[2151,4,2151,5],[2152,4,2152,5],[2153,4,2153,5],[2154,4,2154,5],[2155,4,2155,5],[2074,4,2074,5],[2075,4,2075,5],[2077,7,2077,8],[2079,4,2079,5],[2080,4,2080,5],[2103,4,2103,5],[2104,4,2104,5],[2105,4,2105,5],[2106,4,2106,5],[2107,4,2107,5],[2108,4,2108,5],[2095,4,2095,5],[2096,4,2096,5],[2098,7,2098,8],[2100,4,2100,5],[2101,4,2101,5],[2102,4,2102,5],[2087,4,2087,5],[2088,4,2088,5],[2090,7,2090,8],[2092,4,2092,5],[2093,4,2093,5],[2094,4,2094,5],[2081,4,2081,5],[2082,4,2082,5],[2083,4,2083,5],[2084,4,2084,5],[2085,4,2085,5],[2086,4,2086,5],[2109,4,2109,5],[2111,7,2111,8],[2113,4,2113,5],[2114,4,2114,5],[2115,4,2115,5],[2031,7,2031,8],[2033,4,2033,5],[2034,4,2034,5],[2035,4,2035,5],[2036,4,2036,5],[2060,7,2060,8],[2062,4,2062,5],[2063,4,2063,5],[2064,4,2064,5],[2065,4,2065,5],[2066,4,2066,5],[2053,4,2053,5],[2054,4,2054,5],[2055,4,2055,5],[2056,4,2056,5],[2057,4,2057,5],[2058,4,2058,5],[2045,4,2045,5],[2046,4,2046,5],[2047,4,2047,5],[2049,7,2049,8],[2051,4,2051,5],[2052,4,2052,5],[2037,4,2037,5],[2038,4,2038,5],[2039,4,2039,5],[2040,4,2040,5],[2042,7,2042,8],[2044,4,2044,5],[2068,7,2068,8],[2070,4,2070,5],[2071,4,2071,5],[2072,4,2072,5],[2073,4,2073,5],[1982,4,1982,5],[1983,4,1983,5],[1994,4,1994,5],[1995,4,1995,5],[2006,4,2006,5],[2017,4,2017,5],[2018,4,2018,5],[2019,4,2019,5],[2020,4,2020,5],[2021,4,2021,5],[2023,7,2023,8],[2007,4,2007,5],[2009,7,2009,8]],"merged_total":2585,"flags":["merged_cut"]}
[null,null,"Composições Analíticas com Preço Unitário",null,"Bancos",null,"B.D.I.",null,"Encargos Sociais"]
[null,null,"Espaço Multiuso - Tipo 01",null,"SINAPI - 08/2024 - Sergipe\nORSE - 06/2024 - Sergipe\n",null,"23,54%",null,"Não Desonerado: \nHorista: 112,54%\nMensalista: 70,11%"]
["Composições Analíticas com Preço Unitário"]
["Composições Principais"]
[" 1.1.1 ","Código","Banco","Descrição","Tipo",null,"Und","Quant.","Valor Unit","Total"]
["Composição"," 00000003 ","Próprio","Mobilização de equipamentos e pessoal (pequenas obras)","CANT - CANTEIRO DE OBRAS",null,"un",1,1309.8,1309.8]
{"$rows_left_out":3237}
{"sheet":"Memória multiuso","index":7,"n_rows":146,"n_cols":15,"rows_kept":146,"cut":false,"hidden":false,"merged":[[145,0,145,8],[141,0,141,3],[141,5,141,6],[141,7,141,8],[143,0,143,3],[144,0,144,3],[52,0,54,2],[91,0,91,3],[103,0,103,3],[136,0,136,3],[138,0,138,8],[115,0,115,3],[116,0,116,3],[140,0,140,3],[140,5,140,6],[140,7,140,8],[129,0,129,3],[130,0,130,3],[131,0,131,8],[133,0,133,3],[134,0,134,3],[135,0,135,3],[64,0,64,3],[123,0,123,3],[124,0,124,3],[125,0,125,3],[126,0,126,3],[127,0,127,3],[128,0,128,3],[122,0,122,9],[105,0,105,3],[106,0,106,3],[107,0,107,8],[112,0,112,3],[113,0,113,3],[118,0,118,3],[119,0,119,3],[120,0,120,3],[121,0,121,3],[121,5,121,9],[109,0,109,3],[110,0,110,3],[108,0,108,9],[100,0,100,3],[101,0,101,3],[102,0,102,3],[92,0,92,3],[93,0,93,3],[94,0,94,8],[96,0,96,3],[97,0,97,3],[98,0,98,8],[83,0,83,9],[87,0,87,3],[88,0,88,3],[89,0,89,3],[90,0,90,3],[74,0,74,3],[75,0,75,3],[76,0,76,3],[77,0,77,3],[78,0,78,3],[79,0,79,8],[81,0,81,3],[82,0,82,3],[84,0,84,3],[85,0,85,3],[72,0,72,9],[73,0,73,3],[56,0,56,3],[57,0,57,3],[58,0,58,3],[59,0,59,3],[60,0,60,3],[61,0,61,3],[42,0,49,0],[42,1,43,2],[44,1,45,2],[46,1,46,2],[47,1,47,2],[48,1,48,2],[49,1,49,2],[71,0,71,8],[68,0,68,3],[68,5,68,8],[69,0,69,3],[69,5,69,8],[70,0,70,3],[70,5,70,8],[39,1,39,2],[40,1,40,2],[41,1,41,2],[26,0,26,3],[27,0,27,3],[28,0,28,3],[30,0,30,8],[32,0,32,3],[67,0,67,3],[67,5,67,8],[33,0,33,3],[62,0,62,3],[65,0,65,8],[34,0,34,8],[36,0,36,2],[37,0,41,0],[37,1,37,2],[38,1,38,2],[19,0,19,8],[20,0,20,3],[21,0,21,3],[18,0,18,3],[18,5,18,6],[18,7,18,8],[22,0,22,3],[24,0,24,8],[25,0,25,9],[7,5,7,6],[7,7,7,8],[11,0,11,4],[11,6,11,9],[14,0,14,4],[14,6,14,9],[15,0,15,4],[15,6,15,9],[16,0,16,9],[12,0,12,4],[12,6,12,9],[13,0,13,4],[13,6,13,9],[137,0,137,3],[63,0,63,3],[29,0,29,3],[23,0,23,3],[0,2,0,9],[1,2,1,9],[2,0,2,1],[2,2,2,9],[3,0,3,9],[4,1,4,7],[4,8,4,9],[8,0,8,3],[8,5,8,6],[8,7,8,8],[9,0,9,8],[17,0,17,3],[17,5,17,6],[17,7,17,8],[5,0,5,3],[5,5,5,9],[6,0,6,3],[6,5,6,6],[6,7,6,8],[7,0,7,3]]}
[null,null,"Ministério da Integração e do Desenvolvimento Regional - MIDR"]
[null,null,"Companhia de Desenvovimento dos Vales do São Francisco e do Parnaíba"]
[null,null,"4ª Gerência Regional de Infraestrutura "]
["MEMÓRIA DE CÁLCULOS DOS QUANTITATIVOS "]
["OBRA:","CONSTRUÇÃO DE 01 (UM) ESPAÇO MULTIUSO"]
["DESCRIÇÃO DOS SERVIÇOS",null,null,null,"UNID","C Á L C U L O",{"$nulls":5},"DIMENSÕES","COMPRIMENTO\n M","LARGURA\n M","ÁREA\nM2"]
{"$rows_left_out":141}
{"sheet":"Memória banheiros","index":8,"n_rows":178,"n_cols":12,"rows_kept":178,"cut":false,"hidden":false,"merged":[[9,2,9,9],[0,2,0,7],[1,2,1,7],[2,2,2,7],[3,2,3,7],[4,2,4,7],[10,2,10,9],[11,0,11,1],[11,2,11,9],[12,0,12,9],[13,1,13,7],[13,8,13,9]]}
[]
[]
[]
[]
[]
["MEMÓRIA DE CÁLCULO DOS BANHEIROS"]
{"$rows_left_out":172}