{"text_format":"2","workbook":"xlsx","n_sheets":13,"sheets":["RESUMO MODULO TOTAL","CRONOGRAMA TOTAL","BDI","ENC. SOCIAIS","MC MODULO","MOMENTO DE TRANSPORTE - PRINC","MOMENTO DE TRANSPORTE - AUX","Mob"," Canteiro","Adm Local","Projeto Executivo","CPUs","Curva ABC de Serviços"],"not_rendered":{"charts":0,"images":10,"macros":0,"external_links":201,"defined_names":30150,"comments":0,"pivot_tables":0},"unopened":[],"bounds":{"document_bytes":16777216,"sheet_cells":100000,"run_cost":"one","rows_first":2000,"rows_last":500,"rows_between":2000,"halvings":0,"cell_chars":16384,"cell_head_chars":4096},"cells_cut":0,"cells_raw":0,"read":"whole","date_system":"1900"}

{"sheet":"RESUMO MODULO TOTAL","index":0,"n_rows":57,"n_cols":31,"rows_kept":57,"cut":false,"hidden":false,"merged":[[48,1,48,12],[30,4,30,7],[32,4,32,7],[38,4,38,7],[40,4,40,7],[42,4,42,7],[43,4,43,7],[44,4,44,7],[45,4,45,7],[46,4,46,7],[47,4,47,7],[36,4,36,7],[31,4,31,7],[35,4,35,7],[26,4,26,7],[24,4,24,7],[25,4,25,7],[27,4,27,7],[33,4,33,7],[28,4,28,7],[29,4,29,7],[10,18,10,19],[11,4,11,7],[14,4,14,7],[15,4,15,7],[19,4,19,7],[23,4,23,7],[22,4,22,7],[17,4,17,7],[12,4,12,7],[1,1,4,11],[20,4,20,7],[6,4,9,7],[7,9,8,9],[5,1,5,13],[6,1,9,1],[6,2,9,2],[6,3,9,3],[7,12,9,12],[7,13,9,13]]}
[null,"EXECUÇÃO DE SERVIÇOS DE IMPLANTAÇÃO DE PAVIMENTAÇÃO EM BLOCO DE CONCRETO INTERTRAVADO, EM VIAS DE MUNICÍPIOS DIVERSOS INSERIDOS NA ÁREA DE ATUAÇÃO DA CODEVASF, NO ESTADO SERGIPE",{"$nulls":11},"SERGIPE"]
[null,"LOGO DA LICITANTE",{"$nulls":10},"SICRO:","2024-04-01"]
[{"$nulls":12},"SINAPI:","2024-07-01"]
[{"$nulls":12},"DATA BASE:",{"$f":"TODAY()","v":"2024-10-31"}]
[{"$nulls":12},"DESCONTO:",0,"Inserir o desconto ofertado na plataforma"]
[null,{"$f":"B1","v":"EXECUÇÃO DE SERVIÇOS DE IMPLANTAÇÃO DE PAVIMENTAÇÃO EM BLOCO DE CONCRETO INTERTRAVADO, EM VIAS DE MUNICÍPIOS DIVERSOS INSERIDOS NA ÁREA DE ATUAÇÃO DA CODEVASF, NO ESTADO SERGIPE"}]
[null,"ITEM","ORIGEM\nCOMPOSIÇÃO","CÓDIGO\nCOMPOSIÇÃO","DISCRIMINAÇÃO DOS SERVIÇOS",null,null,null,"BDI % =",{"$f":"BDI!D14","v":0.23080000000000001},"BDI  DIFERENCIADO% =",{"$f":"BDI!D60","v":0.15},"R$/m² =",{"$f":"TRUNC(243.59*(1-$N$5),4)","v":243.59}]
[{"$nulls":8},"Total de m²","Encargos Sociais:","Horista (%)","Mensalista (%)","PREÇO UNITÁRIO COM BDI E DESCONTO","PREÇO TOTAL COM BDI E DESCONTO"]
[{"$nulls":8},{"$f":"'MC MODULO'!G11*'MC MODULO'!C11*'MC MODULO'!C12","v":120000},null,{"$f":"'ENC. SOCIAIS'!$E$48","v":112.53999999999999},{"$f":"'ENC. SOCIAIS'!$F$48","v":70.11}]
[{"$nulls":8},"UND","QTDE.","BDI","CUSTO UNITÁRIO",{"$nulls":13},"TOTAL"]
[{"$nulls":4},"MOBILIZAÇÃO/DESMOBILIZAÇÃO"]
[null,1,"CODEVASF","Mob","Mobilização",null,null,null,"kmxfrente",{"$f":"'MC MODULO'!$F$20","v":1200},{"$f":"$J$7","v":0.23080000000000001},{"$f":"Mob!$B$37","v":192.27},{"$f":"TRUNC(L12*(1+K12)*(1-$N$5),2)","v":236.64},{"$f":"TRUNC(J12*M12,2)","v":283968}]
[null,2,"CODEVASF","Mob","Desmobilização",null,null,null,"kmxfrente",{"$f":"'MC MODULO'!$F$25","v":1200},{"$f":"$J$7","v":0.23080000000000001},{"$f":"Mob!$B$37","v":192.27},{"$f":"TRUNC(L13*(1+K13)*(1-$N$5),2)","v":236.64},{"$f":"TRUNC(J13*M13,2)","v":283968}]
[{"$nulls":4},"INSTALAÇÃO DE CANTEIRO"]
[null,3,"CODEVASF","Canteiro","Canteiro de Obras e Almoxarifado",null,null,null,"frente",{"$f":"'MC MODULO'!$B$32","v":12},{"$f":"$J$7","v":0.23080000000000001},{"$f":"' Canteiro'!$F$11","v":3989.0499999999997},4909.72,58916.639999999999]
[null,4,"SINAPI",103689,"Fornecimento e instalação de placa de obra com chapa galvanizada e estrutura de madeira. af_03/2022_ps",null,null,null,"m²",{"$f":"'MC MODULO'!$H$37","v":96},{"$f":"$J$7","v":0.23080000000000001},{"$f":"CPUs!J8","v":348.92},429.45,41227.199999999997]
[{"$nulls":4},"ADMINISTRAÇÃO LOCAL DA OBRA"]
[null,5,"CODEVASF","Adm Local","Administração Local da Obra",null,null,null,"und",1,{"$f":"$J$7","v":0.23080000000000001},{"$f":"'Adm Local'!$H$241","v":1234267.56},1519136.51,1519136.51]
[{"$nulls":4},"TERRAPLANAGEM"]
[null,6,"SICRO",5502114,"Escavação, carga e transporte de material de 1ª categoria - DMT de 1.000 a 1.200 m - caminho de serviço em leito natural -com escavadeira e caminhão basculante de 14 m³",null,null,null,"m³",{"$f":"'MC MODULO'!$H$44","v":33600},{"$f":"$J$7","v":0.23080000000000001},{"$f":"CPUs!$J$21","v":7.61},9.36,314496,{"$nulls":11},366912]
[null,7,"SICRO",4413942,"Espalhamento de material em bota-fora",null,null,null,"m³",{"$f":"'MC MODULO'!$H$49","v":12000},{"$f":"$J$7","v":0.23080000000000001},{"$f":"CPUs!$J$40","v":1.93},2.37,28440,{"$nulls":11},84084,{"$nulls":4},1]
[{"$nulls":4},"PAVIMENTAÇÃO"]
[null,8,"SINAPI",36170,"Bloquete/piso intertravado de concreto - modelo onda/16 faces/retangular/tijolinho/paver/holandes/paralelepipedo, *22 cm c 11 cm, e= 8 cm, resistência de 35 Mpa (NBR 9781), cor natural",null,null,null,"m²",{"$f":"'MC MODULO'!$H$56","v":120480},{"$f":"$L$7","v":0.15},71.900000000000006,82.68,9961286.4000000004]
[null,9,"CODEVASF","CODEVASF 325","Execução de pavimento em piso intertravado, com bloco 16 faces de 22 x 11 cm, espessura 8 cm. af_10/2022 - exclusive fornecimento de bloquete - adaptada do SINAPI (92404)",null,null,null,"m²",{"$f":"'MC MODULO'!$H$61","v":120000},{"$f":"$J$7","v":0.23080000000000001},{"$f":"CPUs!$J$58","v":17.46},21.48,2577600,{"$nulls":11},13037300.310000001]
[null,10,"SICRO",5915014,"Transporte com caminhão carroceria com capacidade de 11 t e com guindauto de 45 t.m - rodovia pavimentada",null,null,null,"tkm",{"$f":"'MC MODULO'!$H$66","v":2112000},0.23080000000000001,{"$f":"CPUs!$J$71","v":1.36},1.67,3527040]
[null,11,"SICRO",5915321,"Transporte com caminhão basculante de 14 m³ - rodovia pavimentada (colchão de areia)",null,null,null,"tkm",{"$f":"'MC MODULO'!$H$72","v":511200},0.23080000000000001,{"$f":"CPUs!$J$85","v":0.62},0.76,388512]
[null,12,"SICRO",5915321,"Transporte com caminhão basculante de 14 m³ - rodovia pavimentada (pó de pedra - rejunte)",null,null,null,"tkm",{"$f":"'MC MODULO'!$H$77","v":88200},0.23080000000000001,{"$f":"CPUs!J99","v":0.62},0.76,67032]
[null,13,"SICRO",4011233,"Sub-base estabilizada granulometricamente com mistura solo brita (70% - 30%) na pista com material de jazida e brita comercial",null,null,null,"m³",{"$f":"'MC MODULO'!$H$82","v":18000},0.23080000000000001,{"$f":"CPUs!$J$113","v":73.41},90.35,1626300,{"$nulls":11},15919722]
[null,14,"SICRO",4011209,"Regularização do subleito",null,null,null,"m²",{"$f":"'MC MODULO'!$H$87","v":120000},0.23080000000000001,{"$f":"CPUs!J151","v":1.1200000000000001},1.37,164400,{"$nulls":11},540540]
[{"$nulls":4},"SINALIZAÇÃO"]
[null,15,"SICRO",5213440,"Placa de regulamentação em aço D = 0,60 m - película retrorrefletiva tipo I + SI - fornecimento e implantação",null,null,null,"und",{"$f":"'MC MODULO'!$H$94","v":72},{"$f":"$J$7","v":0.23080000000000001},{"$f":"CPUs!$J$174","v":252.07},310.24,22337.279999999999,{"$nulls":11},9985.9500000000007]
[null,16,"SICRO",5213464,"Placa de advertência em aço, lado de 0,60 m - película retrorrefletiva tipo I + SI - fornecimento e implantação",null,null,null,"und",{"$f":"'MC MODULO'!$H$99","v":72},{"$f":"$J$7","v":0.23080000000000001},{"$f":"CPUs!$J$196","v":252.1},310.27999999999997,22340.16]
[null,17,"SICRO",5213863,"Suporte metálico galvanizado para placa de advertência ou regulamentação - lado ou diâmetro de 0,60 m - fornecimento e implantação",null,null,null,"und",{"$f":"'MC MODULO'!$H$105","v":144},{"$f":"$J$7","v":0.23080000000000001},{"$f":"CPUs!$J$218","v":453.39},558.03,80356.320000000007,{"$nulls":11},13086.06]
[null,18,"SICRO",5213400,"Pintura de faixa com tinta acrílica - espessura de 0,4 mm",null,null,null,"m²",{"$f":"'MC MODULO'!$H$110","v":4800},{"$f":"$J$7","v":0.23080000000000001},{"$f":"CPUs!$J$254","v":24.23},29.82,143136]
[{"$nulls":4},"DRENAGEM"]
[null,19,"SICRO",2003373,"Meio-fio de concreto - MFC 03 - areia e brita comerciais - fôrma de madeira",null,null,null,"m",{"$f":"'MC MODULO'!$H$117","v":48000},{"$f":"$J$7","v":0.23080000000000001},{"$f":"CPUs!$J$293","v":67},82.46,3958080,{"$nulls":11},4514640]
[null,20,"SICRO",4915724,"Caiação mecanizada com fixador de cal",null,null,null,"m²",{"$f":"'MC MODULO'!$H$122","v":11520},{"$f":"$J$7","v":0.23080000000000001},{"$f":"CPUs!$J$309","v":1.83},2.25,25920]
[{"$nulls":4},"SERVIÇOS COMPLEMENTARES"]
[null,21,"CODEVASF","CODEVASF 104","Conserto de quebra no ramal na rua sem pavimento com fornecimento de material hidráulico",null,null,null,"m",{"$f":"'MC MODULO'!$H$129","v":2400},{"$f":"$J$7","v":0.23080000000000001},{"$f":"CPUs!$J$334","v":23.54},28.97,69528,{"$nulls":11},139854]
[{"$nulls":4},"PROJETO EXECUTIVO"]
[null,22,"CODEVASF","Proj. Executivo","Projeto Executivo",null,null,null,"m²",{"$f":"'MC MODULO'!$H$136","v":120000},{"$f":"$J$7","v":0.23080000000000001},{"$f":"'Projeto Executivo'!$G$29","v":2.37},2.91,349200,{"$nulls":11},763671.38]
[{"$nulls":4},"MOMENTO DE TRANSPORTE"]
[null,23,"SICRO",5914359,"Transporte com caminhão basculante de 10 m³ - rodovia em leito natural",null,null,null,"tkm",{"$f":"'MOMENTO DE TRANSPORTE - PRINC'!$D$12+'MOMENTO DE TRANSPORTE - AUX'!$D$12","v":41272.28},{"$f":"$J$7","v":0.23080000000000001},{"$f":"CPUs!$J$354","v":1.19},1.46,60257.52]
[null,24,"SICRO",5914374,"Transporte com caminhão basculante de 10 m³ - rodovia em revestimento primário",null,null,null,"tkm",{"$f":"'MOMENTO DE TRANSPORTE - PRINC'!$D$13+'MOMENTO DE TRANSPORTE - AUX'!$D$13","v":165089.13},0.23080000000000001,{"$f":"CPUs!$J$368","v":0.95},1.1599999999999999,191503.39]
[null,25,"SICRO",5914389,"Transporte com caminhão basculante de 10 m³ - rodovia pavimentada",null,null,null,"tkm",{"$f":"'MOMENTO DE TRANSPORTE - PRINC'!$D$14+'MOMENTO DE TRANSPORTE - AUX'!$D$17","v":3569147.87},0.23080000000000001,{"$f":"CPUs!$J$382","v":0.78},0.96,3426381.95]
[null,26,"SICRO",5914449,"Transporte com caminhão carroceria de 15 t - rodovia em leito natural",null,null,null,"tkm",{"$f":"'MOMENTO DE TRANSPORTE - AUX'!$D$15","v":920.02},0.23080000000000001,{"$f":"CPUs!$J$396","v":1.06},1.3,1196.02]
[null,27,"SICRO",5914464,"Transporte com caminhão carroceria de 15 t - rodovia em revestimento primário",null,null,null,"tkm",{"$f":"'MOMENTO DE TRANSPORTE - AUX'!$D$16","v":3680.07},0.23080000000000001,{"$f":"CPUs!$J$410","v":0.85},1.04,3827.27]
[null,28,"SICRO",5914479,"Transporte com caminhão carroceria de 15 t - rodovia pavimentada",null,null,null,"tkm",{"$f":"'MOMENTO DE TRANSPORTE - AUX'!$D$17","v":41400.769999999997},0.23080000000000001,{"$f":"CPUs!$J$424","v":0.69},0.84,34776.639999999999]
[null,"VALOR TOTAL DO SRP",{"$nulls":11},{"$f":"N7*I9","v":29230800},{"$nulls":11},{"$f":"SUM(Z19:Z41)","v":35389795.700000003}]
{"$rows_empty":7}
[null,null,null," "]

{"sheet":"CRONOGRAMA TOTAL","index":1,"n_rows":31,"n_cols":17,"rows_kept":31,"cut":false,"hidden":false,"merged":[[28,0,28,1],[1,0,1,14],[2,0,2,14],[25,0,25,1],[26,0,26,1],[27,0,27,1]]}
[]
[{"$f":"'RESUMO MODULO TOTAL'!B1","v":"EXECUÇÃO DE SERVIÇOS DE IMPLANTAÇÃO DE PAVIMENTAÇÃO EM BLOCO DE CONCRETO INTERTRAVADO, EM VIAS DE MUNICÍPIOS DIVERSOS INSERIDOS NA ÁREA DE ATUAÇÃO DA CODEVASF, NO ESTADO SERGIPE"}]
["Cronograma Físico e Financeiro "]
["Item","Descrição","Total Por Etapa","30 DIAS","60 DIAS","90 DIAS","120 DIAS","150 DIAS","180 DIAS","210 DIAS","240 DIAS","270 DIAS","300 DIAS","330 DIAS","360 DIAS"]
[null,{"$f":"'RESUMO MODULO TOTAL'!E11","v":"MOBILIZAÇÃO/DESMOBILIZAÇÃO"},{"$f":"SUM(D5:O5)","v":1},null,null,null,0.5,{"$nulls":7},0.5]
[null,null,{"$f":"SUM('RESUMO MODULO TOTAL'!N12:N13)","v":567936},null,null,null,{"$f":"C6*G5","v":283968},{"$nulls":7},{"$f":"$C$6*O5","v":283968},{"$f":"SUM(D6:O6)","v":567936},{"$f":"IF(P6=C6,\"OK\",\"\")","v":"OK"}]
[null,{"$f":"'RESUMO MODULO TOTAL'!E14","v":"INSTALAÇÃO DE CANTEIRO"},{"$f":"SUM(D7:O7)","v":1},null,null,null,1]
[null,null,{"$f":"SUM('RESUMO MODULO TOTAL'!N15:N16)","v":100143.84},null,null,null,{"$f":"$C$8*G7","v":100143.84},{"$nulls":8},{"$f":"SUM(D8:O8)","v":100143.84},{"$f":"IF(P8=C8,\"OK\",\"\")","v":"OK"}]
[null,{"$f":"'RESUMO MODULO TOTAL'!E17","v":"ADMINISTRAÇÃO LOCAL DA OBRA"},{"$f":"SUM(D9:O9)","v":1.0000132773132848},null,null,null,{"$f":"(G6+G8+G12+G14+G16+G18+G20+G22+G24)/($O$31-$C$10-$C$22)","v":1.4037911467305533E-2},{"$f":"(H6+H8+H12+H14+H16+H18+H20+H22+H24)/($O$31-$C$10-$C$22)","v":0.13937105041602482},0.13937105041602482,0.13937105041602482,0.13937105041602482,0.13937105041602482,0.13937105041602482,0.13937105041602482,1.0378012933805473E-2]
[null,null,{"$f":"SUM('RESUMO MODULO TOTAL'!N18)","v":1519136.51},null,null,null,{"$f":"$C$10*G9","v":21325.503834131505},211723.65112403399,211723.65112403399,211723.65112403399,211723.65112403399,211723.65112403399,211723.65112403399,211723.65112403399,{"$f":"C10-SUM(G10:N10)","v":15745.44829763053},{"$f":"SUM(D10:O10)","v":1519136.51},{"$f":"IF(P10=C10,\"OK\",\"\")","v":"OK"}]
[null,{"$f":"'RESUMO MODULO TOTAL'!E19","v":"TERRAPLANAGEM"},{"$f":"SUM(D11:O11)","v":0.99999999999999978},{"$nulls":4},{"$f":"1/7","v":0.14285714285714285},0.14285714285714285,0.14285714285714285,0.14285714285714285,0.14285714285714285,0.14285714285714285,0.14285714285714285]
[null,null,{"$f":"SUM('RESUMO MODULO TOTAL'!N20:N21)","v":342936},{"$nulls":4},{"$f":"$C$12*H11","v":48990.857142857138},48990.857142857138,48990.857142857138,48990.857142857138,48990.857142857138,48990.857142857138,48990.857142857138,null,{"$f":"SUM(D12:O12)","v":342936},{"$f":"IF(P12=C12,\"OK\",\"\")","v":"OK"}]
[null,{"$f":"'RESUMO MODULO TOTAL'!E22","v":"PAVIMENTAÇÃO"},{"$f":"SUM(D13:O13)","v":0.99999999999999978},{"$nulls":4},{"$f":"1/7","v":0.14285714285714285},0.14285714285714285,0.14285714285714285,0.14285714285714285,0.14285714285714285,0.14285714285714285,0.14285714285714285]
[null,null,{"$f":"SUM('RESUMO MODULO TOTAL'!N23:N29)","v":18312170.399999999},{"$nulls":4},{"$f":"$C$14*H13","v":2616024.3428571424},2616024.3428571424,2616024.3428571424,2616024.3428571424,2616024.3428571424,2616024.3428571424,2616024.3428571424,null,{"$f":"SUM(D14:O14)","v":18312170.399999999},{"$f":"IF(P14=C14,\"OK\",\"\")","v":"OK"}]
[null,{"$f":"'RESUMO MODULO TOTAL'!E30","v":"SINALIZAÇÃO"},{"$f":"SUM(D15:O15)","v":0.99999999999999978},{"$nulls":4},{"$f":"1/7","v":0.14285714285714285},0.14285714285714285,0.14285714285714285,0.14285714285714285,0.14285714285714285,0.14285714285714285,0.14285714285714285]
[null,null,{"$f":"SUM('RESUMO MODULO TOTAL'!N31:N34)","v":268169.76},{"$nulls":4},{"$f":"$C$16*H15","v":38309.96571428571},38309.96571428571,38309.96571428571,38309.96571428571,38309.96571428571,38309.96571428571,38309.96571428571,null,{"$f":"SUM(D16:O16)","v":268169.75999999995},{"$f":"IF(P16=C16,\"OK\",\"\")","v":"OK"}]
[null,{"$f":"'RESUMO MODULO TOTAL'!E35","v":"DRENAGEM"},{"$f":"SUM(D17:O17)","v":0.99999999999999978},{"$nulls":4},{"$f":"1/7","v":0.14285714285714285},0.14285714285714285,0.14285714285714285,0.14285714285714285,0.14285714285714285,0.14285714285714285,0.14285714285714285]
[null,null,{"$f":"SUM('RESUMO MODULO TOTAL'!N36:N37)","v":3984000},{"$nulls":4},{"$f":"$C$18*H17","v":569142.85714285716},{"$f":"$C$18*I17","v":569142.85714285716},{"$f":"$C$18*J17","v":569142.85714285716},569142.85714285716,569142.85714285716,569142.85714285716,569142.85714285716,null,{"$f":"SUM(D18:O18)","v":3984000.0000000005},{"$f":"IF(P18=C18,\"OK\",\"\")","v":"OK"}]
[null,{"$f":"'RESUMO MODULO TOTAL'!E38","v":"SERVIÇOS COMPLEMENTARES"},{"$f":"SUM(D19:O19)","v":0.99999999999999978},{"$nulls":4},{"$f":"1/7","v":0.14285714285714285},0.14285714285714285,0.14285714285714285,0.14285714285714285,0.14285714285714285,0.14285714285714285,0.14285714285714285]
[null,null,{"$f":"SUM('RESUMO MODULO TOTAL'!N39)","v":69528},{"$nulls":4},{"$f":"$C$20*H19","v":9932.5714285714275},{"$f":"$C$20*I19","v":9932.5714285714275},{"$f":"$C$20*J19","v":9932.5714285714275},9932.5714285714275,9932.5714285714275,9932.5714285714275,9932.5714285714275,null,{"$f":"SUM(D20:O20)","v":69528},{"$f":"IF(P20=C20,\"OK\",\"\")","v":"OK"}]
[null,{"$f":"'RESUMO MODULO TOTAL'!E40","v":"PROJETO EXECUTIVO"},{"$f":"SUM(D21:O21)","v":1},0.35,0.35,0.3]
[null,null,{"$f":"SUM('RESUMO MODULO TOTAL'!N41)","v":349200},{"$f":"$C$22*D21","v":122219.99999999999},{"$f":"$C$22*E21","v":122219.99999999999},104760,{"$nulls":9},{"$f":"SUM(D22:O22)","v":349200},{"$f":"IF(P22=C22,\"OK\",\"\")","v":"OK"}]
[null,{"$f":"'RESUMO MODULO TOTAL'!E42","v":"MOMENTO DE TRANSPORTE"},{"$f":"SUM(D23:O23)","v":0.99999999999999978},{"$nulls":4},{"$f":"1/7","v":0.14285714285714285},{"$f":"1/7","v":0.14285714285714285},0.14285714285714285,0.14285714285714285,0.14285714285714285,0.14285714285714285,0.14285714285714285]
[null,null,{"$f":"SUM('RESUMO MODULO TOTAL'!N43:N48)","v":3717942.7900000005},{"$nulls":4},{"$f":"$C$24*H23","v":531134.68428571429},531134.68428571429,531134.68428571429,531134.68428571429,531134.68428571429,531134.68428571429,531134.68428571429,null,{"$f":"SUM(D24:O24)","v":3717942.79},{"$f":"IF(P24=C24,\"OK\",\"\")","v":"OK"}]
[]
["Porcentagem",null,null,{"$f":"SUM(D6+D8+D10+D12+D14+D16+D18+D20+D22+D24)/$O$31","v":4.1812061250461833E-3},{"$f":"SUM(E6+E8+E10+E12+E14+E16+E18+E20+E22+E24)/$O$31","v":4.1812061250461833E-3},3.5838909643253008E-3,1.387021032041995E-2,0.13770608158844308,0.13770608158844308,0.13770608158844308,0.13770608158844308,0.13770608158844308,0.13770608158844308,0.13770608158844308,1.0253344017188394E-2]
["Custo",null,null,{"$f":"$O$31*D26","v":122219.99999999997},{"$f":"$O$31*E26","v":122219.99999999997},{"$f":"$O$31*F26","v":104760},405437.34383413149,4025258.9296954619,4025258.9296954619,4025258.9296954619,4025258.9296954619,4025258.9296954619,4025258.9296954619,4025258.9296954619,299713.44829763053]
["Porcentagem Acumulado",null,null,{"$f":"D26","v":4.1812061250461833E-3},{"$f":"D28+E26","v":8.3624122500923666E-3},{"$f":"E28+F26","v":1.1946303214417668E-2},2.5816513534837618E-2,0.16352259512328071,0.30122867671172382,0.43893475830016693,0.57664083988861004,0.71434692147705314,0.85205300306549625,0.98975908465393936,{"$f":"N28+O26","v":1.0000124286711278}]
["Custo Acumulado",null,null,{"$f":"D27","v":122219.99999999997},{"$f":"D29+E27","v":244439.99999999994},349199.99999999994,754637.34383413149,4779896.2735295929,8805155.2032250538,12830414.132920515,16855673.062615976,20880931.992311437,24906190.922006898,28931449.851702359,{"$f":"N29+O27-363.3","v":29230799.999999989}]
[]
[null,null,null,"Total Geral",{"$nulls":9},"R$",{"$f":"'RESUMO MODULO TOTAL'!$N$49","v":29230800}]

{"sheet":"BDI","index":2,"n_rows":61,"n_cols":4,"rows_kept":61,"cut":false,"hidden":false,"merged":[[2,1,2,3],[1,1,1,3],[47,1,47,3],[48,1,48,3],[15,1,16,3]]}
[]
[null,"DETALHAMENTO DO BDI  - SEM DESONERAÇÃO"]
[null,{"$f":"'RESUMO MODULO TOTAL'!B1","v":"EXECUÇÃO DE SERVIÇOS DE IMPLANTAÇÃO DE PAVIMENTAÇÃO EM BLOCO DE CONCRETO INTERTRAVADO, EM VIAS DE MUNICÍPIOS DIVERSOS INSERIDOS NA ÁREA DE ATUAÇÃO DA CODEVASF, NO ESTADO SERGIPE"}]
[null,"DESCRIÇÃO DOS SERVIÇOS","PREÇO DE VENDA (%)","CUSTO DIRETO (%)"]
[null,"ADMINISTRAÇÃO CENTRAL",null,0.06]
[null,"DESPESAS FINANCEIRAS",7.9000000000000008E-3]
[null,"SEGUROS E GARANTIAS CONTRATUAIS",5.0000000000000001E-3]
[null,"RISCOS",2.5000000000000001E-3]
[null,"LUCRO OPERACIONAL",null,7.0000000000000007E-2]
[null,"PIS",6.4999999999999997E-3]
[null,"COFINS",0.03]
[null,"ISSQN",0.03]
[null,"Contribuição Previdenciaria",0]
[null,null,"BDI",{"$f":"ROUND((1+(D5+D9))/(1-(C6+C7+C8+C10+C11+C12+C13))-1,4)","v":0.23080000000000001}]
[null,"Observação: O percentual de ISSQN aqui utilizado consiste apenas em um referencial médio."]
[null," O valor real do ISSQN a ser adotado deve ser aquele proveniente das alíquotas dos municípios situados na área de influência das obras."]
{"$rows_empty":31}
[null,"DETALHAMENTO DO BDI DIFERENCIADO  - SEM DESONERAÇÃO"]
[null,{"$f":"'RESUMO MODULO TOTAL'!B6","v":"EXECUÇÃO DE SERVIÇOS DE IMPLANTAÇÃO DE PAVIMENTAÇÃO EM BLOCO DE CONCRETO INTERTRAVADO, EM VIAS DE MUNICÍPIOS DIVERSOS INSERIDOS NA ÁREA DE ATUAÇÃO DA CODEVASF, NO ESTADO SERGIPE"}]
[null,"DESCRIÇÃO DOS SERVIÇOS","PREÇO DE VENDA (%)","CUSTO DIRETO (%)"]
[null,"ADMINISTRAÇÃO CENTRAL",null,3.7699999999999997E-2]
[null,"DESPESA FINANCEIRAS",1.0200000000000001E-2]
[null,"SEGUROS E GARANTIAS CONTRATUAIS",2.5000000000000001E-3]
[null,"RISCOS",5.0000000000000001E-3]
[null,"LUCRO OPERACIONAL",null,0.05]
[null,"PIS",6.4999999999999997E-3]
[null,"COFINS",0.03]
[null,"ISSQN",0]
[null,"Contribuição Previdenciaria",0]
[null,null,"BDI DIFERENCIADO",{"$f":"ROUND((1+(D51+D55))/(1-(C52+C53+C54+C56+C57+C58+C59))-1,4)","v":0.15}]
[null,"Fonte da composição, valores de referência e fórmula do BDI:  Instrução Normativa N° 62/DNIT SEDE"]

{"sheet":"ENC. SOCIAIS","index":3,"n_rows":52,"n_cols":8,"rows_kept":52,"cut":false,"hidden":false,"merged":[[5,0,6,5],[47,0,47,1],[7,0,7,5],[8,2,8,3],[8,4,8,5],[9,0,9,5],[10,0,11,1],[10,2,11,2],[10,3,11,3],[10,4,11,4],[10,5,11,5],[12,0,12,5],[23,0,23,5],[35,0,35,5],[42,0,42,5],[46,0,46,5]]}
[]
[]
[]
[]
[]
[{"$f":"'RESUMO MODULO TOTAL'!B1","v":"EXECUÇÃO DE SERVIÇOS DE IMPLANTAÇÃO DE PAVIMENTAÇÃO EM BLOCO DE CONCRETO INTERTRAVADO, EM VIAS DE MUNICÍPIOS DIVERSOS INSERIDOS NA ÁREA DE ATUAÇÃO DA CODEVASF, NO ESTADO SERGIPE"}]
[]
["DETALHAMENTO DOS ENCARGOS SOCIAIS (%)"]
["VIGÊNCIA A PARTIR DE 12/2023",null,"COM DESONERAÇÃO",null,"SEM DESONERAÇÃO"]
[]
[null,null,"HORISTA","MENSALISTA","HORISTA","MENSALISTA"]
[]
["GRUPO A"]
["A1","INSS",0,0,20,20]
["A2","SESI",1.5,1.5,1.5,1.5]
["A3","SENAI",1,1,1,1]
["A4","INCRA",0.2,0.2,0.2,0.2]
["A5","SEBRAE",0.6,0.6,0.6,0.6]
["A6","Salário Educação",2.5,2.5,2.5,2.5]
["A7","Seguro Contra Acidentes de Trabalho",3,3,3,3]
["A8","FGTS",8,8,8,8]
["A9","SECONCI",1,1,0,"-"]
["A","Total",{"$f":"SUM(C14:C22)","v":17.8},{"$f":"SUM(D14:D22)","v":17.8},{"$f":"SUM(E14:E22)","v":36.799999999999997},{"$f":"SUM(F14:F22)","v":36.799999999999997}]
["GRUPO B"]
["B1","Repouso Semanal Remunerado",17.88,"-",17.87,"-"]
["B2","Feriados",3.94,"-",3.93,"-"]
["B3","Auxílio-enfermidade",0.91,0.69,0.85,0.64]
["B4","13° salário",10.98,8.33,10.98,8.33]
["B5","Licença-paternidade",7.0000000000000007E-2,0.06,0.06,0.04]
["B6","Faltas Justificadas",0.73,0.56000000000000005,0.73,0.56000000000000005]
["B7","Dias de chuva",1.45,"-",1.51,"-"]
["B8","Auxílio Acidente de Trabalho",0.11,0.09,0.1,0.08]
["B9","Férias Gozadas",11.35,8.6199999999999992,11.37,8.64]
["B10","Salário Maternidade",0.03,0.03,0.04,0.03]
["B","Total ",{"$f":"SUM(C25:C34)","v":47.45},{"$f":"SUM(D25:D34)","v":18.380000000000003},{"$f":"SUM(E25:E34)","v":47.44},{"$f":"SUM(F25:F34)","v":18.32}]
["GRUPO C"]
["C1","Aviso Prévio Indenizado",6.76,5.14,4.83,3.67]
["C2","Aviso Prévio Trabalhado",0.16,0.12,0.11,0.09]
["C3","Férias Indenizadas",2.2799999999999998,1.73,2.35,1.79]
["C4","Depósito Rescisão Sem Justa Causa",3.81,2.89,2.71,2.06]
["C5","Indenização Adicional",0.56999999999999995,0.43,0.41,0.31]
["C","Total ",{"$f":"SUM(C37:C41)","v":13.58},{"$f":"SUM(D37:D41)","v":10.31},{"$f":"SUM(E37:E41)","v":10.41},{"$f":"SUM(F37:F41)","v":7.919999999999999}]
["GRUPO D"]
["D1","Reincidência de A sobre B",8.4499999999999993,3.27,17.46,6.74]
["D2","Reincidência de Grupo A sobre Aviso Prévio Trabalhado e Reincidência do FGTS sobre Aviso Prévio Indenizado",0.56999999999999995,0.43,0.43,0.33]
["D","Total",{"$f":"SUM(C44:C45)","v":9.02},{"$f":"SUM(D44:D45)","v":3.7},{"$f":"SUM(E44:E45)","v":17.89},{"$f":"SUM(F44:F45)","v":7.07}]
[]
["T O T A L (%)",null,{"$f":"C23+C35+C42+C46","v":87.85},{"$f":"D23+D35+D42+D46","v":50.190000000000012},{"$f":"E23+E35+E42+E46","v":112.53999999999999},{"$f":"F23+F35+F42+F46","v":70.11}]
[]
[]
[]
[{"$nulls":7},"Fonte: Sinapi Cálculos e Parâmetros 6ª Edição - Atualizada em Junho de 2024"]

{"sheet":"MC MODULO","index":4,"n_rows":136,"n_cols":8,"rows_kept":136,"cut":false,"hidden":false,"merged":[[106,1,106,4],[21,1,21,4],[52,1,52,4],[57,1,57,4],[62,1,62,4],[73,1,73,4],[78,1,78,4],[101,1,101,4],[5,0,6,7],[8,0,8,7],[16,1,16,4],[144,0,144,4],[28,1,28,4],[33,1,33,4],[90,1,90,4],[83,1,83,4],[95,1,95,4],[40,1,40,4],[45,1,45,4],[113,1,113,4],[118,1,118,4],[125,1,125,4],[132,1,132,4],[68,1,68,4]]}
[]
[]
[]
[]
[]
[{"$f":"'RESUMO MODULO TOTAL'!B1","v":"EXECUÇÃO DE SERVIÇOS DE IMPLANTAÇÃO DE PAVIMENTAÇÃO EM BLOCO DE CONCRETO INTERTRAVADO, EM VIAS DE MUNICÍPIOS DIVERSOS INSERIDOS NA ÁREA DE ATUAÇÃO DA CODEVASF, NO ESTADO SERGIPE"}]
[]
[]
["MEMÓRIA DE QUANTITATIVOS "]
[]
["Extensão","=",2000,"m",null,"QUANTIDADE DE MÓDULOS",12]
["Largura","=",5,"m"]
[]
["Extensão","=",2,"km"]
[]
[null,"MOBILIZAÇÃO/DESMOBILIZAÇÃO"]
[1,"Mobilização"]
[]
[null,"Quantidade (módulos)",null,"Distância (km)",null,"Total (kmxfrente)"]
[null,{"$f":"$G$11","v":12},null,{"$f":"Mob!$H$6","v":100},null,{"$f":"B20*D20","v":1200}]
[]
[2,"Desmobilização"]
[]
[null,"Quantidade (módulos)",null,"Distância (km)",null,"Total (kmxfrente)"]
[null,{"$f":"$G$11","v":12},null,{"$f":"Mob!$H$6","v":100},null,{"$f":"B25*D25","v":1200}]
[]
[null,"INSTALAÇÃO DO CANTEIRO"]
[]
[3,"Canteiro de Obras e Almoxarifado"]
[]
[null,"Módulos(und)"]
[null,{"$f":"G11","v":12}]
[]
[4,"Placa de Obra em Chapa de Aço Galvanizado"]
[]
[null,"Módulos(und)","Comprimento(m)","Largura (m)","Quantidade (und)",null,null,"Total de área de placa (m²)"]
[null,{"$f":"G11","v":12},2,4,1,null,null,{"$f":"C37*D37*B37*E37","v":96}]
[]
[null,"TERRAPLENAGEM"]
[]
[6,"Escavação, carga e transporte de material de 1ª categoria - DMT de 1.000 a 1.200 m - caminho de serviço em leito natural - com escavadeira e caminhão basculante de 14 m³"]
[]
[null,"Extensão (m)",null,"Largura (m)",null,"Espessura (m)",null,"Volume (m³)"]
[null,{"$f":"C11*$G$11","v":24000},"x",{"$f":"$C$12","v":5},"x",{"$f":"0.08+0.05+0.15","v":0.28000000000000003},"=",{"$f":"B44*D44*F44","v":33600}]
[]
[7,"Espalhamento de material em bota-fora"]
[]
[null,"Extensão (m)",null,"Largura (m)",null,"Espessura (m)",null,"Volume (m³)"]
[null,{"$f":"C11*$G$11","v":24000},"x",{"$f":"$C$12","v":5},"x",0.1,"=",{"$f":"B49*D49*F49","v":12000}]
[]
[null,"PAVIMENTAÇÃO"]
[]
[8,"Bloquete/piso intertravado de concreto - modelo onda/16 faces/retangular/tijolinho/paver/holandes/paralelepipedo, *22 cm c 11 cm, e= 8 cm, resistência de 35 Mpa (NBR 9781), cor natural"]
[]
[null,"Área (m²)","Coeficiente da comp. SINAPI\n (m²/m²)",{"$nulls":4},"Área (m²)"]
[null,{"$f":"H61","v":120000},1.004,null,null,null,"=",{"$f":"C56*B56","v":120480}]
[]
[9,"Execução de pavimento em piso intertravado, com bloco 16 faces de 22 x 11 cm, espessura 8 cm. af_10/2022 - exclusive fornecimento de bloquete"]
[]
[null,"Extensão (m)","Largura (m)",{"$nulls":4},"Área (m²)"]
[null,{"$f":"$C$11*G11","v":24000},{"$f":"$C$12","v":5},null,null,null,"=",{"$f":"C61*B61","v":120000}]
[]
[10,"Transporte com caminhão carroceria com capacidade de 11 t e com guindauto de 45 t.m - rodovia pavimentada (bloquete)"]
[]
[null,"Dimensões (m³)","Densidade bloco Intertravado (t/m³)","Distância (km)",null,null,null,"Momento de transporte (tkm)"]
[null,{"$f":"H61*0.08","v":9600},2.2000000000000002,100,null,null,"=",{"$f":"B66*C66*D66","v":2112000}]
[]
[]
[11,"Transporte com caminhão basculante de 14 m³ - rodovia pavimentada (colchão de areia)"]
[{"$nulls":5},"DMT ATÉ 50 KM NÃO DEVE SER PAGA"]
[null,"Área\n (m²)","Coeficiente da comp. SINAPI\n (m³/m²)","Densidade areia \n(t/m³)","Distância \n(km)",null,null,"Momento de transporte (tkm)"]
[null,{"$f":"H61","v":120000},5.6800000000000003E-2,1.5,{"$f":"D66-50","v":50},null,"=",{"$f":"B72*D72*C72*E72","v":511200}]
[]
[12,"Transporte com caminhão basculante de 14 m³ - rodovia pavimentada (pó de pedra - rejunte)"]
[{"$nulls":5},"DMT ATÉ 50 KM NÃO DEVE SER PAGA"]
[null,"Área\n (m²)","Coeficiente da comp. SINAPI\n (m³/m²)","Densidade pó de pedra (t/m³)","Distância \n(km)",null,null,"Momento de transporte (tkm)"]
[null,{"$f":"H61","v":120000},9.7999999999999997E-3,1.5,{"$f":"D66-50","v":50},null,"=",{"$f":"B77*C77*D77*E77","v":88200}]
[]
[13,"Sub-base estabilizada granulometricamente com mistura solo brita (70% - 30%) na pista com material de jazida e brita comercial"]
[]
[null,"Extensão (m)",null,"Largura (m)",null,"Espessura da camada (m)",null,"Volume (m³)"]
[null,{"$f":"C11*$G$11","v":24000},"x",{"$f":"$C$12","v":5},"x",0.15,"=",{"$f":"B82*D82*F82","v":18000}]
[]
[14,"Regularização do subleito"]
[]
[null,"Extensão (m)",null,"Largura (m)",null,null,null,"Área (m2)"]
[null,{"$f":"C11*$G$11","v":24000},"x",{"$f":"$C$12","v":5},null,null,"=",{"$f":"B87*D87","v":120000}]
[]
[null,"SINALIZAÇÃO"]
[]
[15,"Placa de regulamentação em aço D = 0,60 m - película retrorrefletiva tipo I + SI - fornecimento e implantação"]
[]
[null,"Extensão (km)",null,"Quantidade (und/km)",null,null,null,"Quantidade (und/km)"]
[null,{"$f":"$C$14*$G$11","v":24},"x",3,null,null,"=",{"$f":"B94*D94","v":72}]
[]
[16,"Placa de advertência em aço, lado de 0,60 m - película retrorrefletiva tipo I + SI - fornecimento e implantação"]
[]
[null,"Extensão (km)",null,"Quantidade (und/km)",null,null,null,"Quantidade (und/km)"]
[null,{"$f":"$C$14*$G$11","v":24},"x",3,null,null,"=",{"$f":"B99*D99","v":72}]
[]
[]
[17,"Suporte metálico galvanizado para placa de advertência ou regulamentação - lado ou diâmetro de 0,60 m - fornecimento e implantação"]
[]
[null,"Extensão (km)",null,"Quantidade (und/km)",null,null,null,"Quantidade (und/km)"]
[null,{"$f":"$C$14*$G$11","v":24},"x",{"$f":"D94+D99","v":6},null,null,"=",{"$f":"B105*D105","v":144}]
[]
[18,"Pintura de faixa com tinta acrílica - espessura de 0,4 mm (bordos)"]
[]
[null,"Extensão (m)",null,"Espessura (m)",null,"Quantidade (und)",null,"Quantidade (m²)"]
[null,{"$f":"C11*G11","v":24000},"x",0.1,"x",2,"=",{"$f":"B110*D110*F110","v":4800}]
[]
[null,"DRENAGEM"]
[]
[19,"Meio-fio de concreto - MFC 03 - areia e brita comerciais - fôrma de madeira"]
[]
[null,"Extensão (m)",null,"Quantidade ",null,null,null,"Extensão (m)"]
[null,{"$f":"$C$11*$G$11","v":24000},"x",2,null,null,"=",{"$f":"B117*D117","v":48000}]
[]
[20,"Caiação mecanizada com fixador de cal"]
[]
[null,"Extensão (m)",null,"Perímetro (m)",null,"Quantidade (und)",null,"Área (m²)"]
[null,{"$f":"$C$11*$G$11","v":24000},"x",{"$f":"0.09+0.15","v":0.24},null,2,"=",{"$f":"B122*D122*F122","v":11520}]
[]
[null,"SERVIÇOS COMPLEMENTARES"]
[]
[21,"Conserto de quebra no ramal na rua sem pavimento com fornecimento de material hidráulico"]
[]
[null,"Extensão (m)",{"$nulls":5},"Extensão (m)"]
[null,{"$f":"$C$11*G11","v":24000},null,null,"x",0.1,"=",{"$f":"F129*B129","v":2400}]
[]
[null,"PROJETO EXECUTIVO"]
[]
[22,"Projeto Executivo"]
[]
[null,"Extensão (m)",null,"Largura (m)",null,null,null,"Área (m²)"]
[null,{"$f":"$C$11*G11","v":24000},"x",{"$f":"C12","v":5},null,null,"=",{"$f":"B136*D136","v":120000}]

{"sheet":"MOMENTO DE TRANSPORTE - PRINC","index":5,"n_rows":102,"n_cols":11,"rows_kept":102,"cut":false,"hidden":false,"merged":[[4,1,4,10],[21,2,21,7],[21,9,21,10],[22,7,22,10],[24,3,24,7],[18,1,18,10],[6,1,6,10],[25,1,26,2],[25,3,26,3],[25,4,26,4],[25,5,25,7],[29,5,29,7],[34,2,34,7],[34,9,34,10],[35,7,35,10],[40,3,40,7],[41,1,42,2],[41,3,42,3],[41,4,42,4],[41,5,41,7],[43,5,43,7],[50,2,50,7],[50,9,50,10],[51,7,51,10],[53,3,53,7],[54,1,55,2],[54,3,55,3],[54,4,55,4],[54,5,54,7],[58,5,58,7],[63,2,63,7],[63,9,63,10],[64,7,64,10],[69,3,69,7],[70,1,71,2],[70,3,71,3],[70,4,71,4],[70,5,70,7],[72,5,72,7],[79,2,79,7],[79,9,79,10],[80,7,80,10],[82,3,82,7],[83,1,84,2],[83,3,84,3],[83,4,84,4],[83,5,83,7],[87,5,87,7],[101,5,101,7],[92,2,92,7],[92,9,92,10],[93,7,93,10],[98,3,98,7],[99,1,100,2],[99,3,100,3],[99,4,100,4],[99,5,99,7]]}
[]
[]
[]
[]
[null,{"$f":"'RESUMO MODULO TOTAL'!B1","v":"EXECUÇÃO DE SERVIÇOS DE IMPLANTAÇÃO DE PAVIMENTAÇÃO EM BLOCO DE CONCRETO INTERTRAVADO, EM VIAS DE MUNICÍPIOS DIVERSOS INSERIDOS NA ÁREA DE ATUAÇÃO DA CODEVASF, NO ESTADO SERGIPE"}]
[]
[null,"MEMÓRIA DE QUANTITATIVOS - MOMENTO DE TRANSPORTE (PRINCIPAL)"]
[null,"DATA BASE:",{"$f":"'RESUMO MODULO TOTAL'!N2","v":"2024-04-01"}]
[]
[null,null,"RESUMO DO TRANSPORTE PRINCIPAL"]
[null,"CÓDIGO ","DESCRIÇÃO","TKM"]
[null,5914359,"Transporte com caminhão basculante de 10 m³ - rodovia em leito natural",{"$f":"ROUND(SUMIF('MOMENTO DE TRANSPORTE - PRINC'!A:A,B12,'MOMENTO DE TRANSPORTE - PRINC'!K:K),2)","v":37134.18}]
[null,5914374,"Transporte com caminhão basculante de 10 m³ - rodovia em revestimento primário",{"$f":"ROUND(SUMIF('MOMENTO DE TRANSPORTE - PRINC'!A:A,B13,'MOMENTO DE TRANSPORTE - PRINC'!K:K),2)","v":148536.72}]
[null,5914389,"Transporte com caminhão basculante de 10 m³ - rodovia pavimentada",{"$f":"ROUND(SUMIF('MOMENTO DE TRANSPORTE - PRINC'!A:A,B14,'MOMENTO DE TRANSPORTE - PRINC'!K:K),2)","v":3527747.1}]
[]
[null,"TIPO (P, RP ou LN)","DMT ESTIMADA (km)"]
[null,"P",95]
[]
[null,"COMPOSIÇÕES PRINCIPAIS"]
["","SISTEMA DE CUSTOS REFERENCIAIS DE OBRAS - SICRO"]
["","Custo Unitário de Referência",null,{"$f":"$C$8","v":"2024-04-01"},{"$nulls":4},"Quantitativo",null,"m³"]
["",4011233,"Sub-base estabilizada granulometricamente com mistura solo brita (70% - 30%) na pista com material de jazida e brita comercial",{"$nulls":5},{"$f":"(SUMIF('RESUMO MODULO TOTAL'!D:D,B22,'RESUMO MODULO TOTAL'!J:J))","v":18000}]
["","D - ATIVIDADES AUXILIARES",null,"Quantidade","Unidade"]
["",4016096,"Escavação e carga de material de jazida com escavadeira hidráulica de 1,56 m³",0.77019000000000004,"m³"]
[""]
["","F - MOMENTO DE TRANSPORTE",null,"Quantidade","Unidade","CÓDIGO TRANSPORTE"]
["",{"$nulls":4},"LN","RP","P","TIPO (P, RP ou LN)","DMT ESTIMADA (km)","QUANTITATIVO TOTAL DE TRANSPORTE (tkm)"]
[{"$f":"IF(I28=\"P\",H28,IF(I28=\"RP\",G28,IF(I28=\"LN\",F28,\"\")))","v":5914389},4016096,"Escavação e carga de material de jazida com escavadeira hidráulica de 1,56 m³ - Caminhão basculante com capacidade de 10 m³ - 188 kW",1.44411,"tkm",5914359,5914374,5914389,{"$f":"$B$17","v":"P"},{"$f":"$C$17","v":95},{"$f":"IF(ISBLANK(J28),\"\",J28*D28)*$I$22","v":2469428.1}]
[{"$f":"IF(I29=\"P\",H29,IF(I29=\"RP\",G29,IF(I29=\"LN\",F29,\"\")))","v":5914389},"M0191","Brita 1 - Caminhão basculante com capacidade de 10 m³ - 188 kW",0.61890000000000001,"tkm",5914359,5914374,5914389,"P",{"$f":"$C$17","v":95},{"$f":"IF(ISBLANK(J29),\"\",J29*D29)*$I$22","v":1058319}]
[""]
["","Obs."]
[]
["","SISTEMA DE CUSTOS REFERENCIAIS DE OBRAS - SICRO"]
["","Custo Unitário de Referência",null,{"$f":"$C$8","v":"2024-04-01"},{"$nulls":4},"Quantitativo",null,"m"]
["",2003373,"Meio-fio de concreto - MFC 03 - areia e brita comerciais - fôrma de madeira",{"$nulls":5},{"$f":"(SUMIF('RESUMO MODULO TOTAL'!D:D,B35,'RESUMO MODULO TOTAL'!J:J))","v":48000}]
["","D - ATIVIDADES AUXILIARES",null,"Quantidade","Unidade"]
[null,1107892," Concreto fck = 20 MPa - confecção em betoneira e lançamento manual - areia e brita comerciais",4.2000000000000003E-2,"m³"]
[null,2003842,"Enchimento de junta de concreto com argamassa asfáltica de densidade 1.700 kg/m³ - espessura de 1 cm",5.9499999999999997E-2,"kg"]
[null,3103302,"Fôrmas de tábuas de pinho para dispositivos de drenagem - utilização de 3 vezes - confecção, instalação e retirada",0.54749999999999999,"m²"]
[null,4805750,"Escavação manual em material de 1ª categoria na profundidade de até 1 m",0.03,"m³"]
[""]
["","F - MOMENTO DE TRANSPORTE",null,"Quantidade","Unidade","CÓDIGO TRANSPORTE"]
["",{"$nulls":4},"LN","RP","P","TIPO (P, RP ou LN)","DMT ESTIMADA (km)","QUANTITATIVO TOTAL DE TRANSPORTE (tkm)"]
[""]
[]
[null,"TIPO (P, RP ou LN)","DMT ESTIMADA (DISTRIBUIÇÃO DO ITEM NA PISTA"]
[null,"RP",4]
[]
["","SISTEMA DE CUSTOS REFERENCIAIS DE OBRAS - SICRO"]
["","Custo Unitário de Referência",null,{"$f":"$C$8","v":"2024-04-01"},{"$nulls":4},"Quantitativo",null,"un"]
["",4011233,"Sub-base estabilizada granulometricamente com mistura solo brita (70% - 30%) na pista com material de jazida e brita comercial",{"$nulls":5},{"$f":"(SUMIF('RESUMO MODULO TOTAL'!D:D,B51,'RESUMO MODULO TOTAL'!J:J))","v":18000}]
["","D - ATIVIDADES AUXILIARES",null,"Quantidade","Unidade"]
["",4016096,"Escavação e carga de material de jazida com escavadeira hidráulica de 1,56 m³",0.77019000000000004,"m³"]
[""]
["","F - MOMENTO DE TRANSPORTE",null,"Quantidade","Unidade","CÓDIGO TRANSPORTE"]
["",{"$nulls":4},"LN","RP","P","TIPO (P, RP ou LN)","DMT ESTIMADA (km)","QUANTITATIVO TOTAL DE TRANSPORTE (tkm)"]
[{"$f":"IF(I57=\"P\",H57,IF(I57=\"RP\",G57,IF(I57=\"LN\",F57,\"\")))","v":5914374},4016096,"Escavação e carga de material de jazida com escavadeira hidráulica de 1,56 m³ - Caminhão basculante com capacidade de 10 m³ - 188 kW",1.44411,"tkm",5914359,5914374,5914389,{"$f":"$B$47","v":"RP"},{"$f":"$C$47","v":4},{"$f":"IF(ISBLANK(J57),\"\",J57*D57)*$I$51","v":103975.92}]
[{"$f":"IF(I58=\"P\",H58,IF(I58=\"RP\",G58,IF(I58=\"LN\",F58,\"\")))","v":5914374},"M0191","Brita 1 - Caminhão basculante com capacidade de 10 m³ - 188 kW",0.61890000000000001,"tkm",5914359,5914374,5914389,{"$f":"$B$47","v":"RP"},{"$f":"$C$47","v":4},{"$f":"IF(ISBLANK(J58),\"\",J58*D58)*$I$51","v":44560.800000000003}]
[""]
["","Obs."]
[]
["","SISTEMA DE CUSTOS REFERENCIAIS DE OBRAS - SICRO"]
["","Custo Unitário de Referência",null,{"$f":"$C$8","v":"2024-04-01"},{"$nulls":4},"Quantitativo",null,"m"]
["",2003373,"Meio-fio de concreto - MFC 03 - areia e brita comerciais - fôrma de madeira",{"$nulls":5},{"$f":"(SUMIF('RESUMO MODULO TOTAL'!D:D,B64,'RESUMO MODULO TOTAL'!J:J))","v":48000}]
["","D - ATIVIDADES AUXILIARES",null,"Quantidade","Unidade"]
[null,1107892," Concreto fck = 20 MPa - confecção em betoneira e lançamento manual - areia e brita comerciais",4.2000000000000003E-2,"m³"]
[null,2003842,"Enchimento de junta de concreto com argamassa asfáltica de densidade 1.700 kg/m³ - espessura de 1 cm",5.9499999999999997E-2,"kg"]
[null,3103302,"Fôrmas de tábuas de pinho para dispositivos de drenagem - utilização de 3 vezes - confecção, instalação e retirada",0.54749999999999999,"m²"]
[null,4805750,"Escavação manual em material de 1ª categoria na profundidade de até 1 m",0.03,"m³"]
[""]
["","F - MOMENTO DE TRANSPORTE",null,"Quantidade","Unidade","CÓDIGO TRANSPORTE"]
["",{"$nulls":4},"LN","RP","P","TIPO (P, RP ou LN)","DMT ESTIMADA (km)","QUANTITATIVO TOTAL DE TRANSPORTE (tkm)"]
[""]
[]
[null,"TIPO (P, RP ou LN)","DMT ESTIMADA (km)"]
[null,"LN",1]
[]
["","SISTEMA DE CUSTOS REFERENCIAIS DE OBRAS - SICRO"]
["","Custo Unitário de Referência",null,{"$f":"$C$8","v":"2024-04-01"},{"$nulls":4},"Quantitativo",null,"un"]
["",4011233,"Sub-base estabilizada granulometricamente com mistura solo brita (70% - 30%) na pista com material de jazida e brita comercial",{"$nulls":5},{"$f":"(SUMIF('RESUMO MODULO TOTAL'!D:D,B80,'RESUMO MODULO TOTAL'!J:J))","v":18000}]
["","D - ATIVIDADES AUXILIARES",null,"Quantidade","Unidade"]
["",4016096,"Escavação e carga de material de jazida com escavadeira hidráulica de 1,56 m³",0.77019000000000004,"m³"]
[""]
["","F - MOMENTO DE TRANSPORTE",null,"Quantidade","Unidade","CÓDIGO TRANSPORTE"]
["",{"$nulls":4},"LN","RP","P","TIPO (P, RP ou LN)","DMT ESTIMADA (km)","QUANTITATIVO TOTAL DE TRANSPORTE (tkm)"]
[{"$f":"IF(I86=\"P\",H86,IF(I86=\"RP\",G86,IF(I86=\"LN\",F86,\"\")))","v":5914359},4016096,"Escavação e carga de material de jazida com escavadeira hidráulica de 1,56 m³ - Caminhão basculante com capacidade de 10 m³ - 188 kW",1.44411,"tkm",5914359,5914374,5914389,{"$f":"$B$76","v":"LN"},{"$f":"$C$76","v":1},{"$f":"IF(ISBLANK(J86),\"\",J86*D86)*$I$80","v":25993.98}]
[{"$f":"IF(I87=\"P\",H87,IF(I87=\"RP\",G87,IF(I87=\"LN\",F87,\"\")))","v":5914359},"M0191","Brita 1 - Caminhão basculante com capacidade de 10 m³ - 188 kW",0.61890000000000001,"tkm",5914359,5914374,5914389,{"$f":"$B$76","v":"LN"},{"$f":"$C$76","v":1},{"$f":"IF(ISBLANK(J87),\"\",J87*D87)*$I$80","v":11140.2}]
[""]
["","Obs."]
[]
["","SISTEMA DE CUSTOS REFERENCIAIS DE OBRAS - SICRO"]
["","Custo Unitário de Referência",null,{"$f":"$C$8","v":"2024-04-01"},{"$nulls":4},"Quantitativo",null,"m"]
["",2003373,"Meio-fio de concreto - MFC 03 - areia e brita comerciais - fôrma de madeira",{"$nulls":5},{"$f":"(SUMIF('RESUMO MODULO TOTAL'!D:D,B93,'RESUMO MODULO TOTAL'!J:J))*0.1","v":4800}]
["","D - ATIVIDADES AUXILIARES",null,"Quantidade","Unidade"]
[null,1107892," Concreto fck = 20 MPa - confecção em betoneira e lançamento manual - areia e brita comerciais",4.2000000000000003E-2,"m³"]
[null,2003842,"Enchimento de junta de concreto com argamassa asfáltica de densidade 1.700 kg/m³ - espessura de 1 cm",5.9499999999999997E-2,"kg"]
[null,3103302,"Fôrmas de tábuas de pinho para dispositivos de drenagem - utilização de 3 vezes - confecção, instalação e retirada",0.54749999999999999,"m²"]
[null,4805750,"Escavação manual em material de 1ª categoria na profundidade de até 1 m",0.03,"m³"]
[""]
["","F - MOMENTO DE TRANSPORTE",null,"Quantidade","Unidade","CÓDIGO TRANSPORTE"]
["",{"$nulls":4},"LN","RP","P","TIPO (P, RP ou LN)","DMT ESTIMADA (km)","QUANTITATIVO TOTAL DE TRANSPORTE (tkm)"]
[""]

{"sheet":"MOMENTO DE TRANSPORTE - AUX","index":6,"n_rows":130,"n_cols":11,"rows_kept":130,"cut":false,"hidden":false,"merged":[[4,1,4,10],[23,2,23,7],[23,9,23,10],[24,1,25,2],[24,3,25,3],[24,4,25,4],[24,5,24,7],[6,1,6,10],[31,5,31,7],[36,2,36,7],[36,9,36,10],[37,1,38,2],[37,3,38,3],[37,4,38,4],[37,5,37,7],[52,5,52,7],[45,2,45,7],[45,9,45,10],[46,1,47,2],[46,3,47,3],[46,4,47,4],[46,5,46,7],[82,2,82,7],[82,9,82,10],[89,5,89,7],[83,1,84,2],[83,3,84,3],[83,4,84,4],[83,5,83,7],[68,5,68,7],[73,2,73,7],[73,9,73,10],[74,1,75,2],[74,3,75,3],[74,4,75,4],[74,5,74,7],[60,2,60,7],[60,9,60,10],[61,1,62,2],[61,3,62,3],[61,4,62,4],[61,5,61,7],[96,2,96,7],[96,9,96,10],[97,1,98,2],[97,3,98,3],[97,4,98,4],[97,5,97,7],[104,5,104,7],[109,2,109,7],[109,9,109,10],[110,1,111,2],[110,3,111,3],[110,4,111,4],[110,5,110,7],[125,5,125,7],[118,2,118,7],[118,9,118,10],[119,1,120,2],[119,3,120,3],[119,4,120,4],[119,5,119,7]]}
[]
[]
[]
[]
[null,{"$f":"'RESUMO MODULO TOTAL'!B1","v":"EXECUÇÃO DE SERVIÇOS DE IMPLANTAÇÃO DE PAVIMENTAÇÃO EM BLOCO DE CONCRETO INTERTRAVADO, EM VIAS DE MUNICÍPIOS DIVERSOS INSERIDOS NA ÁREA DE ATUAÇÃO DA CODEVASF, NO ESTADO SERGIPE"}]
[]
[null,"MEMÓRIA DE QUANTITATIVOS - MOMENTO DE TRANSPORTE (AUXILIAR)"]
[null,"DATA BASE:",{"$f":"'RESUMO MODULO TOTAL'!N2","v":"2024-04-01"}]
[]
[null,null,"RESUMO DO TRANSPORTE AUXILIAR"]
[null,"CODIGO ","DESCRIÇÃO","TKM"]
[null,5914359,"Transporte com caminhão basculante de 10 m³ - rodovia em leito natural",{"$f":"ROUND(SUMIF($A:$A,B12,$K:$K),2)","v":4138.1000000000004}]
[null,5914374,"Transporte com caminhão basculante de 10 m³ - rodovia em revestimento primário",16552.41]
[null,5914389,"Transporte com caminhão basculante de 10 m³ - rodovia pavimentada",186214.59]
[null,5914449,"Transporte com caminhão carroceria de 15 t - rodovia em leito natural",920.02]
[null,5914464,"Transporte com caminhão carroceria de 15 t - rodovia em revestimento primário",3680.07]
[null,5914479,"Transporte com caminhão carroceria de 15 t - rodovia pavimentada",41400.769999999997]
[]
[null,"TIPO (P, RP ou LN)","DMT ATÉ 50 KM NÃO DEVE SER PAGA","DMT ACIMA DE 50 KM"]
[null,"P",null,45]
[]
["","SISTEMA DE CUSTOS REFERENCIAIS DE OBRAS - SICRO",{"$nulls":6},"Quantitivo"]
["","Custo Unitário de Referência",null,null,{"$f":"$C$8","v":"2024-04-01"},null,null,null,"(Coeficiente na composição principal) x (quantidade da principal no orçamento)",null,"m³"]
["",1107892,"Concreto fck = 20 MPa - confecção em betoneira e lançamento manual - areia e brita comerciais",{"$nulls":5},{"$f":"('MOMENTO DE TRANSPORTE - PRINC'!$D$37*VLOOKUP(C33,'RESUMO MODULO TOTAL'!D:R,7,FALSE))","v":2016.0000000000002}]
["","F - MOMENTO DE TRANSPORTE",null,"Quantidade","Unidade","DMT"]
["",{"$nulls":4},"LN","RP","P","TIPO (P, RP ou LN)","DMT ESTIMADA (km)","QUANTITATIVO TOTAL DE TRANSPORTE DE MATERIAL (tkm)"]
[{"$f":"IF(I27=\"P\",H27,IF(I27=\"RP\",G27,IF(I27=\"LN\",F27,\"\")))","v":5914479},"M0030","Aditivo plastificante e retardador de pega para concreto e argamassa - Caminhão carroceria 15 t",8.4999999999999995E-4,"tkm",5914449,5914464,5914479,{"$f":"$B$20","v":"P"},{"$f":"$D$20","v":45},{"$f":"IF(ISBLANK(J27),\"\",J27*(D27*$I$24))","v":77.111999999999995}]
[{"$f":"IF(I28=\"P\",H28,IF(I28=\"RP\",G28,IF(I28=\"LN\",F28,\"\")))","v":5914389},"M0082","Areia média lavada - Caminhão basculante 10 m³",0.95001000000000002,"tkm",5914359,5914374,5914389,{"$f":"$B$20","v":"P"},{"$f":"$D$20","v":45},{"$f":"IF(ISBLANK(J28),\"\",J28*(D28*$I$24))","v":86184.907200000016}]
[5914389,"M0191","Brita 1 - Caminhão basculante 10 m³",0.55130999999999997,"tkm",5914359,5914374,5914389,"P",45,{"$f":"IF(ISBLANK(J29),\"\",J29*(D29*$I$24))","v":50014.843200000003}]
[5914389,"M0192","Brita 2 - Caminhão basculante 10 m³",0.55130999999999997,"tkm",5914359,5914374,5914389,"P",45,{"$f":"IF(ISBLANK(J30),\"\",J30*(D30*$I$24))","v":50014.843200000003}]
[5914479,"M0424","Cimento Portland CP II - 32 - saco - Caminhão carroceria 15 t",0.28215000000000001,"tkm",5914449,5914464,5914479,"P",45,{"$f":"IF(ISBLANK(J31),\"\",J31*(D31*$I$24))","v":25596.648000000005}]
[""]
[null,"PRINCIPAL:",2003373]
[]
["","SISTEMA DE CUSTOS REFERENCIAIS DE OBRAS - SICRO",{"$nulls":6},"Quantitivo"]
["","Custo Unitário de Referência",null,null,{"$f":"$C$8","v":"2024-04-01"},null,null,null,"(Coeficiente na composição principal) x (quantidade da principal no orçamento)",null,"kg"]
["",2003842,"Enchimento de junta de concreto com argamassa asfáltica de densidade 1.700 kg/m³ - espessura de 1 cm",{"$nulls":5},{"$f":"('MOMENTO DE TRANSPORTE - PRINC'!$D$38*VLOOKUP(C42,'RESUMO MODULO TOTAL'!D:R,7,FALSE))","v":2856}]
["","F - MOMENTO DE TRANSPORTE",null,"Quantidade","Unidade","DMT"]
["",{"$nulls":4},"LN","RP","P","TIPO (P, RP ou LN)","DMT ESTIMADA (km)","QUANTITATIVO TOTAL DE TRANSPORTE DE MATERIAL (tkm)"]
[{"$f":"IF(I40=\"P\",H40,IF(I40=\"RP\",G40,IF(I40=\"LN\",F40,\"\")))","v":5914479},"M2158","Argamassa asfáltica - Caminhão carroceria com capacidade de 15 t - 188 Kw",1E-3,"tkm",5914449,5914464,5914479,{"$f":"$B$20","v":"P"},{"$f":"$D$20","v":45},{"$f":"IF(ISBLANK(J40),\"\",J40*(D40*$I$37))","v":128.51999999999998}]
[]
[null,"PRINCIPAL:",2003373]
[]
["","SISTEMA DE CUSTOS REFERENCIAIS DE OBRAS - SICRO",{"$nulls":6},"Quantitivo"]
["","Custo Unitário de Referência",null,null,{"$f":"$C$8","v":"2024-04-01"},null,null,null,"(Coeficiente na composição principal) x (quantidade da principal no orçamento)",null,"m²"]
["",3103302,"Fôrmas de tábuas de pinho para dispositivos de drenagem - utilização de 3 vezes - confecção, instalação e retirada",{"$nulls":5},{"$f":"('MOMENTO DE TRANSPORTE - PRINC'!$D$39*VLOOKUP(C54,'RESUMO MODULO TOTAL'!D:R,7,FALSE))","v":26280}]
["","F - MOMENTO DE TRANSPORTE",null,"Quantidade","Unidade","DMT"]
["",{"$nulls":4},"LN","RP","P","TIPO (P, RP ou LN)","DMT ESTIMADA (km)","QUANTITATIVO TOTAL DE TRANSPORTE DE MATERIAL (tkm)"]
[{"$f":"IF(I49=\"P\",H49,IF(I49=\"RP\",G49,IF(I49=\"LN\",F49,\"\")))","v":5914479},"M0560","Desmoldante para fôrmas de madeira - Caminhão carroceria com capacidade de 15 t - 188 Kw",2.0000000000000002E-5,"tkm",5914449,5914464,5914479,{"$f":"$B$20","v":"P"},{"$f":"$D$20","v":45},{"$f":"IF(ISBLANK(J49),\"\",J49*(D49*$I$46))","v":23.652000000000005}]
[{"$f":"IF(I50=\"P\",H50,IF(I50=\"RP\",G50,IF(I50=\"LN\",F50,\"\")))","v":5914479},"M1205"," Prego de ferro - Caminhão carroceria com capacidade de 15 t - 188 kW",2.0000000000000002E-5,"tkm",5914449,5914464,5914479,"P",45,{"$f":"IF(ISBLANK(J50),\"\",J50*(D50*$I$46))","v":23.652000000000005}]
[5914479,"M0290","Tábua - E = 2,5 cm e L = 10 cm - Caminhão carroceria com capacidade de 15 t - 188 kW",3.0400000000000002E-3,"tkm",5914449,5914464,5914479,"P",45,{"$f":"IF(ISBLANK(J51),\"\",J51*(D51*$I$46))","v":3595.1039999999998}]
[5914479,"M1429"," Tábua de pinho de terceira - E = 2,5 cm - Caminhão carroceria com capacidade de 15 t - 188 kW",1.0109999999999999E-2,"tkm",5914449,5914464,5914479,"P",45,{"$f":"IF(ISBLANK(J52),\"\",J52*(D52*$I$46))","v":11956.085999999999}]
[""]
[null,"PRINCIPAL:",2003373]
[]
[null,"TIPO (P, RP ou LN)","DMT ATÉ 50 KM NÃO DEVE SER PAGA","DMT ACIMA DE 50 KM"]
[null,"RP",0,4]
[]
["","SISTEMA DE CUSTOS REFERENCIAIS DE OBRAS - SICRO",{"$nulls":6},"Quantitivo"]
["","Custo Unitário de Referência",null,null,{"$f":"$C$8","v":"2024-04-01"},null,null,null,"(Coeficiente na composição principal) x (quantidade da principal no orçamento)",null,"m³"]
["",1107892,"Concreto fck = 20 MPa - confecção em betoneira e lançamento manual - areia e brita comerciais",{"$nulls":5},{"$f":"('MOMENTO DE TRANSPORTE - PRINC'!$D$37*VLOOKUP(C70,'RESUMO MODULO TOTAL'!D:R,7,FALSE))","v":2016.0000000000002}]
["","F - MOMENTO DE TRANSPORTE",null,"Quantidade","Unidade","DMT"]
["",{"$nulls":4},"LN","RP","P","TIPO (P, RP ou LN)","DMT ESTIMADA (km)","QUANTITATIVO TOTAL DE TRANSPORTE DE MATERIAL (tkm)"]
[{"$f":"IF(I64=\"P\",H64,IF(I64=\"RP\",G64,IF(I64=\"LN\",F64,\"\")))","v":5914464},"M0030","Aditivo plastificante e retardador de pega para concreto e argamassa - Caminhão carroceria 15 t",8.4999999999999995E-4,"tkm",5914449,5914464,5914479,{"$f":"$B$57","v":"RP"},{"$f":"$D$57","v":4},{"$f":"IF(ISBLANK(J64),\"\",J64*(D64*$I$61))","v":6.8544}]
[{"$f":"IF(I65=\"P\",H65,IF(I65=\"RP\",G65,IF(I65=\"LN\",F65,\"\")))","v":5914374},"M0082","Areia média lavada - Caminhão basculante 10 m³",0.95001000000000002,"tkm",5914359,5914374,5914389,{"$f":"$B$57","v":"RP"},{"$f":"$D$57","v":4},{"$f":"IF(ISBLANK(J65),\"\",J65*(D65*$I$61))","v":7660.8806400000012}]
[5914374,"M0191","Brita 1 - Caminhão basculante 10 m³",0.55130999999999997,"tkm",5914359,5914374,5914389,"RP",4,{"$f":"IF(ISBLANK(J66),\"\",J66*(D66*$I$61))","v":4445.7638400000005}]
[5914374,"M0192","Brita 2 - Caminhão basculante 10 m³",0.55130999999999997,"tkm",5914359,5914374,5914389,"RP",4,4445.7638400000005]
[5914464,"M0424","Cimento Portland CP II - 32 - saco - Caminhão carroceria 15 t",0.28215000000000001,"tkm",5914449,5914464,5914479,"RP",4,2275.2576000000004]
[""]
[null,"PRINCIPAL:",2003373]
[]
["","SISTEMA DE CUSTOS REFERENCIAIS DE OBRAS - SICRO",{"$nulls":6},"Quantitivo"]
["","Custo Unitário de Referência",null,null,{"$f":"$C$8","v":"2024-04-01"},null,null,"m²","(Coeficiente na composição principal) x (quantidade da principal no orçamento)",null,"kg"]
["",2003842,"Enchimento de junta de concreto com argamassa asfáltica de densidade 1.700 kg/m³ - espessura de 1 cm",{"$nulls":5},{"$f":"('MOMENTO DE TRANSPORTE - PRINC'!$D$38*VLOOKUP(C79,'RESUMO MODULO TOTAL'!D:R,7,FALSE))","v":2856}]
["","F - MOMENTO DE TRANSPORTE",null,"Quantidade","Unidade","DMT"]
["",{"$nulls":4},"LN","RP","P","TIPO (P, RP ou LN)","DMT ESTIMADA (km)","QUANTITATIVO TOTAL DE TRANSPORTE DE MATERIAL (tkm)"]
[{"$f":"IF(I77=\"P\",H77,IF(I77=\"RP\",G77,IF(I77=\"LN\",F77,\"\")))","v":5914464},"M2158","Argamassa asfáltica - Caminhão carroceria com capacidade de 15 t - 188 Kw",1E-3,"tkm",5914449,5914464,5914479,{"$f":"$B$57","v":"RP"},{"$f":"$D$57","v":4},{"$f":"IF(ISBLANK(J77),\"\",J77*(D77*$I$74))","v":11.423999999999999}]
[]
[null,"PRINCIPAL:",2003373]
[]
["","SISTEMA DE CUSTOS REFERENCIAIS DE OBRAS - SICRO",{"$nulls":6},"Quantitivo"]
["","Custo Unitário de Referência",null,null,{"$f":"$C$8","v":"2024-04-01"},null,null,null,"(Coeficiente na composição principal) x (quantidade da principal no orçamento)",null,"m²"]
["",3103302,"Fôrmas de tábuas de pinho para dispositivos de drenagem - utilização de 3 vezes - confecção, instalação e retirada",{"$nulls":5},{"$f":"('MOMENTO DE TRANSPORTE - PRINC'!$D$39*VLOOKUP(C91,'RESUMO MODULO TOTAL'!D:R,7,FALSE))","v":26280}]
["","F - MOMENTO DE TRANSPORTE",null,"Quantidade","Unidade","DMT"]
["",{"$nulls":4},"LN","RP","P","TIPO (P, RP ou LN)","DMT ESTIMADA (km)","QUANTITATIVO TOTAL DE TRANSPORTE DE MATERIAL (tkm)"]
[{"$f":"IF(I86=\"P\",H86,IF(I86=\"RP\",G86,IF(I86=\"LN\",F86,\"\")))","v":5914464},"M0560","Desmoldante para fôrmas de madeira - Caminhão carroceria com capacidade de 15 t - 188 Kw",2.0000000000000002E-5,"tkm",5914449,5914464,5914479,{"$f":"$B$57","v":"RP"},{"$f":"$D$57","v":4},{"$f":"IF(ISBLANK(J86),\"\",J86*(D86*$I$83))","v":2.1024000000000003}]
[{"$f":"IF(I87=\"P\",H87,IF(I87=\"RP\",G87,IF(I87=\"LN\",F87,\"\")))","v":5914464},"M1205"," Prego de ferro - Caminhão carroceria com capacidade de 15 t - 188 kW",2.0000000000000002E-5,"tkm",5914449,5914464,5914479,{"$f":"$B$57","v":"RP"},{"$f":"$D$57","v":4},{"$f":"IF(ISBLANK(J87),\"\",J87*(D87*$I$83))","v":2.1024000000000003}]
[5914464,"M0290","Tábua - E = 2,5 cm e L = 10 cm - Caminhão carroceria com capacidade de 15 t - 188 kW",3.0400000000000002E-3,"tkm",5914449,5914464,5914479,"RP",4,319.56479999999999]
[5914464,"M1429"," Tábua de pinho de terceira - E = 2,5 cm - Caminhão carroceria com capacidade de 15 t - 188 kW",1.0109999999999999E-2,"tkm",5914449,5914464,5914479,"RP",4,1062.7631999999999]
[""]
[null,"PRINCIPAL:",2003373]
[null,"TIPO (P, RP ou LN)","DMT ATÉ 50 KM NÃO DEVE SER PAGA","DMT ACIMA DE 50 KM"]
[null,"LN",0,1]
[]
["","SISTEMA DE CUSTOS REFERENCIAIS DE OBRAS - SICRO",{"$nulls":6},"Quantitivo"]
["","Custo Unitário de Referência",null,null,{"$f":"$C$8","v":"2024-04-01"},null,null,null,"(Coeficiente na composição principal) x (quantidade da principal no orçamento)",null,"m³"]
["",1107892,"Concreto fck = 20 MPa - confecção em betoneira e lançamento manual - areia e brita comerciais",{"$nulls":5},{"$f":"('MOMENTO DE TRANSPORTE - PRINC'!$D$37*VLOOKUP(C106,'RESUMO MODULO TOTAL'!D:R,7,FALSE))","v":2016.0000000000002}]
["","F - MOMENTO DE TRANSPORTE",null,"Quantidade","Unidade","DMT"]
["",{"$nulls":4},"LN","RP","P","TIPO (P, RP ou LN)","DMT ESTIMADA (km)","QUANTITATIVO TOTAL DE TRANSPORTE DE MATERIAL (tkm)"]
[{"$f":"IF(I100=\"P\",H100,IF(I100=\"RP\",G100,IF(I100=\"LN\",F100,\"\")))","v":5914449},"M0030","Aditivo plastificante e retardador de pega para concreto e argamassa - Caminhão carroceria 15 t",8.4999999999999995E-4,"tkm",5914449,5914464,5914479,{"$f":"$B$93","v":"LN"},{"$f":"$D$93","v":1},{"$f":"IF(ISBLANK(J100),\"\",J100*(D100*$I$97))","v":1.7136}]
[{"$f":"IF(I101=\"P\",H101,IF(I101=\"RP\",G101,IF(I101=\"LN\",F101,\"\")))","v":5914359},"M0082","Areia média lavada - Caminhão basculante 10 m³",0.95001000000000002,"tkm",5914359,5914374,5914389,{"$f":"$B$93","v":"LN"},{"$f":"$D$93","v":1},{"$f":"IF(ISBLANK(J101),\"\",J101*(D101*$I$97))","v":1915.2201600000003}]
[5914359,"M0191","Brita 1 - Caminhão basculante 10 m³",0.55130999999999997,"tkm",5914359,5914374,5914389,"LN",1,1111.4409600000001]
[5914359,"M0192","Brita 2 - Caminhão basculante 10 m³",0.55130999999999997,"tkm",5914359,5914374,5914389,"LN",1,1111.4409600000001]
[5914449,"M0424","Cimento Portland CP II - 32 - saco - Caminhão carroceria 15 t",0.28215000000000001,"tkm",5914449,5914464,5914479,"LN",1,568.81440000000009]
[""]
[null,"PRINCIPAL:",2003373]
[]
["","SISTEMA DE CUSTOS REFERENCIAIS DE OBRAS - SICRO",{"$nulls":6},"Quantitivo"]
["","Custo Unitário de Referência",null,null,{"$f":"$C$8","v":"2024-04-01"},null,null,null,"(Coeficiente na composição principal) x (quantidade da principal no orçamento)",null,"kg"]
["",2003842,"Enchimento de junta de concreto com argamassa asfáltica de densidade 1.700 kg/m³ - espessura de 1 cm",{"$nulls":5},{"$f":"('MOMENTO DE TRANSPORTE - PRINC'!$D$38*VLOOKUP(C115,'RESUMO MODULO TOTAL'!D:R,7,FALSE))","v":2856}]
["","F - MOMENTO DE TRANSPORTE",null,"Quantidade","Unidade","DMT"]
["",{"$nulls":4},"LN","RP","P","TIPO (P, RP ou LN)","DMT ESTIMADA (km)","QUANTITATIVO TOTAL DE TRANSPORTE DE MATERIAL (tkm)"]
[{"$f":"IF(I113=\"P\",H113,IF(I113=\"RP\",G113,IF(I113=\"LN\",F113,\"\")))","v":5914449},"M2158","Argamassa asfáltica - Caminhão carroceria com capacidade de 15 t - 188 Kw",1E-3,"tkm",5914449,5914464,5914479,{"$f":"$B$93","v":"LN"},{"$f":"$D$93","v":1},{"$f":"IF(ISBLANK(J113),\"\",J113*(D113*$I$110))","v":2.8559999999999999}]
[]
[null,"PRINCIPAL:",2003373]
[]
["","SISTEMA DE CUSTOS REFERENCIAIS DE OBRAS - SICRO",{"$nulls":6},"Quantitivo"]
["","Custo Unitário de Referência",null,null,{"$f":"$C$8","v":"2024-04-01"},null,null,null,"(Coeficiente na composição principal) x (quantidade da principal no orçamento)",null,"m²"]
["",3103302,"Fôrmas de tábuas de pinho para dispositivos de drenagem - utilização de 3 vezes - confecção, instalação e retirada",{"$nulls":5},{"$f":"('MOMENTO DE TRANSPORTE - PRINC'!$D$39*VLOOKUP(C127,'RESUMO MODULO TOTAL'!D:R,7,FALSE))","v":26280}]
["","F - MOMENTO DE TRANSPORTE",null,"Quantidade","Unidade","DMT"]
["",{"$nulls":4},"LN","RP","P","TIPO (P, RP ou LN)","DMT ESTIMADA (km)","QUANTITATIVO TOTAL DE TRANSPORTE DE MATERIAL (tkm)"]
[{"$f":"IF(I122=\"P\",H122,IF(I122=\"RP\",G122,IF(I122=\"LN\",F122,\"\")))","v":5914449},"M0560","Desmoldante para fôrmas de madeira - Caminhão carroceria com capacidade de 15 t - 188 Kw",2.0000000000000002E-5,"tkm",5914449,5914464,5914479,{"$f":"$B$93","v":"LN"},{"$f":"$D$93","v":1},{"$f":"IF(ISBLANK(J122),\"\",J122*(D122*$I$119))","v":0.52560000000000007}]
[{"$f":"IF(I123=\"P\",H123,IF(I123=\"RP\",G123,IF(I123=\"LN\",F123,\"\")))","v":5914449},"M1205"," Prego de ferro - Caminhão carroceria com capacidade de 15 t - 188 kW",2.0000000000000002E-5,"tkm",5914449,5914464,5914479,"LN",1,{"$f":"IF(ISBLANK(J123),\"\",J123*(D123*$I$119))","v":0.52560000000000007}]
[5914449,"M0290","Tábua - E = 2,5 cm e L = 10 cm - Caminhão carroceria com capacidade de 15 t - 188 kW",3.0400000000000002E-3,"tkm",5914449,5914464,5914479,"LN",1,79.891199999999998]
[5914449,"M1429"," Tábua de pinho de terceira - E = 2,5 cm - Caminhão carroceria com capacidade de 15 t - 188 kW",1.0109999999999999E-2,"tkm",5914449,5914464,5914479,"LN",1,265.69079999999997]
[""]
[null,"PRINCIPAL:",2003373]
[{"$f":"IF(I128=\"P\",H128,IF(I128=\"RP\",G128,IF(I128=\"LN\",F128,\"\")))","v":""}]
[]
[{"$f":"IF(I130=\"P\",H130,IF(I130=\"RP\",G130,IF(I130=\"LN\",F130,\"\")))","v":""}]

{"sheet":"Mob","index":7,"n_rows":41,"n_cols":9,"rows_kept":41,"cut":false,"hidden":false,"merged":[[10,6,10,7],[34,0,34,1],[10,0,11,0],[10,1,11,1],[10,2,11,2],[10,3,11,3],[10,4,11,4],[10,5,11,5],[3,0,3,7],[4,0,8,4],[4,5,4,6],[5,5,6,6],[5,7,6,7],[7,5,8,6],[7,7,8,7]]}
[]
[]
[]
[{"$f":"'RESUMO MODULO TOTAL'!B1","v":"EXECUÇÃO DE SERVIÇOS DE IMPLANTAÇÃO DE PAVIMENTAÇÃO EM BLOCO DE CONCRETO INTERTRAVADO, EM VIAS DE MUNICÍPIOS DIVERSOS INSERIDOS NA ÁREA DE ATUAÇÃO DA CODEVASF, NO ESTADO SERGIPE"}]
["MOBILIZAÇÃO/DESMOBILIZAÇÃO (MOB)",{"$nulls":4},"Frentes de serviços",null,{"$f":"'MC MODULO'!G11","v":12}]
[{"$nulls":5},"Distância da Capital ao Canteiro:",null,100]
[]
[{"$nulls":5},"Velocidade média de transporte (pavim.):",null,60]
[]
["Transporte dos equipamentos"]
["CODIGO","EQUIPAMENTO","VEÍCULO TRANSPORTADOR","QTDE","K","FU","CUSTO DO TRANSPORTE"]
[{"$nulls":6},"(R$/h)","(R$)/km"]
["E9579","Caminhão basculante com capacidade de 10 m³ - 188 kW","E9579",7,{"$f":"IF(A13=C13,1,2)","v":1},1,290.12920000000003,{"$f":"ROUND(((D13*E13*F13)/$H$8)*G13,2)","v":33.85},{"$f":"(1/60)*D13*E13*F13","v":0.11666666666666667}]
["E9041","Caminhão carroceria com guindauto com capacidade de 45 t.m - 188 kW","E9041",5,{"$f":"IF(A14=C14,1,2)","v":1},1,383.6,{"$f":"((D14*E14*F14)/$H$8)*G14","v":31.966666666666669},{"$f":"(1/60)*D14*E14*F14","v":8.3333333333333329E-2}]
["E9667","Caminhão basculante com capacidade de 14 m³ - 188 kW","E9667",2,1,1,291.20460000000003,9.7068200000000004,3.3333333333333333E-2]
["E9134","Miniônibus com capacidade para 30 passageiros - 111 kW","E9134",1,1,1,218.8767,3.647945,1.6666666666666666E-2]
["E9571","Caminhão tanque com capacidade de 10.000 l - 188 kW","E9571",1,1,1,315.7824,5.2630400000000002,1.6666666666666666E-2]
["E9524","Motoniveladora - 93 kW","E9665",1,2,1,379.69779999999997,12.656593333333332,3.3333333333333333E-2]
["E9515","Escavadeira hidráulica sobre esteiras com caçamba com capacidade de 1,56 m³ - 118 kW","E9666",1,2,1,405.62569999999999,13.520856666666667,3.3333333333333333E-2]
["E9592","Caminhão carroceria com capacidade de 15 t - 188 kW","E9592",1,1,1,257.65910000000002,4.2943183333333339,1.6666666666666666E-2]
["E9762","Rolo compactador de pneus autopropelido de 27 t - 85 kW","E9666",1,2,0.5,405.62569999999999,6.7604283333333335,1.6666666666666666E-2]
["E9093","Veículo leve - 53 kW (sem motorista)","E9512",3,1,1,65.079400000000007,3.2539700000000007,0.05]
["E9685","Rolo compactador pé de carneiro vibratório autopropelido por pneus de 11,6 t - 82 kW","E9666",1,2,0.5,405.62569999999999,6.7604283333333335,1.6666666666666666E-2]
["E9577","Trator agrícola sobre pneus - 77 kW","E9665",1,2,0.5,379.69779999999997,6.3282966666666658,1.6666666666666666E-2]
["00010777","CONTAINER 2,30 X 4,30 M, ALT. 2,50 M, PARA SANITARIO","E9665",1,2,0.5,379.69779999999997,6.3282966666666658,1.6666666666666666E-2]
["E9540","Trator sobre esteiras com lâmina - 127 kW","E9018",1,2,0.5,551.85469999999998,9.1975783333333325,1.6666666666666666E-2]
["00010776","CONTAINER 2,30 X 6,00 M, ALT. 2,50 M, PARA ESCRITORIO","E9665",1,2,1,379.69779999999997,12.656593333333332,3.3333333333333333E-2]
["E9644","Caminhão demarcador de faixas com sistema de pintura a frio - 28 kW/115 kW","E9644",1,1,1,362.96949999999998,6.0494916666666665,1.6666666666666666E-2]
["E9687","Caminhão carroceria com capacidade de 5 t - 115 kW","E9687",1,1,1,144.8526,2.4142099999999997,1.6666666666666666E-2]
["E9076","Equipamento para pintura eletrostática com cabine dupla de 7,00 kW e estufa de 80.000 kCal","E9665",1,2,1,379.69779999999997,12.656593333333332,3.3333333333333333E-2]
["E9686","Caminhão carroceria com guindauto com capacidade de 20 t.m - 136 kW","E9686",1,1,1,297.82150000000001,4.9636916666666666,1.6666666666666666E-2]
[{"$nulls":6},"TOTAL",{"$f":"TRUNC(SUM(H13:H31),2)","v":192.27}]
[]
[]
["CUSTO TOTAL MOBILIZAÇÃO E DESMOBILIZAÇÃO"]
["DESCRIÇÃO","VALOR"]
["Custo Mobilização (km)",{"$f":"H32","v":192.27}]
["BDI (%)",{"$f":"BDI!D14","v":0.23080000000000001}]
["Custo Mobilização (R$/km) com BDI",{"$f":"TRUNC(B37+(B37*B38),2)","v":236.64}]
["Total de Frentes",{"$f":"'MC MODULO'!G11","v":12}]
["Custo Mobilização (frentes x distancia)",{"$f":"B39*H6*B40","v":283968}]

{"sheet":" Canteiro","index":8,"n_rows":13,"n_cols":6,"rows_kept":13,"cut":false,"hidden":false,"merged":[[3,0,3,5],[3,9,4,9],[4,7,4,8],[9,3,9,4],[12,3,12,4]]}
[]
[]
[]
["CANTEIRO DE OBRAS PARA CONSTRUÇÃO RODOVIÁRIA"]
["Descrição dos serviços","Tipo de container","Unidade","Quantidade","Preço unitário (R$)","Total (R$)"]
["Escritório e seção técnica"]
["LOCACAO DE CONTAINER 2,30 X 6,00 M, ALT. 2,50 M, PARA ESCRITORIO, SEM DIVISORIAS INTERNAS E SEM SANITARIO (NAO INCLUI MOBILIZACAO/DESMOBILIZACAO)                                                                                                                                                                                                                                                                                                                                                         ",10776,"und",1,650.39,{"$f":"TRUNC(D7*E7,2)","v":650.39}]
["Banheiro e vestiário"]
["LOCACAO DE CONTAINER 2,30 X 4,30 M, ALT. 2,50 M, PARA SANITARIO, COM 3 BACIAS, 4 CHUVEIROS, 1 LAVATORIO E 1 MICTORIO (NAO INCLUI MOBILIZACAO/DESMOBILIZACAO)                                                                                                                                                                                                                                                                                                                                              ",10777,"und",1,945.23,{"$f":"TRUNC(D9*E9,2)","v":945.23}]
[null,null,null,"TOTAL DO CANTEIRO",null,{"$f":"SUM(F7:F9)","v":1595.62}]
[null,null,null,"DURAÇÃO (MESES)",2.5,{"$f":"F10*E11","v":3989.0499999999997}]
[null,null,null,"BDI",null,{"$f":"BDI!D14","v":0.23080000000000001}]
[null,null,null,"TOTAL DO CANTEIRO (com BDI)",null,{"$f":"TRUNC(F11+(F11*F12),2)","v":4909.72}]

{"sheet":"Adm Local","index":9,"n_rows":243,"n_cols":9,"rows_kept":243,"cut":false,"hidden":false,"merged":[[0,0,2,8],[89,5,89,6],[89,7,89,8],[221,3,221,4],[221,5,221,6],[221,7,221,8],[97,3,97,4],[97,5,97,6],[97,7,97,8],[98,3,98,4],[98,5,98,6],[98,7,98,8],[101,3,101,4],[101,5,101,6],[101,7,101,8],[102,5,102,6],[102,7,102,8],[109,0,109,8],[99,3,99,4],[99,5,99,6],[99,7,99,8],[100,3,100,4],[100,5,100,6],[100,7,100,8],[85,7,85,8],[86,3,86,4],[86,5,86,6],[86,7,86,8],[87,3,87,4],[87,5,87,6],[87,7,87,8],[88,3,88,4],[88,5,88,6],[88,7,88,8],[3,0,3,8],[4,3,4,4],[4,5,4,6],[4,7,4,8],[5,3,5,4],[5,5,5,6],[5,7,5,8],[8,3,8,4],[8,5,8,6],[8,7,8,8],[9,3,9,4],[9,5,9,6],[9,7,9,8],[6,3,6,4],[6,5,6,6],[6,7,6,8],[7,3,7,4],[7,5,7,6],[7,7,7,8],[12,3,12,4],[12,5,12,6],[12,7,12,8],[13,3,13,4],[13,5,13,6],[13,7,13,8],[10,3,10,4],[10,5,10,6],[10,7,10,8],[11,3,11,4],[11,5,11,6],[11,7,11,8],[16,3,16,4],[16,5,16,6],[16,7,16,8],[17,3,17,4],[17,5,17,6],[17,7,17,8],[14,3,14,4],[14,5,14,6],[14,7,14,8],[15,3,15,4],[15,5,15,6],[15,7,15,8],[20,3,20,4],[20,5,20,6],[20,7,20,8],[21,3,21,4],[21,5,21,6],[21,7,21,8],[18,3,18,4],[18,5,18,6],[18,7,18,8],[19,3,19,4],[19,5,19,6],[19,7,19,8],[24,3,24,4],[24,5,24,6],[24,7,24,8],[25,3,25,4],[25,5,25,6],[25,7,25,8],[22,3,22,4],[22,5,22,6],[22,7,22,8],[23,3,23,4],[23,5,23,6],[23,7,23,8],[28,3,28,4],[28,5,28,6],[28,7,28,8],[29,3,29,4],[29,5,29,6],[29,7,29,8],[26,3,26,4],[26,5,26,6],[26,7,26,8],[27,3,27,4],[27,5,27,6],[27,7,27,8],[51,3,51,4],[51,5,51,6],[51,7,51,8],[52,3,52,4],[52,5,52,6],[52,7,52,8],[32,0,32,8],[48,0,48,8],[49,3,49,4],[49,5,49,6],[49,7,49,8],[50,3,50,4],[50,5,50,6],[50,7,50,8],[62,3,62,4],[62,5,62,6],[62,7,62,8],[63,3,63,4],[63,5,63,6],[63,7,63,8],[53,5,53,6],[53,7,53,8],[60,0,60,8],[61,3,61,4],[61,5,61,6],[61,7,61,8],[64,3,64,4],[64,5,64,6],[64,7,64,8],[65,5,65,6],[65,7,65,8],[96,0,96,8],[72,0,72,8],[73,3,73,4],[73,5,73,6],[73,7,73,8],[74,3,74,4],[74,5,74,6],[74,7,74,8],[75,3,75,4],[75,5,75,6],[75,7,75,8],[76,3,76,4],[76,5,76,6],[76,7,76,8],[77,5,77,6],[77,7,77,8],[84,0,84,8],[85,3,85,4],[85,5,85,6],[113,3,113,4],[113,5,113,6],[113,7,113,8],[110,3,110,4],[110,5,110,6],[110,7,110,8],[111,3,111,4],[111,5,111,6],[111,7,111,8],[112,3,112,4],[112,5,112,6],[112,7,112,8],[116,5,116,6],[116,7,116,8],[118,0,118,8],[119,3,119,4],[119,5,119,6],[119,7,119,8],[114,3,114,4],[114,5,114,6],[114,7,114,8],[115,3,115,4],[115,5,115,6],[115,7,115,8],[122,3,122,4],[122,5,122,6],[122,7,122,8],[123,5,123,6],[123,7,123,8],[125,0,125,8],[120,3,120,4],[120,5,120,6],[120,7,120,8],[121,3,121,4],[121,5,121,6],[121,7,121,8],[128,3,128,4],[128,5,128,6],[128,7,128,8],[126,3,126,4],[126,5,126,6],[126,7,126,8],[127,3,127,4],[127,5,127,6],[127,7,127,8],[132,3,132,4],[132,5,132,6],[132,7,132,8],[133,3,133,4],[133,5,133,6],[133,7,133,8],[129,5,129,6],[129,7,129,8],[131,0,131,8],[134,3,134,4],[134,5,134,6],[134,7,134,8],[137,5,137,6],[137,7,137,8],[139,0,139,8],[140,3,140,4],[140,5,140,6],[140,7,140,8],[135,3,135,4],[135,5,135,6],[135,7,135,8],[136,3,136,4],[136,5,136,6],[136,7,136,8],[143,5,143,6],[143,7,143,8],[145,0,145,8],[146,3,146,4],[146,5,146,6],[146,7,146,8],[141,3,141,4],[141,5,141,6],[141,7,141,8],[142,3,142,4],[142,5,142,6],[142,7,142,8],[150,3,150,4],[150,5,150,6],[150,7,150,8],[147,3,147,4],[147,5,147,6],[147,7,147,8],[148,3,148,4],[148,5,148,6],[148,7,148,8],[149,7,149,8],[169,0,169,8],[170,1,170,4],[183,0,183,8],[184,1,184,4],[185,1,185,4],[151,5,151,6],[151,7,151,8],[153,0,153,8],[154,0,154,8],[155,1,155,4],[168,0,168,8],[194,3,194,4],[194,5,194,6],[194,7,194,8],[195,3,195,4],[195,5,195,6],[195,7,195,8],[188,0,188,8],[189,1,189,4],[190,1,190,4],[193,0,193,8],[198,3,198,4],[198,5,198,6],[198,7,198,8],[199,3,199,4],[199,5,199,6],[199,7,199,8],[196,3,196,4],[196,5,196,6],[196,7,196,8],[197,3,197,4],[197,5,197,6],[197,7,197,8],[203,3,203,4],[203,5,203,6],[203,7,203,8],[204,3,204,4],[204,5,204,6],[204,7,204,8],[200,3,200,4],[200,5,200,6],[200,7,200,8],[202,3,202,4],[202,5,202,6],[202,7,202,8],[207,3,207,4],[207,5,207,6],[207,7,207,8],[208,7,208,8],[212,0,212,8],[213,3,213,4],[213,5,213,6],[213,7,213,8],[205,3,205,4],[205,5,205,6],[205,7,205,8],[206,3,206,4],[206,5,206,6],[206,7,206,8],[216,3,216,4],[216,5,216,6],[216,7,216,8],[217,3,217,4],[217,5,217,6],[217,7,217,8],[214,3,214,4],[214,5,214,6],[214,7,214,8],[215,3,215,4],[215,5,215,6],[215,7,215,8],[218,3,218,4],[218,5,218,6],[218,7,218,8],[219,3,219,4],[219,5,219,6],[219,7,219,8],[222,3,222,4],[222,5,222,6],[222,7,222,8],[224,3,224,4],[224,5,224,6],[224,7,224,8],[225,3,225,4],[225,5,225,6],[225,7,225,8],[220,3,220,4],[220,5,220,6],[220,7,220,8],[223,3,223,4],[223,5,223,6],[223,7,223,8],[228,3,228,4],[228,5,228,6],[228,7,228,8],[229,3,229,4],[229,5,229,6],[229,7,229,8],[226,3,226,4],[226,5,226,6],[226,7,226,8],[227,3,227,4],[227,5,227,6],[227,7,227,8],[235,7,235,8],[232,3,232,4],[232,5,232,6],[232,7,232,8],[233,3,233,4],[233,5,233,6],[233,7,233,8],[230,3,230,4],[230,5,230,6],[230,7,230,8],[231,3,231,4],[231,5,231,6],[231,7,231,8],[241,3,241,4],[241,5,241,6],[242,3,242,4],[242,5,242,6],[149,3,149,4],[149,5,149,6],[238,7,238,8],[239,3,239,4],[239,5,239,6],[239,7,239,8],[240,3,240,4],[240,5,240,6],[240,7,240,8],[236,3,236,4],[236,5,236,6],[236,7,236,8],[237,3,237,4],[237,5,237,6],[237,7,237,8],[234,3,234,4],[234,5,234,6],[234,7,234,8],[235,3,235,4],[235,5,235,6]]}
[]
[]
[]
["parcela fixa da administração local \n(mão de obra)"]
["Código","Discriminação ","Unidade"," Quantidade ",null,"Custo Unitário (R$)",null," Custo Total (R$)"]
[null,"Mão de Obra"]
[null,"Gerência Técnica"]
[null,"Geral"]
["P9955","Engenheiro chefe","mês",0.5,null,30052.9329,null,{"$f":"F9*D9","v":15026.46645}]
["P9840","Encarregado geral","mês",0.5,null,9420.2612000000008,null,{"$f":"F10*D10","v":4710.1306000000004}]
["P9897","Técnico de meio ambiente","mês",0,null,0,null,{"$f":"F11*D11","v":0}]
["P9948","Motorista","mês",0,null,0,null,{"$f":"F12*D12","v":0}]
["P9878","Secretária","mês",0,null,0,null,{"$f":"F13*D13","v":0}]
[{"$nulls":5},"Subtotal do Item 1.1",null,{"$f":"SUM(H9:I13)","v":19736.59705}]
[null,"Auxiliar"]
["P9946","Engenheiro auxiliar","mês",1,null,21982.107,null,{"$f":"D16*F16","v":21982.107}]
["P9903","Auxiliar técnico","mês",0,null,null,null,{"$f":"D17*F17","v":0}]
[{"$nulls":5},"Subtotal do Item 1.2",null,{"$f":"SUM(H16:I17)","v":21982.107}]
[null,"Gerência Administrativa"]
[null,"Geral"]
["P9883","Chefe do setor administrativo","mês",1,null,7765.2767999999996,null,{"$f":"F21*D21","v":7765.2767999999996}]
["P9809","Encarregado administrativo","mês",0,null,null,null,{"$f":"F22*D22","v":0}]
["P9896","Porteiro","mês",0,null,0,null,{"$f":"F23*D23","v":0}]
["P9827","Vigia","mês",0,null,0,null,{"$f":"F24*D24","v":0}]
["P9948","Motorista","mês",0,null,0,null,{"$f":"F25*D25","v":0}]
[{"$nulls":5},"Subtotal do Item 1.3",null,{"$f":"SUM(H21:I25)","v":7765.2767999999996}]
[null,"Auxiliar"]
["P9806","Auxiliar administrativo","mês",1,null,4197.6863999999996,null,{"$f":"F28*D28","v":4197.6863999999996}]
["P9842","Faxineiro","mês",0,null,0,null,{"$f":"F29*D29","v":0}]
[{"$nulls":5},"Subtotal do Item 1.4",null,{"$f":"SUM(H28:I29)","v":4197.6863999999996}]
[{"$nulls":7},"Total da Mão de Obra da Parcela Fixa",{"$f":"H30+H26+H18+H14","v":53681.667249999999}]
[]
["parcela fixa da administração local \n(veículos)"]
["Código","Discriminação ","Unidade"," Quantidade ","Utilização Produtiva","Utilização Improdutiva","Custo Horário \nProdutivo (R$)","Custo Horário Improdutivo (R$)","Custo Total (R$)"]
[2,"Veículos"]
[null,"Gerência Técnica"]
["2.1","Geral"]
["E9093","Veículo Leve 53 kw","mês",1,44,176,35.639099999999999,6.1081000000000003,{"$f":"((E38*G38)+(F38*H38))*D38","v":2643.1459999999997}]
["E9134","Miniônibus com capacidade para 30 passageiros","mês",1,44,176,218.8767,69.430800000000005,{"$f":"((E39*G39)+(F39*H39))*D39","v":21850.395600000003}]
[{"$nulls":7},"Subtotal do Item 2",{"$f":"SUM(I38:I39)","v":24493.541600000004}]
["2.2","Auxiliar"]
["E9093","Veículo Leve 53 kw","mês",0,44,176,null,null,{"$f":"((E42*G42)+(F42*H42))*D42","v":0}]
[{"$nulls":7},"Subtotal do Item 2",{"$f":"SUM(I42)","v":0}]
["2.3","Gerência Administrativa"]
["E9093","Veículo Leve 53 kw","mês",0,44,176,null,null,{"$f":"((E45*G45)+(F45*H45))*D45","v":0}]
[{"$nulls":7},"Subtotal do Item 2",{"$f":"I45","v":0}]
[{"$nulls":7},"Total dos Veículos da Parcela Fixa",{"$f":"I46+I43+I40","v":24493.541600000004}]
[]
["Composição de custo da equipe de produção de terraplenagem"]
["Código","Discriminação ","Unidade"," Quantidade ",null,"Custo Unitário (R$)",null," Custo Total (R$)"]
[null,"Equipe de Produção de Terraplenagem"]
["3.1","Mão de Obra"]
["P9884","Encarregado de terraplenagem ","mês",0]
[{"$nulls":5},"Subtotal do Item 3.1",null,{"$f":"SUM(H53:H53)","v":0}]
["Código","Discriminação ","Unidade"," Quantidade ","Utilização Produtiva","Utilização Improdutiva","Custo Horário \nProdutivo (R$)","Custo Horário Improdutivo (R$)","Custo Total (R$)"]
["3.2","Veículos"]
["E9093","Veículo Leve 53 kw","mês",0,44,176,null,null,{"$f":"((E57*G57)+(F57*H57))*D57","v":0}]
[{"$nulls":7},"Subtotal do Item 3.2",{"$f":"SUM(I57:I57)","v":0}]
[{"$nulls":7},"Total da Equipe de Produção de Terraplenagem",{"$f":"I58+H54","v":0}]
[]
["Composição de custo da equipe de produção de pavimentação"]
["Código","Discriminação ","Unidade"," Quantidade ",null,"Custo Unitário (R$)",null," Custo Total (R$)"]
[null,"Equipe de Produção de Pavimentação"]
["3.1","Mão de Obra"]
["P9893","Encarregado de pavimentação ","mês",1,null,6737.8181999999997,null,{"$f":"F65*D65","v":6737.8181999999997}]
[{"$nulls":5},"Subtotal do Item 3.1",null,{"$f":"SUM(H65:H65)","v":6737.8181999999997}]
["Código","Discriminação ","Unidade"," Quantidade ","Utilização Produtiva","Utilização Improdutiva","Custo Horário \nProdutivo (R$)","Custo Horário Improdutivo (R$)","Custo Total (R$)"]
["3.2","Veículos"]
["E9093","Veículo Leve 53 kw","mês",1,44,176,{"$f":"G38","v":35.639099999999999},{"$f":"H38","v":6.1081000000000003},{"$f":"((E69*G69)+(F69*H69))*D69","v":2643.1459999999997}]
[{"$nulls":7},"Subtotal do Item 3.2",{"$f":"SUM(I69:I69)","v":2643.1459999999997}]
[{"$nulls":7},"Total da Equipe de Produção de Pavimentação",{"$f":"I70+H66","v":9380.9641999999985}]
[]
["Composição de custo da equipe de produção de drenagem"]
["Código","Discriminação ","Unidade"," Quantidade ",null,"Custo Unitário (R$)",null," Custo Total (R$)"]
[null,"Equipe de Produção de Drenagem"]
["3.1","Mão de Obra"]
["P9893","Encarregado de produção ","mês",0]
[{"$nulls":5},"Subtotal do Item 3.1",null,{"$f":"SUM(H77:H77)","v":0}]
["Código","Discriminação ","Unidade"," Quantidade ","Utilização Produtiva","Utilização Improdutiva","Custo Horário \nProdutivo (R$)","Custo Horário Improdutivo (R$)","Custo Total (R$)"]
["3.2","Veículos"]
["E9093","Veículo Leve 53 kw","mês",0,44,176,null,null,{"$f":"((E81*G81)+(F81*H81))*D81","v":0}]
[{"$nulls":7},"Subtotal do Item 3.2",{"$f":"SUM(I81:I81)","v":0}]
[{"$nulls":7},"Total da Equipe de Produção de Pavimentação",{"$f":"I82+H78","v":0}]
[]
["Composição de custo da equipe de produção de sinalização"]
["Código","Discriminação ","Unidade"," Quantidade ",null,"Custo Unitário (R$)",null," Custo Total (R$)"]
[null,"Equipe de Produção de Sinalização"]
["3.1","Mão de Obra"]
["P9893","Encarregado de produção ","mês",0]
[{"$nulls":5},"Subtotal do Item 3.1",null,{"$f":"SUM(H89:H89)","v":0}]
["Código","Discriminação ","Unidade"," Quantidade ","Utilização Produtiva","Utilização Improdutiva","Custo Horário \nProdutivo (R$)","Custo Horário Improdutivo (R$)","Custo Total (R$)"]
["3.2","Veículos"]
["E9093","Veículo Leve 53 kw","mês",0,44,176,null,null,{"$f":"((E93*G93)+(F93*H93))*D93","v":0}]
[{"$nulls":7},"Subtotal do Item 3.2",{"$f":"SUM(I93:I93)","v":0}]
[{"$nulls":7},"Total da Equipe de Produção de Pavimentação",{"$f":"I94+H90","v":0}]
[]
["Composição de custo da equipe topografia"]
["Código","Discriminação ","Unidade"," Quantidade ",null,"Custo Unitário (R$)",null," Custo Total (R$)"]
[null,"Equipe de Topografia"]
["3.1","Mão de Obra"]
["P9949","Topográfo","mês",1,null,8451.7703000000001,null,{"$f":"F101*D101","v":8451.7703000000001}]
["P9950","Auxiliar de topografia","mês",1,null,5505.1570000000002,null,{"$f":"F102*D102","v":5505.1570000000002}]
[{"$nulls":5},"Subtotal do Item 3.1",null,{"$f":"SUM(H101:I102)","v":13956.927299999999}]
["Código","Discriminação ","Unidade"," Quantidade ","Utilização Produtiva","Utilização Improdutiva","Custo Horário \nProdutivo (R$)","Custo Horário Improdutivo (R$)","Custo Total (R$)"]
["3.2","Veículos"]
["E9093","Veículo Leve 53 kw","mês",1,44,176,{"$f":"G38","v":35.639099999999999},{"$f":"H38","v":6.1081000000000003},{"$f":"((E106*G106)+(F106*H106))*D106","v":2643.1459999999997}]
[{"$nulls":7},"Subtotal do Item 3.2",{"$f":"SUM(I106:I106)","v":2643.1459999999997}]
[{"$nulls":7},"Total da Equipe de Produção de Topografia",{"$f":"I107+H103","v":16600.0733}]
[]
["Composição de custo do setor de medicina e segurança do trabalho"]
["Código","Discriminação ","Unidade"," Quantidade ",null,"Custo Unitário (R$)",null," Custo Total (R$)"]
[4,"Setor de Medicina e Segurança do Trabalho"]
["P9876","Técnico de segurança do trabalho","mês",1,null,7025.0758999999998,null,{"$f":"F113*D113","v":7025.0758999999998}]
["P9864","Engenheiro de segurança do trabalho","mês",0,null,null,null,{"$f":"F114*D114","v":0}]
["P9851","Médico do trabalho","mês",0,null,null,null,{"$f":"F115*D115","v":0}]
["P9951","Médico de câmara hiperbárica","mês",0,null,null,null,{"$f":"F116*D116","v":0}]
[{"$nulls":5},"Subtotal do Item 4",null,{"$f":"SUM(H113:I116)","v":7025.0758999999998}]
[]
["Parcela Variável - Composição de custo da equipe de frente de serviço"]
["Código","Discriminação ","Unidade"," Quantidade ",null,"Custo Unitário (R$)",null," Custo Total (R$)"]
[5,"Equipe de Frente de Serviço","equipexmês"]
["P9875","Encarregado de Turma","mês",1,null,5107.7035999999998,null,{"$f":"F122*D122","v":5107.7035999999998}]
["P9804","Apontador","mês",0.5,null,4419.6270000000004,null,{"$f":"F123*D123","v":2209.8135000000002}]
[{"$nulls":5},"Subtotal do Item 5",null,{"$f":"SUM(H122:I123)","v":7317.5171}]
[]
["Parcela Variável - Composição de custo da equipe de frente de serviço (Terraplenagem) - Somente Compactação "]
["Código","Discriminação ","Unidade"," Quantidade ",null,"Produção Horária \n(und/h)",null,"Efs"]
["5.1","Equipe de Frente de Serviço","equipexmês"]
[null,null,"mês",{"$nulls":4},{"$f":"(D129)/(F129*182.49)","v":{"$error":"#DIV/0!"}}]
[{"$nulls":5},"Total de Equipes para Terraplenagem",null,{"$f":"SUM(#REF!)","v":{"$error":"#REF!"}}]
[]
["Parcela Variável - Composição de custo da acompanhamento das frentes de serviço de pavimentação"]
["Código","Discriminação ","Unidade"," Quantidade ",null,"Produção Horária \n(und/h)",null,"Efs"]
["5.2","Equipe de Frente de Serviço","equipe x mês"]
["92404 ADAPTADA","Execução de pavimento em piso intertravado, com bloco 16 faces de 22 x 11 cm, espessura 8 cm. af_10/2022 - exclusive fornecimento de bloquete",{"$f":"'RESUMO MODULO TOTAL'!I24","v":"m²"},{"$f":"'RESUMO MODULO TOTAL'!J24","v":120000},null,{"$f":"(1/0.2129)*5","v":23.485204321277596},null,{"$f":"(D135)/(F135*182.49)","v":27.999342429722173}]
[4011233,"Sub-base estabilizada granulometricamente com mistura solo brita (70% - 30%) na pista com material de jazida e brita comercial",{"$f":"'RESUMO MODULO TOTAL'!I28","v":"m³"},{"$f":"'RESUMO MODULO TOTAL'!J28","v":18000},null,150.88,null,0.65373503230061214]
[4011209,"Regularização do subleito",{"$f":"'RESUMO MODULO TOTAL'!I29","v":"m²"},{"$f":"'RESUMO MODULO TOTAL'!J29","v":120000},null,1121.33,null,0.58641994579957946]
[{"$nulls":5},"Total de Equipes para Pavimentação",null,{"$f":"SUM(H135:I137)","v":29.239497407822366}]
[]
["Parcela Variável - Composição de custo da acompanhamento das frentes de serviço de drenagem"]
["Código","Discriminação ","Unidade"," Quantidade ",null,"Efsdu",null,"Efs"]
["5.3","Frentes de Serviço para Drenagem","equipe x mês"]
[2003373,"Meio-fio de concreto - MFC 03 - areia e brita comerciais - fôrma de madeira","m",{"$f":"'RESUMO MODULO TOTAL'!J36","v":48000},null,2.1000000000000001E-4,null,{"$f":"D143*F143","v":10.08}]
[{"$nulls":5},"Total de Equipes para Drenagem",null,{"$f":"H143","v":10.08}]
[]
["Parcela Variável - Composição de custo da acompanhamento das frentes de serviço de sinalização"]
["Código","Discriminação ","Unidade"," Quantidade ",null,"Produção Horária (und/h)",null,"Efs"]
["5.4","Frentes de Serviço para Sinalização","equipe x mês"]
[5213440,"Placa de regulamentação em aço D = 0,60 m - película retrorrefletiva tipo I + SI - fornecimento e implantação",{"$f":"'RESUMO MODULO TOTAL'!I31","v":"und"},{"$f":"'RESUMO MODULO TOTAL'!J31","v":72},null,3,null,{"$f":"0.2*((D149)/(F149*182.49))","v":2.6302811112937696E-2}]
[5213464,"Placa de advertência em aço, lado de 0,60 m - película retrorrefletiva tipo I + SI - fornecimento e implantação",{"$f":"'RESUMO MODULO TOTAL'!I32","v":"und"},{"$f":"'RESUMO MODULO TOTAL'!J32","v":72},null,3,null,{"$f":"0.2*((D150)/(F150*182.49))","v":2.6302811112937696E-2}]
[5213400,"Pintura de faixa com tinta acrílica - espessura de 0,4 mm",{"$f":"'RESUMO MODULO TOTAL'!I34","v":"m²"},{"$f":"'RESUMO MODULO TOTAL'!J34","v":4800},null,177.07,null,{"$f":"0.2*((D151)/(F151*182.49))","v":2.9708941224304172E-2}]
[{"$nulls":5},"Total de Equipes para Sinalização",null,{"$f":"SUM(H149:I151)","v":8.2314563450179568E-2}]
[]
["3. PARCELA VARIÁVEL - EQUIPE DE CONTROLE TECNOLÓGICO"]
["LABORATÓRIO DE SOLOS"]
["Item","Discriminação",null,null,null,"Unidade","Quantidade","Custo Unitário (R$)","Custo Total (R$)"]
[null,"Laboratório de Solos (equipe x mês)"]
[null,"Mão de Obra"]
["P9858","Laboratorista",null,null,null,"func./mês",1,5576.2888000000003,{"$f":"TRUNC(G159*H159,2)","v":5576.28}]
["P9833","Auxiliar de laboratório",null,null,null,"func./mês",1,4221.2467999999999,{"$f":"TRUNC(G160*H160,2)","v":4221.24}]
[{"$nulls":7},"Subtotal do Item",{"$f":"SUM(I159:I160)","v":9797.52}]
["Item","Discriminação","Und","Quant","Utilização Produtiva","Utilização Improdutiva","Horário Produtivo (R$)","Horário Improdutivo (R$)","Total (R$)"]
[null,"Equipe de Controle Tecnológico"]
[null,"Veículos"]
["E9125","Van furgão a diesel - 93 kW","veic./mês",0.5,44,176,82.732100000000003,47.067100000000003,{"$f":"D165*((E165*G165)+(F165*H165))","v":5962.0110000000004}]
[{"$nulls":7},"Subtotal do Item",{"$f":"SUM(I165:I165)","v":5962.0110000000004}]
[{"$nulls":7},"Total da Equipe do Laboratório de Solos",{"$f":"I161+I166","v":15759.531000000001}]
[]
["3. PARCELA VARIÁVEL - EQUIPE DE CONTROLE TECNOLÓGICO"]
["LABORATÓRIO DE CONCRETO"]
["Item","Discriminação",null,null,null,"Unidade","Quantidade","Custo Unitário (R$)","Custo Total (R$)"]
[null,"Laboratório de Solos (equipe x mês)"]
[null,"Mão de Obra"]
["P9858","Laboratorista",null,null,null,"func./mês",1,7143.1040999999996,{"$f":"TRUNC(G174*H174,2)","v":7143.1}]
["P9833","Auxiliar de laboratório",null,null,null,"func./mês",1,5472.4476999999997,{"$f":"TRUNC(G175*H175,2)","v":5472.44}]
[{"$nulls":7},"Subtotal do Item",{"$f":"SUM(I174:I175)","v":12615.54}]
["Item","Discriminação","Und","Quant","Utilização Produtiva","Utilização Improdutiva","Horário Produtivo (R$)","Horário Improdutivo (R$)","Total (R$)"]
[null,"Equipe de Controle Tecnológico"]
[null,"Veículos"]
["E9125","Van furgão a diesel - 93 kW","veic./mês",0.5,44,176,82.732100000000003,47.067100000000003,{"$f":"D180*((E180*G180)+(F180*H180))","v":5962.0110000000004}]
[{"$nulls":7},"Subtotal do Item",{"$f":"SUM(I180:I180)","v":5962.0110000000004}]
[{"$nulls":7},"Total da Equipe do Laboratório de Concreto",{"$f":"I176+I181","v":18577.550999999999}]
[]
["Equipes de laboratório de solos para pavimentação"]
["Item","Discriminação",null,null,null,"Und","Quant","QE","Els"]
[{"$f":"'RESUMO MODULO TOTAL'!D28","v":4011233},"Sub-base estabilizada granulometricamente com mistura solo brita (70% - 30%) na pista com material de jazida e brita comercial",null,null,null,"m³",{"$f":"'RESUMO MODULO TOTAL'!J28","v":18000},21900,{"$f":"G186/H186","v":0.82191780821917804}]
[{"$nulls":7},"Total de equipes de Laboratório de Solos para Pavimentação",{"$f":"I186","v":0.82191780821917804}]
[]
["Equipes de laboratório de Concreto"]
["Item","Discriminação",null,null,null,"Und","Quant","QE","Ela"]
[{"$f":"'RESUMO MODULO TOTAL'!D23","v":36170},"BLOQUETE/PISO INTERTRAVADO DE CONCRETO - MODELO ONDA/16 FACES/RETANGULAR/T IJOLINHO/PAVER/HOLANDES/PARALELEPIPEDO, *22 CM X 11* CM, E = 8 CM, RESISTENCIA DE 35 MPA (NBR 9781), COR NATURAL",null,null,null,"m³",{"$f":"'RESUMO MODULO TOTAL'!J23*0.08","v":9638.4},1700,{"$f":"G191/H191","v":5.6696470588235295}]
[{"$nulls":7},"Total de equipes de Laboratório de Concreto",{"$f":"SUM(I191:I191)","v":5.6696470588235295}]
[]
["manutenção do canteiro de obras e acampamentos"]
["Código","Discriminação ","Unidade"," Quantidade ",null,"Custo Unitário (R$)",null," Custo Total (R$)"]
[null,"Manutenção do Canteiro de Obras e Acampamentos"]
["6.1","Mão de Obra"]
["P9952","Pedreiro","mês",0,null,null,null,{"$f":"F198*D198","v":0}]
["P9954","Servente","mês",0,null,null,null,{"$f":"F199*D199","v":0}]
["P9953","Eletricista","mês",0,null,null,null,{"$f":"F200*D200","v":0}]
[{"$nulls":5},"Subtotal do Item 6.1",null,{"$f":"SUM(H198:I200)","v":0}]
[]
["Código","Discriminação ","Unidade"," Quantidade ",null,"Custo Produtivo (R$)",null," Custo Total (R$)"]
["6.2","Equipamentos"]
[null,"Caminhão guindauto de 6 toneladas","h/mês",0,null,null,null,{"$f":"F205*D205","v":0}]
[null,"Caminhão tanque de 8.000 litros","h/mês",0,null,null,null,{"$f":"F206*D206","v":0}]
["E9524","Motoniveladora","h/mês",0,null,null,null,{"$f":"F207*D207","v":0}]
[{"$nulls":5},"Subtotal do Item 6.2",null,{"$f":"SUM(H205:I207)","v":0}]
[{"$nulls":6},"Total da Manutenção do Canteiro de Obras e Acampamentos",{"$f":"H208+H201","v":0}]
[]
[]
[]
["Resumo das parcelas de administração local"]
["Código","Discriminação ","Unidade"," Quantidade ",null,"Custo Unitário (R$)",null," Custo Total (R$)"]
[null,"Parcela Fixa"]
[null,"Mão de Obra","mês",7,null,{"$f":"H14+H18+H26+H30","v":53681.667249999999},null,{"$f":"F216*D216","v":375771.67074999999}]
[null,"Veículos","mês",7,null,{"$f":"I47","v":24493.541600000004},null,{"$f":"F217*D217","v":171454.79120000004}]
[{"$nulls":5},"Subtotal do Item 1",null,{"$f":"SUM(H216:I217)","v":547226.46195000003}]
[null,"Parcela Vinculada"]
[null,"Equipe de produção de terraplenagem","mês",2,null,{"$f":"I59","v":0},null,{"$f":"F220*D220","v":0}]
[null,"Equipe de produção de pavimentação","mês",6,null,{"$f":"I71","v":9380.9641999999985},null,56285.785199999991]
[null,"Equipe de produção de drenagem","mês",null,null,{"$f":"I83","v":0},null,0]
[null,"Equipe de produção de sinalização","mês",null,null,{"$f":"I95","v":0},null,0]
[null,"Equipe de topografia","mês",7,null,{"$f":"I108","v":16600.0733},null,116200.5131]
[null,"Equipe de medicina e segurança do trabalho","mês",7,null,{"$f":"H117","v":7025.0758999999998},null,49175.531300000002]
[null,"Técnicos especializados","mês",{"$nulls":4},0]
[{"$nulls":5},"Subtotal do Item 2",null,{"$f":"SUM(H220:I226)","v":221661.8296}]
[null,"Parcela Variável"]
[null,"Acompanhamento da Terraplenagem","equipe x mês","-",null,{"$f":"$H$124","v":7317.5171},null,"-"]
[null,"Acompanhamento da Pavimentação","equipe x mês",{"$f":"H138","v":29.239497407822366},null,{"$f":"$H$124","v":7317.5171},null,{"$f":"F230*D230","v":213960.52227714585}]
[null,"Acompanhamento da Drenagem","equipe x mês",{"$f":"H144","v":10.08},null,7317.5171,null,{"$f":"F231*D231","v":73760.572367999994}]
[null,"Acompanhamento da Sinalização","equipe x mês",{"$f":"H152","v":8.2314563450179568E-2},null,7317.5171,null,{"$f":"F232*D232","v":602.33822562572402}]
[null,"Laboratório de Solos","equipe x mês",{"$f":"I187","v":0.82191780821917804},null,{"$f":"I167","v":15759.531000000001},null,{"$f":"F233*D233","v":12953.039178082192}]
[null,"Laboratório de concreto","equipe x mês",{"$f":"I192","v":5.6696470588235295},null,{"$f":"I182","v":18577.550999999999},null,{"$f":"F234*D234","v":105328.15738729412}]
[{"$nulls":5},"Subtotal do Item 3",null,{"$f":"SUM(H229:I234)","v":406604.62943614786}]
[null,"Manutenção dos Canteiros de Obras e Acampamentos"]
[null,"Equipe de manutenção","mês",0,null,{"$f":"H209","v":0},null,{"$f":"F237*D237","v":0}]
[{"$nulls":5},"Subtotal do Item 4",null,{"$f":"SUM(H237:I237)","v":0}]
[{"$nulls":6},"Subtotal",{"$f":"H238+H235+H227+H218","v":1175492.9209861481}]
[null,"Despesas Diversas","%",0.05,null,"-",null,{"$f":"D240*H239","v":58774.646049307405}]
[{"$nulls":5},"TOTAL",null,{"$f":"TRUNC(H239+H240,2)","v":1234267.56}]
[{"$nulls":5},"BDI",null,null,{"$f":"TRUNC(H241*BDI!D14,2)","v":284868.95}]
[{"$nulls":5},"TOTAL COM BDI",null,null,{"$f":"I242+H241","v":1519136.51}]

{"sheet":"Projeto Executivo","index":10,"n_rows":30,"n_cols":7,"rows_kept":30,"cut":false,"hidden":false,"merged":[[26,0,26,1],[3,0,3,6],[5,0,5,1],[16,0,16,1],[20,0,20,1],[24,0,24,1],[25,0,25,2]]}
[]
[]
[]
["COMPOSIÇAO DE PREÇO - PROJETO EXECUTIVO"]
[]
["DISCRIMINAÇÃO",{"$nulls":4},"Pr. Unit.","Pr. Total"]
[]
["A· EOUIPE TECNICA",{"$nulls":5},{"$f":"G9+G12","v":16742.838749999999}]
[null,"A. 1 - Pessoal de Nível Superior","Unidade","Quantitativo","SICRO e Rel.Custos Gerais",null,{"$f":"G10+G11","v":13881.4125}]
[null,"Engenheiro","mês",0.5,"P9812",23542.54,{"$f":"F10*D10","v":11771.27}]
[null,"Topógrafo","mês",0.25,"P9949",8440.57,{"$f":"F11*D11","v":2110.1424999999999}]
[null,"A.2 - Pessoal de Nível Técnico e Aux.",{"$nulls":4},{"$f":"G13+G14","v":2861.42625}]
[null,"Auxiliar de topógrafo","mês",0.125,"P9950",5502.25,{"$f":"F13*D13","v":687.78125}]
[null,"Auxiliar Técnico/Assistente de Engenharia ","mês",0.5,"P9903",4347.29,{"$f":"F14*D14","v":2173.645}]
["B - ENCARGOS SOCIAIS",{"$nulls":5},{"$f":"G16","v":0}]
[null,{"$f":"CONCATENATE(\"Taxas \",'ENC. SOCIAIS'!E48,\"%\")","v":"Taxas 112,54%"},"JÁ INCLUSAS EM \"A\""]
["C - DESPESAS GERAIS",{"$nulls":5},{"$f":"G18+G20+G19","v":13549.9351625}]
[null,"C.1 - MATERIAIS DE CONSUMO","Estimativa % como referência de equipe técnica com encargos sociais ",0.03,null,{"$f":"G8","v":16742.838749999999},{"$f":"F18*D18","v":502.28516249999996}]
[null,"C.2 - VEÍCULOS (Veículo leve picape 4 x 4 com capacidade de 1,10 t - 147 kW)","h",110,"E9684",116.08,{"$f":"F19*D19","v":12768.8}]
[null,"C.3 - Estação total eletrônica com alcance máximo de 3.000 m","h",55,"E9553",5.07,{"$f":"F20*D20","v":278.85000000000002}]
["D - ENSAIOS",{"$nulls":5},{"$f":"SUM(G22:G24)","v":2978.4212499999999}]
[null,"Laboratorista","mês",{"$f":"1/4","v":0.25},"P9858",7140.9,{"$f":"F22*D22","v":1785.2249999999999}]
[null,"Auxiliar de Laboratório","mês",{"$f":"1/8","v":0.125},"P9833",5472.32,{"$f":"F23*D23","v":684.04}]
[null,"Laboratório de solos","mês",{"$f":"1/8","v":0.125},"B8957",4073.25,{"$f":"F24*D24","v":509.15625}]
["I - SOMA (A+B+C+D)",{"$nulls":5},{"$f":"G8+G15+G17+G21","v":33271.1951625}]
["BDI = ",null,null,{"$f":"BDI!D14","v":0.23080000000000001},null,null,{"$f":"D26*G25","v":7678.9918435050004}]
[" TOTAL",{"$nulls":5},{"$f":"G25+G26","v":40950.187006004999}]
[{"$nulls":5},"Produtividade da equipe (m²)",14000]
[{"$nulls":5},"Custo por m² (sem BDI):",{"$f":"TRUNC(G25/$G$28,2)","v":2.37}]
[{"$nulls":5},"Preço por m² (com BDI):",{"$f":"TRUNC(G27/$G$28,2)","v":2.92}]

{"sheet":"CPUs","index":11,"n_rows":1230,"n_cols":10,"rows_kept":1230,"cut":false,"hidden":false,"merged":[[1210,0,1210,4],[1210,5,1210,8],[1211,0,1211,4],[1211,5,1211,8],[1212,0,1212,4],[1212,5,1212,8],[1207,0,1208,0],[1207,1,1208,1],[1207,2,1208,2],[1207,3,1208,3],[1207,4,1208,4],[1207,5,1207,6],[1207,7,1207,8],[1231,7,1231,8],[1227,0,1227,4],[1227,5,1227,8],[1228,0,1228,4],[1228,5,1228,8],[1229,0,1229,4],[1229,5,1229,8],[1224,0,1224,4],[1224,5,1224,8],[1225,0,1225,4],[1225,5,1225,8],[1226,0,1226,4],[1226,5,1226,8],[1221,3,1222,3],[1221,4,1222,4],[1221,5,1221,6],[1221,7,1221,8],[1183,0,1183,4],[1183,5,1183,8],[1184,0,1184,4],[1200,5,1200,8],[1201,0,1201,4],[1201,5,1201,8],[1203,7,1203,8],[1205,4,1205,5],[1206,4,1206,5],[1221,9,1222,9],[1196,0,1196,4],[1196,5,1196,8],[1197,0,1197,4],[1197,5,1197,8],[1198,0,1198,4],[1198,5,1198,8],[1199,0,1199,4],[1199,5,1199,8],[1200,0,1200,4],[1217,7,1217,8],[1219,4,1219,5],[1220,4,1220,5],[1221,0,1222,0],[1221,1,1222,1],[1221,2,1222,2],[1213,0,1213,4],[1213,5,1213,8],[1214,0,1214,4],[1214,5,1214,8],[1215,0,1215,4],[1215,5,1215,8],[1207,9,1208,9],[1177,4,1177,5],[1178,4,1178,5],[1193,9,1194,9],[1168,0,1168,4],[1168,5,1168,8],[1169,0,1169,4],[1169,5,1169,8],[1170,0,1170,4],[1170,5,1170,8],[1171,0,1171,4],[1171,5,1171,8],[1172,0,1172,4],[1189,7,1189,8],[1191,4,1191,5],[1192,4,1192,5],[1193,0,1194,0],[1193,1,1194,1],[1193,2,1194,2],[1193,3,1194,3],[1193,4,1194,4],[1193,5,1193,6],[1193,7,1193,8],[1184,5,1184,8],[1185,0,1185,4],[1185,5,1185,8],[1186,0,1186,4],[1186,5,1186,8],[1187,0,1187,4],[1187,5,1187,8],[1179,9,1180,9],[1182,0,1182,4],[1182,5,1182,8],[1165,0,1166,0],[1165,1,1166,1],[1165,2,1166,2],[1165,3,1166,3],[1165,4,1166,4],[1165,5,1165,6],[1158,0,1158,4],[1158,5,1158,8],[1159,0,1159,4],[1159,5,1159,8],[1161,7,1161,8],[1163,4,1163,5],[1179,7,1179,8],[1151,9,1152,9],[1154,0,1154,4],[1154,5,1154,8],[1155,0,1155,4],[1155,5,1155,8],[1156,0,1156,4],[1156,5,1156,8],[1157,0,1157,4],[1157,5,1157,8],[1179,0,1180,0],[1179,1,1180,1],[1179,2,1180,2],[1179,3,1180,3],[1179,4,1180,4],[1179,5,1179,6],[1172,5,1172,8],[1173,0,1173,4],[1173,5,1173,8],[1175,7,1175,8],[1143,4,1143,5],[1144,4,1144,5],[1145,4,1145,5],[1147,7,1147,8],[1149,4,1149,5],[1150,4,1150,5],[1165,7,1165,8],[1165,9,1166,9],[1134,7,1134,8],[1136,4,1136,5],[1137,4,1137,5],[1138,4,1138,5],[1139,4,1139,5],[1140,4,1140,5],[1141,4,1141,5],[1142,4,1142,5],[1164,4,1164,5],[1132,0,1132,4],[1132,5,1132,8],[1104,0,1104,4],[1104,5,1104,8],[1105,5,1105,8],[1110,0,1110,4],[1110,5,1110,8],[1111,0,1111,4],[1111,5,1111,8],[1112,0,1112,4],[1124,7,1124,8],[1125,7,1125,8],[1126,7,1126,8],[1127,0,1127,4],[1127,5,1127,8],[1128,6,1128,8],[1151,7,1151,8],[1117,6,1117,8],[1118,6,1118,8],[1119,6,1119,8],[1120,0,1120,4],[1120,5,1120,8],[1121,6,1121,8],[1122,6,1122,8],[1123,0,1123,4],[1123,5,1123,8],[1151,0,1152,0],[1151,1,1152,1],[1151,2,1152,2],[1151,3,1152,3],[1151,4,1152,4],[1151,5,1151,6],[1116,0,1116,4],[1116,5,1116,8],[1087,7,1087,8],[1088,0,1088,4],[1088,5,1088,8],[1089,6,1089,8],[1092,0,1092,4],[1092,5,1092,8],[1094,7,1094,8],[1096,4,1096,5],[1112,5,1112,8],[1113,0,1113,4],[1113,5,1113,8],[1114,0,1114,4],[1114,5,1114,8],[1115,0,1115,4],[1115,5,1115,8],[1086,7,1086,8],[1062,4,1062,5],[1064,7,1064,8],[1066,4,1066,5],[1067,4,1067,5],[1068,0,1069,0],[1068,1,1069,1],[1068,2,1069,2],[1081,0,1081,4],[1081,5,1081,8],[1082,0,1082,4],[1082,5,1082,8],[1083,6,1083,8],[1084,6,1084,8],[1098,7,1098,8],[1098,9,1099,9],[1077,0,1077,4],[1077,5,1077,8],[1078,0,1078,4],[1078,5,1078,8],[1079,0,1079,4],[1079,5,1079,8],[1080,0,1080,4],[1080,5,1080,8],[1097,4,1097,5],[1098,0,1099,0],[1098,1,1099,1],[1098,2,1099,2],[1098,3,1099,3],[1098,4,1099,4],[1098,5,1098,6],[1076,0,1076,4],[1068,3,1069,3],[1068,4,1069,4],[1068,5,1068,6],[1068,7,1068,8],[1068,9,1069,9],[1072,0,1072,4],[1072,5,1072,8],[1085,0,1085,4],[1085,5,1085,8],[1056,4,1056,5],[1058,7,1058,8],[1060,4,1060,5],[1061,4,1061,5],[1048,4,1048,5],[1049,4,1049,5],[1050,4,1050,5],[1052,7,1052,8],[1054,4,1054,5],[1055,4,1055,5],[1073,5,1073,8],[1031,7,1031,8],[1033,4,1033,5],[1034,4,1034,5],[1035,4,1035,5],[1036,4,1036,5],[1022,4,1022,5],[1024,7,1024,8],[1026,4,1026,5],[1027,4,1027,5],[1028,4,1028,5],[1029,4,1029,5],[1076,5,1076,8],[1037,4,1037,5],[1038,4,1038,5],[1040,7,1040,8],[1042,4,1042,5],[1043,4,1043,5],[1044,4,1044,5],[1046,7,1046,8],[989,9,990,9],[993,0,993,4],[993,5,993,8],[994,5,994,8],[997,0,997,4],[997,5,997,8],[1014,4,1014,5],[1015,4,1015,5],[1017,7,1017,8],[1019,4,1019,5],[1020,4,1020,5],[1021,4,1021,5],[989,3,990,3],[989,4,990,4],[989,5,989,6],[1008,4,1008,5],[1009,4,1009,5],[1010,4,1010,5],[999,0,999,4],[999,5,999,8],[1000,0,1000,4],[1000,5,1000,8],[1001,0,1001,4],[1011,4,1011,5],[1012,4,1012,5],[1013,4,1013,5],[1001,5,1001,8],[1002,0,1002,4],[1002,5,1002,8],[1004,7,1004,8],[1006,4,1006,5],[1007,4,1007,5],[983,0,983,4],[983,5,983,8],[985,7,985,8],[956,0,956,4],[956,5,956,8],[958,7,958,8],[960,4,960,5],[961,4,961,5],[962,5,962,8],[965,0,965,4],[980,0,980,4],[980,5,980,8],[981,0,981,4],[981,5,981,8],[982,0,982,4],[982,5,982,8],[998,0,998,4],[998,5,998,8],[972,7,972,8],[974,4,974,5],[975,4,975,5],[976,5,976,8],[978,0,978,4],[978,5,978,8],[979,0,979,4],[979,5,979,8],[989,7,989,8],[969,0,969,4],[969,5,969,8],[970,0,970,4],[970,5,970,8],[987,4,987,5],[942,6,942,8],[943,0,943,4],[943,5,943,8],[945,7,945,8],[947,4,947,5],[948,4,948,5],[965,5,965,8],[966,0,966,4],[966,5,966,8],[967,0,967,4],[967,5,967,8],[968,0,968,4],[968,5,968,8],[954,0,954,4],[954,5,954,8],[955,0,955,4],[955,5,955,8],[988,4,988,5],[989,0,990,0],[989,1,990,1],[989,2,990,2],[934,0,934,4],[949,5,949,8],[951,0,951,4],[951,5,951,8],[952,0,952,4],[952,5,952,8],[953,0,953,4],[953,5,953,8],[894,9,895,9],[898,0,898,4],[898,5,898,8],[899,5,899,8],[902,0,902,4],[914,0,914,4],[914,5,914,8],[915,7,915,8],[916,7,916,8],[917,7,917,8],[918,7,918,8],[938,6,938,8],[939,6,939,8],[940,6,940,8],[941,6,941,8],[909,6,909,8],[910,6,910,8],[911,6,911,8],[912,6,912,8],[913,6,913,8],[919,7,919,8],[934,5,934,8],[935,0,935,4],[935,5,935,8],[936,0,936,4],[936,5,936,8],[937,0,937,4],[937,5,937,8],[906,0,906,4],[906,5,906,8],[907,0,907,4],[907,5,907,8],[908,0,908,4],[908,5,908,8],[902,5,902,8],[903,0,903,4],[903,5,903,8],[904,0,904,4],[904,5,904,8],[905,0,905,4],[905,5,905,8],[920,0,920,4],[920,5,920,8],[921,6,921,8],[927,0,927,4],[927,5,927,8],[929,7,929,8],[931,4,931,5],[932,4,932,5],[933,0,933,4],[933,5,933,8],[890,7,890,8],[892,4,892,5],[893,4,893,5],[894,0,895,0],[894,1,895,1],[894,2,895,2],[894,3,895,3],[894,4,895,4],[894,5,894,6],[894,7,894,8],[886,0,886,4],[886,5,886,8],[887,0,887,4],[887,5,887,8],[888,0,888,4],[888,5,888,8],[880,5,880,8],[883,0,883,4],[883,5,883,8],[884,0,884,4],[884,5,884,8],[885,0,885,4],[885,5,885,8],[850,4,850,5],[851,4,851,5],[852,5,852,8],[855,0,855,4],[855,5,855,8],[871,0,871,4],[871,5,871,8],[872,0,872,4],[872,5,872,8],[873,0,873,4],[873,5,873,8],[865,4,865,5],[866,5,866,8],[869,0,869,4],[869,5,869,8],[870,0,870,4],[870,5,870,8],[859,0,859,4],[859,5,859,8],[860,0,860,4],[860,5,860,8],[862,7,862,8],[864,4,864,5],[856,0,856,4],[856,5,856,8],[857,0,857,4],[857,5,857,8],[858,0,858,4],[858,5,858,8],[874,0,874,4],[874,5,874,8],[876,7,876,8],[878,4,878,5],[879,4,879,5],[824,5,824,8],[826,0,826,4],[826,5,826,8],[827,0,827,4],[827,5,827,8],[842,0,842,4],[842,5,842,8],[843,0,843,4],[843,5,843,8],[844,0,844,4],[844,5,844,8],[837,4,837,5],[838,5,838,8],[840,0,840,4],[840,5,840,8],[841,0,841,4],[841,5,841,8],[831,0,831,4],[831,5,831,8],[832,0,832,4],[832,5,832,8],[834,7,834,8],[836,4,836,5],[828,0,828,4],[828,5,828,8],[829,0,829,4],[829,5,829,8],[830,0,830,4],[830,5,830,8],[845,0,845,4],[845,5,845,8],[846,0,846,4],[846,5,846,8],[848,7,848,8],[823,4,823,5],[797,6,797,8],[800,0,800,4],[800,5,800,8],[802,7,802,8],[804,4,804,5],[815,0,815,4],[815,5,815,8],[816,0,816,4],[816,5,816,8],[817,0,817,4],[817,5,817,8],[812,0,812,4],[812,5,812,8],[813,0,813,4],[813,5,813,8],[814,0,814,4],[814,5,814,8],[810,5,810,8],[806,5,806,6],[818,0,818,4],[818,5,818,8],[820,7,820,8],[822,4,822,5],[792,6,792,8],[793,0,793,4],[793,5,793,8],[794,7,794,8],[795,7,795,8],[796,0,796,4],[796,5,796,8],[788,5,788,8],[789,0,789,4],[789,5,789,8],[790,0,790,4],[790,5,790,8],[791,6,791,8],[806,7,806,8],[806,9,807,9],[809,0,809,4],[809,5,809,8],[781,4,781,5],[782,5,782,8],[784,0,784,4],[784,5,784,8],[785,0,785,4],[785,5,785,8],[774,6,774,8],[775,6,775,8],[776,0,776,4],[776,5,776,8],[778,7,778,8],[780,4,780,5],[770,0,770,4],[770,5,770,8],[771,0,771,4],[771,5,771,8],[772,6,772,8],[773,6,773,8],[786,0,786,4],[786,5,786,8],[787,0,787,4],[787,5,787,8],[788,0,788,4],[805,4,805,5],[806,0,807,0],[806,1,807,1],[806,2,807,2],[806,3,807,3],[806,4,807,4],[769,0,769,4],[769,5,769,8],[747,4,747,5],[748,4,748,5],[749,0,750,0],[749,1,750,1],[749,2,750,2],[749,3,750,3],[761,0,761,4],[761,5,761,8],[763,7,763,8],[765,4,765,5],[766,4,766,5],[767,0,767,4],[767,5,767,8],[758,0,758,4],[758,5,758,8],[759,0,759,4],[759,5,759,8],[760,0,760,4],[760,5,760,8],[753,5,753,8],[756,0,756,4],[756,5,756,8],[757,0,757,4],[757,5,757,8],[732,9,733,9],[735,0,735,4],[735,5,735,8],[736,5,736,8],[738,0,738,4],[749,4,750,4],[749,5,749,6],[749,7,749,8],[749,9,750,9],[752,0,752,4],[752,5,752,8],[768,0,768,4],[768,5,768,8],[742,0,742,4],[742,5,742,8],[743,0,743,4],[743,5,743,8],[745,7,745,8],[722,0,722,4],[722,5,722,8],[723,0,723,4],[723,5,723,8],[724,0,724,4],[738,5,738,8],[739,0,739,4],[739,5,739,8],[740,0,740,4],[740,5,740,8],[741,0,741,4],[741,5,741,8],[732,7,732,8],[707,0,707,4],[707,5,707,8],[708,0,708,4],[708,5,708,8],[709,0,709,4],[709,5,709,8],[710,0,710,4],[710,5,710,8],[711,6,711,8],[730,4,730,5],[731,4,731,5],[732,0,733,0],[732,1,733,1],[732,2,733,2],[732,3,733,3],[732,4,733,4],[732,5,732,6],[724,5,724,8],[725,0,725,4],[725,5,725,8],[726,0,726,4],[726,5,726,8],[728,7,728,8],[666,6,666,8],[667,6,667,8],[668,6,668,8],[669,6,669,8],[670,6,670,8],[695,4,695,5],[696,4,696,5],[697,4,697,5],[698,4,698,5],[699,4,699,5],[700,4,700,5],[719,5,719,8],[721,0,721,4],[721,5,721,8],[687,0,687,4],[687,5,687,8],[689,7,689,8],[691,4,691,5],[692,4,692,5],[693,4,693,5],[694,4,694,5],[712,6,712,8],[713,0,713,4],[713,5,713,8],[715,7,715,8],[717,4,717,5],[718,4,718,5],[676,7,676,8],[677,7,677,8],[678,7,678,8],[679,0,679,4],[679,5,679,8],[680,6,680,8],[671,6,671,8],[672,0,672,4],[672,5,672,8],[673,7,673,8],[674,7,674,8],[675,7,675,8],[702,7,702,8],[704,4,704,5],[705,4,705,5],[706,0,706,4],[706,5,706,8],[663,0,663,4],[663,5,663,8],[664,0,664,4],[664,5,664,8],[665,0,665,4],[665,5,665,8],[660,0,660,4],[660,5,660,8],[661,0,661,4],[661,5,661,8],[662,0,662,4],[662,5,662,8],[649,9,650,9],[655,0,655,4],[655,5,655,8],[656,5,656,8],[659,0,659,4],[659,5,659,8],[649,7,649,8],[648,4,648,5],[649,0,650,0],[649,1,650,1],[649,2,650,2],[649,3,650,3],[649,4,650,4],[649,5,649,6],[642,0,642,4],[642,5,642,8],[643,0,643,4],[643,5,643,8],[645,7,645,8],[647,4,647,5],[639,0,639,4],[639,5,639,8],[640,0,640,4],[640,5,640,8],[641,0,641,4],[641,5,641,8],[624,5,624,8],[638,0,638,4],[638,5,638,8],[616,0,616,4],[616,5,616,8],[617,5,617,8],[619,0,619,4],[619,5,619,8],[620,0,620,4],[620,5,620,8],[621,0,621,4],[631,9,632,9],[634,0,634,4],[634,5,634,8],[635,5,635,8],[637,0,637,4],[637,5,637,8],[627,7,627,8],[629,4,629,5],[630,4,630,5],[631,0,632,0],[631,1,632,1],[631,2,632,2],[631,3,632,3],[631,4,632,4],[631,5,631,6],[631,7,631,8],[613,9,614,9],[613,0,614,0],[613,1,614,1],[613,2,614,2],[613,3,614,3],[613,4,614,4],[613,5,613,6],[625,0,625,4],[625,5,625,8],[601,4,601,5],[603,7,603,8],[605,4,605,5],[606,4,606,5],[607,4,607,5],[609,7,609,8],[611,4,611,5],[621,5,621,8],[622,0,622,4],[622,5,622,8],[623,0,623,4],[623,5,623,8],[624,0,624,4],[597,7,597,8],[599,4,599,5],[550,4,550,5],[551,4,551,5],[553,7,553,8],[555,4,555,5],[556,4,556,5],[557,4,557,5],[558,4,558,5],[587,4,587,5],[588,4,588,5],[589,4,589,5],[591,7,591,8],[593,4,593,5],[594,4,594,5],[613,7,613,8],[560,7,560,8],[562,4,562,5],[575,4,575,5],[576,4,576,5],[577,4,577,5],[579,7,579,8],[581,4,581,5],[582,4,582,5],[583,4,583,5],[585,7,585,8],[612,4,612,5],[595,4,595,5],[515,4,515,5],[516,4,516,5],[517,4,517,5],[518,4,518,5],[519,4,519,5],[535,5,535,8],[537,7,537,8],[539,4,539,5],[540,4,540,5],[541,4,541,5],[542,4,542,5],[569,4,569,5],[570,4,570,5],[571,4,571,5],[573,7,573,8],[531,0,531,4],[531,5,531,8],[532,6,532,8],[533,6,533,8],[534,6,534,8],[535,0,535,4],[600,4,600,5],[563,4,563,5],[564,4,564,5],[566,7,566,8],[568,4,568,5],[528,0,528,4],[528,5,528,8],[529,0,529,4],[529,5,529,8],[530,0,530,4],[530,5,530,8],[520,4,520,5],[521,4,521,5],[523,7,523,8],[525,4,525,5],[526,4,526,5],[527,0,527,4],[527,5,527,8],[544,7,544,8],[546,4,546,5],[547,4,547,5],[548,4,548,5],[549,4,549,5],[486,0,486,4],[486,5,486,8],[502,4,502,5],[503,4,503,5],[504,4,504,5],[505,4,505,5],[506,4,506,5],[507,4,507,5],[495,0,495,4],[495,5,495,8],[497,7,497,8],[499,4,499,5],[500,4,500,5],[501,4,501,5],[490,0,490,4],[490,5,490,8],[491,6,491,8],[492,6,492,8],[493,6,493,8],[494,6,494,8],[487,0,487,4],[487,5,487,8],[488,0,488,4],[488,5,488,8],[489,0,489,4],[489,5,489,8],[508,4,508,5],[510,7,510,8],[512,4,512,5],[513,4,513,5],[514,4,514,5],[479,0,479,4],[479,5,479,8],[480,0,480,4],[480,5,480,8],[453,9,454,9],[456,0,456,4],[456,5,456,8],[457,0,457,4],[457,5,457,8],[458,0,458,4],[476,0,476,4],[476,5,476,8],[477,0,477,4],[477,5,477,8],[478,0,478,4],[478,5,478,8],[471,0,471,4],[471,5,471,8],[472,5,472,8],[474,0,474,4],[474,5,474,8],[475,0,475,4],[475,5,475,8],[467,9,468,9],[482,7,482,8],[484,4,484,5],[485,4,485,5],[443,5,443,8],[444,0,444,4],[444,5,444,8],[445,0,445,4],[445,5,445,8],[446,0,446,4],[463,7,463,8],[465,4,465,5],[466,4,466,5],[467,0,468,0],[467,1,468,1],[467,2,468,2],[467,3,468,3],[467,4,468,4],[467,5,467,6],[467,7,467,8],[458,5,458,8],[459,0,459,4],[459,5,459,8],[460,0,460,4],[460,5,460,8],[461,0,461,4],[461,5,461,8],[453,7,453,8],[432,0,432,4],[432,5,432,8],[434,7,434,8],[436,0,436,9],[437,4,437,5],[424,7,424,8],[424,9,425,9],[427,0,427,4],[427,5,427,8],[428,0,428,4],[428,5,428,8],[429,0,429,4],[429,5,429,8],[430,0,430,4],[430,5,430,8],[431,0,431,4],[453,0,454,0],[453,1,454,1],[453,2,454,2],[453,3,454,3],[453,4,454,4],[453,5,453,6],[446,5,446,8],[447,0,447,4],[447,5,447,8],[449,7,449,8],[451,4,451,5],[452,4,452,5],[439,7,439,8],[442,0,442,4],[442,5,442,8],[443,0,443,4],[422,4,422,5],[423,4,423,5],[424,0,425,0],[424,1,425,1],[424,2,425,2],[424,3,425,3],[424,4,425,4],[424,5,424,6],[416,5,416,8],[417,0,417,4],[417,5,417,8],[418,0,418,4],[418,5,418,8],[420,7,420,8],[410,7,410,8],[439,9,440,9],[410,9,411,9],[413,0,413,4],[413,5,413,8],[414,0,414,4],[414,5,414,8],[415,0,415,4],[415,5,415,8],[416,0,416,4],[438,4,438,5],[439,0,440,0],[439,1,440,1],[439,2,440,2],[439,3,440,3],[439,4,440,4],[439,5,439,6],[431,5,431,8],[409,4,409,5],[410,0,411,0],[410,1,411,1]],"merged_total":1560,"flags":["merged_cut"]}
[null,null,"Composições Analíticas com Preço Unitário",null,"Bancos",null,"B.D.I.",null,"Encargos Sociais"]
[null,null,"ITEM 2 - INTERTRAVADO",null,"SINAPI - 07/2024 - Sergipe\nSICRO3 - 04/2024 - Sergipe\nORSE - 06/2024 - Sergipe\n",null,"23,08%",null,"Não Desonerado: embutido nos preços unitário dos insumos de mão de obra, de acordo com as bases."]
["Composições Analíticas com Preço Unitário"]
["Composições Principais"]
[]
[]
[4,"Código","Banco","Descrição","Tipo",null,"Und","Quant.","Valor Unit","Total"]
["Composição"," 103689 ","SINAPI","FORNECIMENTO E INSTALAÇÃO DE PLACA DE OBRA COM CHAPA GALVANIZADA E ESTRUTURA DE MADEIRA. AF_03/2022_PS","PAVI - PAVIMENTAÇÃO",null,"m²",1,348.92,348.92]
["Composição Auxiliar"," 102234 ","SINAPI","PINTURA IMUNIZANTE PARA MADEIRA, 2 DEMÃOS. AF_01/2021","PINT - PINTURAS",null,"m²",0.5,25.92,12.96]
["Composição Auxiliar"," 88262 ","SINAPI","CARPINTEIRO DE FORMAS COM ENCARGOS COMPLEMENTARES","SEDI - SERVIÇOS DIVERSOS",null,"H",0.37290000000000001,25.8,9.6199999999999992]
["Composição Auxiliar"," 88316 ","SINAPI","SERVENTE COM ENCARGOS COMPLEMENTARES","SEDI - SERVIÇOS DIVERSOS",null,"H",1.1186,20.420000000000002,22.84]
["Insumo"," 00004509 ","SINAPI","SARRAFO *2,5 X 10* CM EM PINUS, MISTA OU EQUIVALENTE DA REGIAO - BRUTA","Material",null,"M",3.2082999999999999,5.58,17.899999999999999]
["Insumo"," 00004813 ","SINAPI","PLACA DE OBRA (PARA CONSTRUCAO CIVIL) EM CHAPA GALVANIZADA *N. 22*, ADESIVADA, DE *2,4 X 1,2* M (SEM POSTES PARA FIXACAO)","Material",null,"m²",1,285,285]
["Insumo"," 00005065 ","SINAPI","PREGO DE ACO POLIDO COM CABECA 10 X 10 (7/8 X 17)","Material",null,"KG",1.1299999999999999E-2,32.89,0.37]
["Insumo"," 00005069 ","SINAPI","PREGO DE ACO POLIDO COM CABECA 17 X 27 (2 1/2 X 11)","Material",null,"KG",1.32E-2,17.62,0.23]
[]
[]
[]
[]
[6,"Código","Banco","Descrição","Tipo",null,"Und","Quant.","Valor Unit","Total"]
["Composição"," 5502114 ","SICRO3","Escavação, carga e transporte de material de 1ª categoria - DMT de 1.000 a 1.200 m - caminho de serviço em leito natural - com escavadeira e caminhão basculante de 14 m³","",null,"m³",1,7.61,7.61]
["A","Código","Banco","Equipamentos","Quantidade","Utilização",null,"Custo Operacional",null,"Custo Horário"]
[{"$nulls":5},"Operativa","Improdutiva","Operativa","Improdutiva"]
["Insumo","E9667","SICRO3","Caminhão basculante com capacidade de 14 m³ - 188 kW",5,0.96,0.04,291.20460000000003,84.746899999999997,1414.7315000000001]
["Insumo","E9515","SICRO3","Escavadeira hidráulica sobre esteiras com caçamba com capacidade de 1,56 m³ - 118 kW",1,1,0,278.95460000000003,124.60599999999999,278.95460000000003]
[{"$nulls":5},"Custo Horário de Equipamentos =>",null,null,null,1693.6860999999999]
["B","Código","Banco","Mão de Obra","Quantidade","Salário Hora",null,null,null,"Custo Horário"]
["Insumo","P9824","SICRO3","Servente",1,null,null,null,20.652699999999999,20.652699999999999]
[{"$nulls":5},"Custo Horário da Mão de Obra =>",null,null,null,20.652699999999999]
[{"$nulls":5},"Adc.M.O. - Ferramentas (0,0%) =>",null,null,null,0]
[{"$nulls":5},"Custo Horário de Execução =>",null,null,null,1714.3388]
[{"$nulls":5},"Fator de Influencia da Chuva - FIC =>",null,null,null,2.1399999999999999E-2]
[{"$nulls":5},"Custo do FIC =>",null,null,null,0.15970000000000001]
[{"$nulls":5},"Produção de Equipe =>",null,null,null,230.19]
[{"$nulls":5},"Custo Unitário de Execução =>",null,null,null,7.4474999999999998]
[]
[]
[]
[7,"Código","Banco","Descrição","Tipo",null,"Und","Quant.","Valor Unit","Total"]
["Composição"," 4413942 ","SICRO3","Espalhamento de material em bota-fora","",null,"m³",1,1.93,1.93]
["A","Código","Banco","Equipamentos","Quantidade","Utilização",null,"Custo Operacional",null,"Custo Horário"]
[{"$nulls":5},"Operativa","Improdutiva","Operativa","Improdutiva"]
["Insumo","E9540","SICRO3","Trator sobre esteiras com lâmina - 127 kW",1,1,0,312.89330000000001,125.7383,312.89330000000001]
[{"$nulls":5},"Custo Horário de Equipamentos =>",null,null,null,312.89330000000001]
["B","Código","Banco","Mão de Obra","Quantidade","Salário Hora",null,null,null,"Custo Horário"]
["Insumo","P9824","SICRO3","Servente",1,null,null,null,20.652699999999999,20.652699999999999]
[{"$nulls":5},"Custo Horário da Mão de Obra =>",null,null,null,20.652699999999999]
[{"$nulls":5},"Adc.M.O. - Ferramentas (0,0%) =>",null,null,null,0]
[{"$nulls":5},"Custo Horário de Execução =>",null,null,null,333.54599999999999]
[{"$nulls":5},"Fator de Influencia da Chuva - FIC =>",null,null,null,2.1399999999999999E-2]
[{"$nulls":5},"Custo do FIC =>",null,null,null,4.0399999999999998E-2]
[{"$nulls":5},"Produção de Equipe =>",null,null,null,176.81]
[{"$nulls":5},"Custo Unitário de Execução =>",null,null,null,1.8865000000000001]
[]
[]
[]
[9,"Código","Banco","Descrição","Tipo",null,"Und","Quant.","Valor Unit","Total"]
["Composição"," CODEVASF 325 ","Próprio","EXECUÇÃO DE PAVIMENTO EM PISO INTERTRAVADO, COM BLOCO 16 FACES DE 22 X 11 CM, ESPESSURA 8 CM. EXCLUSIVE FORNECIMENTO DE BLOQUETE. ADAPTADA DO SINAPI (92404)","PAVI - PAVIMENTAÇÃO",null,"m²",1,17.46,17.46]
["Composição Auxiliar"," 88260 ","SINAPI","CALCETEIRO COM ENCARGOS COMPLEMENTARES","SEDI - SERVIÇOS DIVERSOS",null,"H",0.21290000000000001,25.94,5.52]
["Composição Auxiliar"," 88316 ","SINAPI","SERVENTE COM ENCARGOS COMPLEMENTARES","SEDI - SERVIÇOS DIVERSOS",null,"H",0.21290000000000001,20.420000000000002,4.34]
["Composição Auxiliar"," 91277 ","SINAPI","PLACA VIBRATÓRIA REVERSÍVEL COM MOTOR 4 TEMPOS A GASOLINA, FORÇA CENTRÍFUGA DE 25 KN (2500 KGF), POTÊNCIA 5,5 CV - CHP DIURNO. AF_08/2015","CHOR - CUSTOS HORÁRIOS DE MÁQUINAS E EQUIPAMENTOS",null,"CHP",5.4999999999999997E-3,10.48,0.05]
["Composição Auxiliar"," 91278 ","SINAPI","PLACA VIBRATÓRIA REVERSÍVEL COM MOTOR 4 TEMPOS A GASOLINA, FORÇA CENTRÍFUGA DE 25 KN (2500 KGF), POTÊNCIA 5,5 CV - CHI DIURNO. AF_08/2015","CHOR - CUSTOS HORÁRIOS DE MÁQUINAS E EQUIPAMENTOS",null,"CHI",0.10100000000000001,0.71,7.0000000000000007E-2]
["Composição Auxiliar"," 91283 ","SINAPI","CORTADORA DE PISO COM MOTOR 4 TEMPOS A GASOLINA, POTÊNCIA DE 13 HP, COM DISCO DE CORTE DIAMANTADO SEGMENTADO PARA CONCRETO, DIÂMETRO DE 350 MM, FURO DE 1\" (14 X 1\") - CHP DIURNO. AF_08/2015","CHOR - CUSTOS HORÁRIOS DE MÁQUINAS E EQUIPAMENTOS",null,"CHP",3.8E-3,11.28,0.04]
["Composição Auxiliar"," 91285 ","SINAPI","CORTADORA DE PISO COM MOTOR 4 TEMPOS A GASOLINA, POTÊNCIA DE 13 HP, COM DISCO DE CORTE DIAMANTADO SEGMENTADO PARA CONCRETO, DIÂMETRO DE 350 MM, FURO DE 1\" (14 X 1\") - CHI DIURNO. AF_08/2015","CHOR - CUSTOS HORÁRIOS DE MÁQUINAS E EQUIPAMENTOS",null,"CHI",0.1027,1.06,0.1]
["Insumo"," 00000370 ","SINAPI","AREIA MEDIA - POSTO JAZIDA/FORNECEDOR (RETIRADO NA JAZIDA, SEM TRANSPORTE)","Material",null,"m³",5.6800000000000003E-2,110,6.24]
["Insumo"," 00004741 ","SINAPI","PO DE PEDRA (POSTO PEDREIRA/FORNECEDOR, SEM FRETE)","Material",null,"m³",9.7999999999999997E-3,113.08,1.1000000000000001]
[]
[]
[]
[10,"Código","Banco","Descrição","Tipo",null,"Und","Quant.","Valor Unit","Total"]
["Composição"," 5915014 ","SICRO3","Transporte com caminhão carroceria com capacidade de 11 t e com guindauto de 45 t.m - rodovia pavimentada","",null,"tkm",1,1.36,1.36]
["A","Código","Banco","Equipamentos","Quantidade","Utilização",null,"Custo Operacional",null,"Custo Horário"]
[{"$nulls":5},"Operativa","Improdutiva","Operativa","Improdutiva"]
["Insumo","E9041","SICRO3","Caminhão carroceria com guindauto com capacidade de 45 t.m - 188 kW",1,1,0,383.60199999999998,130.47980000000001,383.60199999999998]
[{"$nulls":5},"Custo Horário de Equipamentos =>",null,null,null,383.60199999999998]
[{"$nulls":5},"Custo Horário de Execução =>",null,null,null,383.60199999999998]
[{"$nulls":5},"Fator de Influencia da Chuva - FIC =>",null,null,null,0]
[{"$nulls":5},"Custo do FIC =>",null,null,null,0]
[{"$nulls":5},"Produção de Equipe =>",null,null,null,281.87]
[{"$nulls":5},"Custo Unitário de Execução =>",null,null,null,1.3609]
[]
[]
[]
[11,"Código","Banco","Descrição","Tipo",null,"Und","Quant.","Valor Unit","Total"]
["Composição"," 5915321 ","SICRO3","Transporte com caminhão basculante de 14 m³ - rodovia pavimentada","",null,"tkm",1,0.62,0.62]
["A","Código","Banco","Equipamentos","Quantidade","Utilização",null,"Custo Operacional",null,"Custo Horário"]
[{"$nulls":5},"Operativa","Improdutiva","Operativa","Improdutiva"]
["Insumo","E9667","SICRO3","Caminhão basculante com capacidade de 14 m³ - 188 kW",1,1,0,291.20460000000003,84.746899999999997,291.20460000000003]
[{"$nulls":5},"Custo Horário de Equipamentos =>",null,null,null,291.20460000000003]
[{"$nulls":5},"Custo Horário de Execução =>",null,null,null,291.20460000000003]
[{"$nulls":5},"Fator de Influencia da Chuva - FIC =>",null,null,null,0]
[{"$nulls":5},"Custo do FIC =>",null,null,null,0]
[{"$nulls":5},"Produção de Equipe =>",null,null,null,470.61]
[{"$nulls":5},"Custo Unitário de Execução =>",null,null,null,0.61880000000000002]
[]
[]
[]
[12,"Código","Banco","Descrição","Tipo",null,"Und","Quant.","Valor Unit","Total"]
["Composição"," 5915321 ","SICRO3","Transporte com caminhão basculante de 14 m³ - rodovia pavimentada","",null,"tkm",1,0.62,0.62]
["A","Código","Banco","Equipamentos","Quantidade","Utilização",null,"Custo Operacional",null,"Custo Horário"]
[{"$nulls":5},"Operativa","Improdutiva","Operativa","Improdutiva"]
["Insumo","E9667","SICRO3","Caminhão basculante com capacidade de 14 m³ - 188 kW",1,1,0,291.20460000000003,84.746899999999997,291.20460000000003]
[{"$nulls":5},"Custo Horário de Equipamentos =>",null,null,null,291.20460000000003]
[{"$nulls":5},"Custo Horário de Execução =>",null,null,null,291.20460000000003]
[{"$nulls":5},"Fator de Influencia da Chuva - FIC =>",null,null,null,0]
[{"$nulls":5},"Custo do FIC =>",null,null,null,0]
[{"$nulls":5},"Produção de Equipe =>",null,null,null,470.61]
[{"$nulls":5},"Custo Unitário de Execução =>",null,null,null,0.61880000000000002]
[]
[]
[]
[13,"Código","Banco","Descrição","Tipo",null,"Und","Quant.","Valor Unit","Total"]
["Composição"," 4011233 ","SICRO3","Sub-base estabilizada granulometricamente com mistura solo brita (70% - 30%) na pista com material de jazida e brita comercial","",null,"m³",1,73.41,73.41]
["A","Código","Banco","Equipamentos","Quantidade","Utilização",null,"Custo Operacional",null,"Custo Horário"]
[{"$nulls":5},"Operativa","Improdutiva","Operativa","Improdutiva"]
["Insumo","E9571","SICRO3","Caminhão tanque com capacidade de 10.000 l - 188 kW",1,0.83,0.17,315.7824,81.224900000000005,275.9076]
["Insumo","E9518","SICRO3","Grade de 24 discos rebocável de D = 60 cm (24”)",1,0.62,0.38,4.8604000000000003,3.3847,4.2995999999999999]
["Insumo","E9524","SICRO3","Motoniveladora - 93 kW",1,1,0,280.14109999999999,121.0896,280.14109999999999]
["Insumo","E9762","SICRO3","Rolo compactador de pneus autopropelido de 27 t - 85 kW",1,0.65,0.35,248.3853,120.0527,203.46889999999999]
["Insumo","E9685","SICRO3","Rolo compactador pé de carneiro vibratório autopropelido por pneus de 11,6 t - 82 kW",1,0.67,0.33,212.47120000000001,93.993300000000005,173.37350000000001]
["Insumo","E9577","SICRO3","Trator agrícola sobre pneus - 77 kW",1,0.62,0.38,140.85749999999999,50.441800000000001,106.4995]
[{"$nulls":5},"Custo Horário de Equipamentos =>",null,null,null,1043.6902]
["B","Código","Banco","Mão de Obra","Quantidade","Salário Hora",null,null,null,"Custo Horário"]
["Insumo","P9824","SICRO3","Servente",1,null,null,null,20.652699999999999,20.652699999999999]
[{"$nulls":5},"Custo Horário da Mão de Obra =>",null,null,null,20.652699999999999]
[{"$nulls":5},"Adc.M.O. - Ferramentas (0,0%) =>",null,null,null,0]
[{"$nulls":5},"Custo Horário de Execução =>",null,null,null,1064.3429000000001]
[{"$nulls":5},"Fator de Influencia da Chuva - FIC =>",null,null,null,2.1399999999999999E-2]
[{"$nulls":5},"Custo do FIC =>",null,null,null,0.1512]
[{"$nulls":5},"Produção de Equipe =>",null,null,null,150.88]
[{"$nulls":5},"Custo Unitário de Execução =>",null,null,null,7.0541999999999998]
["C","Banco","Código","Material","Quantidade","Unidade","Preço Unitário",null,null,"Custo Horário"]
["Insumo","SICRO3","M0191","Brita 1",0.41260000000000002,"m³",149.14840000000001,null,null,61.538600000000002]
[{"$nulls":5},"Custo Total do Material =>",null,null,null,61.538600000000002]
["D","Banco","Código","Atividades Auxiliares","Quantidade","Unidade","Preço Unitário",null,null,"Custo Horário"]
["Atividade Auxiliar","SICRO3",4016096,"Escavação e carga de material de jazida com escavadeira hidráulica de 1,56 m³",0.77019000000000004,"m³",1.33,null,null,1.0244]
[{"$nulls":5},"Custo Total das Atividades =>",null,null,null,1.0244]
["E","Banco","Insumo","Tempos Fixos","Código","Quantidade","Unidade","Preço Unitário",null,"Custo Horário"]
["Tempo Fixo","SICRO3",4016096,"Carga, manobra e descarga de agregados ou solos em caminhão basculante de 10 m³ - carga com escavadeira de 1,56 m³(exclusa) e descarga livre",5914354,1.44411,"t",1.79,null,2.585]
["Tempo Fixo","SICRO3","M0191","Carga, manobra e descarga de agregados ou solos em caminhão basculante de 10 m³ - carga com carregadeira de 3,40 m³(exclusa) e descarga livre",5914647,0.61890000000000001,"t",1.71,null,1.0583]
[{"$nulls":5},"Custo Total dos Tempos Fixos =>",null,null,null,3.6433]
["F","Banco","Insumo","Momento de Transporte","Quantidade","Unidade","Distância Média de Transporte (DMT)",null,null,"Custo Horário"]
[{"$nulls":6},"LN","RP","P"]
["Momento de Transporte","SICRO3",4016096,"Escavação e carga de material de jazida com escavadeira hidráulica de 1,56 m³ - Caminhão basculante com capacidade de 10 m³ - 188 kW",1.44411,"tkm","5914359\n0,000\nR$ 1,19","5914374\n0,000\nR$ 0,95","5914389\n0,000\nR$ 0,78",0]
["Momento de Transporte","SICRO3","M0191","Brita 1 - Caminhão basculante com capacidade de 10 m³ - 188 kW",0.61890000000000001,"tkm","5914359\n0,000\nR$ 1,19","5914374\n0,000\nR$ 0,95","5914389\n0,000\nR$ 0,78",0]
[{"$nulls":5},"Custo total dos Momentos de Transportes =>",null,null,null,0]
[]
[]
[]
[14,"Código","Banco","Descrição","Tipo",null,"Und","Quant.","Valor Unit","Total"]
["Composição"," 4011209 ","SICRO3","Regularização do subleito","",null,"m²",1,1.1200000000000001,1.1200000000000001]
["A","Código","Banco","Equipamentos","Quantidade","Utilização",null,"Custo Operacional",null,"Custo Horário"]
[{"$nulls":5},"Operativa","Improdutiva","Operativa","Improdutiva"]
["Insumo","E9571","SICRO3","Caminhão tanque com capacidade de 10.000 l - 188 kW",2,0.51,0.49,315.7824,81.224900000000005,401.69850000000002]
["Insumo","E9518","SICRO3","Grade de 24 discos rebocável de D = 60 cm (24”)",1,0.69,0.31,4.8604000000000003,3.3847,4.4028999999999998]
["Insumo","E9524","SICRO3","Motoniveladora - 93 kW",1,0.71,0.28999999999999998,280.14109999999999,121.0896,234.0162]
["Insumo","E9762","SICRO3","Rolo compactador de pneus autopropelido de 27 t - 85 kW",1,0.96,0.04,248.3853,120.0527,243.25200000000001]
["Insumo","E9685","SICRO3","Rolo compactador pé de carneiro vibratório autopropelido por pneus de 11,6 t - 82 kW",1,1,0,212.47120000000001,93.993300000000005,212.47120000000001]
["Insumo","E9577","SICRO3","Trator agrícola sobre pneus - 77 kW",1,0.69,0.31,140.85749999999999,50.441800000000001,112.82859999999999]
[{"$nulls":5},"Custo Horário de Equipamentos =>",null,null,null,1208.6694]
["B","Código","Banco","Mão de Obra","Quantidade","Salário Hora",null,null,null,"Custo Horário"]
["Insumo","P9824","SICRO3","Servente",1,null,null,null,20.652699999999999,20.652699999999999]
[{"$nulls":5},"Custo Horário da Mão de Obra =>",null,null,null,20.652699999999999]
[{"$nulls":5},"Adc.M.O. - Ferramentas (0,0%) =>",null,null,null,0]
[{"$nulls":5},"Custo Horário de Execução =>",null,null,null,1229.3221000000001]
[{"$nulls":5},"Fator de Influencia da Chuva - FIC =>",null,null,null,2.1399999999999999E-2]
[{"$nulls":5},"Custo do FIC =>",null,null,null,2.35E-2]
[{"$nulls":5},"Produção de Equipe =>",null,null,null,1121.33]
[{"$nulls":5},"Custo Unitário de Execução =>",null,null,null,1.0963000000000001]
[]
[]
[]
[15,"Código","Banco","Descrição","Tipo",null,"Und","Quant.","Valor Unit","Total"]
["Composição"," 5213440 ","SICRO3","Placa de regulamentação em aço D = 0,60 m - película retrorrefletiva tipo I + SI - fornecimento e implantação","",null,"un",1,252.07,252.07]
["A","Código","Banco","Equipamentos","Quantidade","Utilização",null,"Custo Operacional",null,"Custo Horário"]
[{"$nulls":5},"Operativa","Improdutiva","Operativa","Improdutiva"]
["Insumo","E9687","SICRO3","Caminhão carroceria com capacidade de 5 t - 115 kW",1,0.3,0.7,144.8526,57.002099999999999,83.357299999999995]
[{"$nulls":5},"Custo Horário de Equipamentos =>",null,null,null,83.357299999999995]
["B","Código","Banco","Mão de Obra","Quantidade","Salário Hora",null,null,null,"Custo Horário"]
["Insumo","P9830","SICRO3","Montador",1,null,null,null,30.709900000000001,30.709900000000001]
["Insumo","P9824","SICRO3","Servente",2,null,null,null,20.652699999999999,41.305399999999999]
[{"$nulls":5},"Custo Horário da Mão de Obra =>",null,null,null,72.015299999999996]
[{"$nulls":5},"Adc.M.O. - Ferramentas (0,0%) =>",null,null,null,0]
[{"$nulls":5},"Custo Horário de Execução =>",null,null,null,155.37260000000001]
[{"$nulls":5},"Fator de Influencia da Chuva - FIC =>",null,null,null,0]
[{"$nulls":5},"Custo do FIC =>",null,null,null,0]
[{"$nulls":5},"Produção de Equipe =>",null,null,null,3]
[{"$nulls":5},"Custo Unitário de Execução =>",null,null,null,51.790900000000001]
["D","Banco","Código","Atividades Auxiliares","Quantidade","Unidade","Preço Unitário",null,null,"Custo Horário"]
["Atividade Auxiliar","SICRO3",5213414,"Placa em aço nº 16 galvanizado com película retrorrefletiva tipo I + SI - confecção",0.35993999999999998,"m²",556.41,null,null,200.27420000000001]
[{"$nulls":5},"Custo Total das Atividades =>",null,null,null,200.27420000000001]
[]
[]
[]
[16,"Código","Banco","Descrição","Tipo",null,"Und","Quant.","Valor Unit","Total"]
["Composição"," 5213464 ","SICRO3","Placa de advertência em aço, lado de 0,60 m - película retrorrefletiva tipo I + SI - fornecimento e implantação","",null,"un",1,252.1,252.1]
["A","Código","Banco","Equipamentos","Quantidade","Utilização",null,"Custo Operacional",null,"Custo Horário"]
[{"$nulls":5},"Operativa","Improdutiva","Operativa","Improdutiva"]
["Insumo","E9687","SICRO3","Caminhão carroceria com capacidade de 5 t - 115 kW",1,0.3,0.7,144.8526,57.002099999999999,83.357299999999995]
[{"$nulls":5},"Custo Horário de Equipamentos =>",null,null,null,83.357299999999995]
["B","Código","Banco","Mão de Obra","Quantidade","Salário Hora",null,null,null,"Custo Horário"]
["Insumo","P9830","SICRO3","Montador",1,null,null,null,30.709900000000001,30.709900000000001]
["Insumo","P9824","SICRO3","Servente",2,null,null,null,20.652699999999999,41.305399999999999]
[{"$nulls":5},"Custo Horário da Mão de Obra =>",null,null,null,72.015299999999996]
[{"$nulls":5},"Adc.M.O. - Ferramentas (0,0%) =>",null,null,null,0]
[{"$nulls":5},"Custo Horário de Execução =>",null,null,null,155.37260000000001]
[{"$nulls":5},"Fator de Influencia da Chuva - FIC =>",null,null,null,0]
[{"$nulls":5},"Custo do FIC =>",null,null,null,0]
[{"$nulls":5},"Produção de Equipe =>",null,null,null,3]
[{"$nulls":5},"Custo Unitário de Execução =>",null,null,null,51.790900000000001]
["D","Banco","Código","Atividades Auxiliares","Quantidade","Unidade","Preço Unitário",null,null,"Custo Horário"]
["Atividade Auxiliar","SICRO3",5213414,"Placa em aço nº 16 galvanizado com película retrorrefletiva tipo I + SI - confecção",0.36,"m²",556.41,null,null,200.30760000000001]
[{"$nulls":5},"Custo Total das Atividades =>",null,null,null,200.30760000000001]
[]
[]
[]
[17,"Código","Banco","Descrição","Tipo",null,"Und","Quant.","Valor Unit","Total"]
["Composição"," 5213863 ","SICRO3","Suporte metálico galvanizado para placa de advertência ou regulamentação - lado ou diâmetro de 0,60 m - fornecimento e implantação","",null,"un",1,453.39,453.39]
["A","Código","Banco","Equipamentos","Quantidade","Utilização",null,"Custo Operacional",null,"Custo Horário"]
[{"$nulls":5},"Operativa","Improdutiva","Operativa","Improdutiva"]
["Insumo","E9687","SICRO3","Caminhão carroceria com capacidade de 5 t - 115 kW",1,0.3,0.7,144.8526,57.002099999999999,83.357299999999995]
[{"$nulls":5},"Custo Horário de Equipamentos =>",null,null,null,83.357299999999995]
["B","Código","Banco","Mão de Obra","Quantidade","Salário Hora",null,null,null,"Custo Horário"]
["Insumo","P9830","SICRO3","Montador",1,null,null,null,30.709900000000001,30.709900000000001]
["Insumo","P9824","SICRO3","Servente",1,null,null,null,20.652699999999999,20.652699999999999]
[{"$nulls":5},"Custo Horário da Mão de Obra =>",null,null,null,51.3626]
[{"$nulls":5},"Adc.M.O. - Ferramentas (0,0%) =>",null,null,null,0]
[{"$nulls":5},"Custo Horário de Execução =>",null,null,null,134.7199]
[{"$nulls":5},"Fator de Influencia da Chuva - FIC =>",null,null,null,0]
[{"$nulls":5},"Custo do FIC =>",null,null,null,0]
[{"$nulls":5},"Produção de Equipe =>",null,null,null,4.0999999999999996]
[{"$nulls":5},"Custo Unitário de Execução =>",null,null,null,32.858499999999999]
["C","Banco","Código","Material","Quantidade","Unidade","Preço Unitário",null,null,"Custo Horário"]
["Insumo","SICRO3","M0789","Conjunto para fixação de placas em aço galvanizado composto por barra chata, abraçadeira, parafusos,",0.69699999999999995,"kg",30.351099999999999,null,null,21.154699999999998]
["Insumo","SICRO3","M0787","Suporte em aço-carbono galvanizado tipo perfil C para placa de sinalização",12.717000000000001,"kg",29.35,null,null,373.24400000000003]
[{"$nulls":5},"Custo Total do Material =>",null,null,null,394.39870000000002]
["D","Banco","Código","Atividades Auxiliares","Quantidade","Unidade","Preço Unitário",null,null,"Custo Horário"]
["Atividade Auxiliar","SICRO3",1107892,"Concreto fck = 20 MPa - confecção em betoneira e lançamento manual - areia e brita comerciais",5.0270000000000002E-2,"m³",469.11,null,null,23.5822]
["Atividade Auxiliar","SICRO3",4805750,"Escavação manual em material de 1ª categoria na profundidade de até 1 m",5.0270000000000002E-2,"m³",42.19,null,null,2.1208999999999998]
[{"$nulls":5},"Custo Total das Atividades =>",null,null,null,25.703099999999999]
["E","Banco","Insumo","Tempos Fixos","Código","Quantidade","Unidade","Preço Unitário",null,"Custo Horário"]
["Tempo Fixo","SICRO3","M0789","Carga, manobra e descarga de materiais diversos em caminhão carroceria de 15 t - carga e descarga manuais",5914655,6.9999999999999999E-4,"t",32.229999999999997,null,2.2599999999999999E-2]
["Tempo Fixo","SICRO3","M0787","Carga, manobra e descarga de materiais diversos em caminhão carroceria de 15 t - carga e descarga manuais",5914655,1.272E-2,"t",32.229999999999997,null,0.41]
[{"$nulls":5},"Custo Total dos Tempos Fixos =>",null,null,null,0.43259999999999998]
["F","Banco","Insumo","Momento de Transporte","Quantidade","Unidade","Distância Média de Transporte (DMT)",null,null,"Custo Horário"]
[{"$nulls":6},"LN","RP","P"]
["Momento de Transporte","SICRO3","M0789","Conjunto para fixação de placas em aço galvanizado composto por barra chata, abraçadeira, parafusos, - Caminhão carroceria com capacidade de 15 t - 188 kW",6.9999999999999999E-4,"tkm","5914449\n0,000\nR$ 1,06","5914464\n0,000\nR$ 0,85","5914479\n0,000\nR$ 0,69",0]
["Momento de Transporte","SICRO3","M0787","Suporte em aço-carbono galvanizado tipo perfil C para placa de sinalização - Caminhão carroceria com capacidade de 15 t - 188 kW",1.272E-2,"tkm","5914449\n0,000\nR$ 1,06","5914464\n0,000\nR$ 0,85","5914479\n0,000\nR$ 0,69",0]
[{"$nulls":5},"Custo total dos Momentos de Transportes =>",null,null,null,0]
[]
[]
[]
[18,"Código","Banco","Descrição","Tipo",null,"Und","Quant.","Valor Unit","Total"]
["Composição"," 5213400 ","SICRO3","Pintura de faixa com tinta acrílica - espessura de 0,4 mm","",null,"m²",1,24.23,24.23]
["A","Código","Banco","Equipamentos","Quantidade","Utilização",null,"Custo Operacional",null,"Custo Horário"]
[{"$nulls":5},"Operativa","Improdutiva","Operativa","Improdutiva"]
["Insumo","E9644","SICRO3","Caminhão demarcador de faixas com sistema de pintura a frio - 28 kW/115 kW",1,1,0,362.96949999999998,150.8912,362.96949999999998]
[{"$nulls":5},"Custo Horário de Equipamentos =>",null,null,null,362.96949999999998]
["B","Código","Banco","Mão de Obra","Quantidade","Salário Hora",null,null,null,"Custo Horário"]
["Insumo","P9853","SICRO3","Pré-marcador",1,null,null,null,20.4679,20.4679]
["Insumo","P9824","SICRO3","Servente",4,null,null,null,20.652699999999999,82.610799999999998]
[{"$nulls":5},"Custo Horário da Mão de Obra =>",null,null,null,103.0787]
[{"$nulls":5},"Adc.M.O. - Ferramentas (0,0%) =>",null,null,null,0]
[{"$nulls":5},"Custo Horário de Execução =>",null,null,null,466.04820000000001]
[{"$nulls":5},"Fator de Influencia da Chuva - FIC =>",null,null,null,0]
[{"$nulls":5},"Custo do FIC =>",null,null,null,0]
[{"$nulls":5},"Produção de Equipe =>",null,null,null,177.07]
[{"$nulls":5},"Custo Unitário de Execução =>",null,null,null,2.6320000000000001]
["C","Banco","Código","Material","Quantidade","Unidade","Preço Unitário",null,null,"Custo Horário"]
["Insumo","SICRO3","M2037","Microesferas refletivas de vidro tipo I-B",0.08,"kg",9.8178000000000001,null,null,0.78539999999999999]
["Insumo","SICRO3","M2038","Microesferas refletivas de vidro tipo II-A",0.35,"kg",10.5275,null,null,3.6846000000000001]
["Insumo","SICRO3","M2034","Solvente para tinta à base de resina acrílica",0.02,"l",16.6111,null,null,0.3322]
["Insumo","SICRO3","M2044","Tinta à base de resina acrílica emulsionada em água para pré-marcação viária",9.7000000000000005E-4,"l",22.174299999999999,null,null,2.1499999999999998E-2]
["Insumo","SICRO3","M2027","Tinta à base de resina acrílica estirenada para demarcação viária",0.4,"l",41.8628,null,null,16.745100000000001]
[{"$nulls":5},"Custo Total do Material =>",null,null,null,21.5688]
["E","Banco","Insumo","Tempos Fixos","Código","Quantidade","Unidade","Preço Unitário",null,"Custo Horário"]
["Tempo Fixo","SICRO3","M2037","Carga, manobra e descarga de materiais diversos em caminhão carroceria de 15 t - carga e descarga manuais",5914655,8.0000000000000007E-5,"t",32.229999999999997,null,2.5999999999999999E-3]
["Tempo Fixo","SICRO3","M2038","Carga, manobra e descarga de materiais diversos em caminhão carroceria de 15 t - carga e descarga manuais",5914655,3.5E-4,"t",32.229999999999997,null,1.1299999999999999E-2]
["Tempo Fixo","SICRO3","M2034","Carga, manobra e descarga de materiais diversos em caminhão carroceria de 15 t - carga e descarga manuais",5914655,2.0000000000000002E-5,"t",32.229999999999997,null,5.9999999999999995E-4]
["Tempo Fixo","SICRO3","M2027","Carga, manobra e descarga de materiais diversos em caminhão carroceria de 15 t - carga e descarga manuais",5914655,5.5000000000000003E-4,"t",32.229999999999997,null,1.77E-2]
[{"$nulls":5},"Custo Total dos Tempos Fixos =>",null,null,null,3.2199999999999999E-2]
["F","Banco","Insumo","Momento de Transporte","Quantidade","Unidade","Distância Média de Transporte (DMT)",null,null,"Custo Horário"]
[{"$nulls":6},"LN","RP","P"]
["Momento de Transporte","SICRO3","M2037","Microesferas refletivas de vidro tipo I-B - Caminhão carroceria com capacidade de 15 t - 188 kW",8.0000000000000007E-5,"tkm","5914449\n0,000\nR$ 1,06","5914464\n0,000\nR$ 0,85","5914479\n0,000\nR$ 0,69",0]
["Momento de Transporte","SICRO3","M2038","Microesferas refletivas de vidro tipo II-A - Caminhão carroceria com capacidade de 15 t - 188 kW",3.5E-4,"tkm","5914449\n0,000\nR$ 1,06","5914464\n0,000\nR$ 0,85","5914479\n0,000\nR$ 0,69",0]
["Momento de Transporte","SICRO3","M2034","Solvente para tinta à base de resina acrílica - Caminhão carroceria com capacidade de 15 t - 188 kW",2.0000000000000002E-5,"tkm","5914449\n0,000\nR$ 1,06","5914464\n0,000\nR$ 0,85","5914479\n0,000\nR$ 0,69",0]
["Momento de Transporte","SICRO3","M2027","Tinta à base de resina acrílica estirenada para demarcação viária - Caminhão carroceria com capacidade de 15 t - 188 kW",5.5000000000000003E-4,"tkm","5914449\n0,000\nR$ 1,06","5914464\n0,000\nR$ 0,85","5914479\n0,000\nR$ 0,69",0]
[{"$nulls":5},"Custo total dos Momentos de Transportes =>",null,null,null,0]
[]
[]
[]
[19,"Código","Banco","Descrição","Tipo",null,"Und","Quant.","Valor Unit","Total"]
["Composição"," 2003373 ","SICRO3","Meio-fio de concreto - MFC 03 - areia e brita comerciais - fôrma de madeira","",null,"m",1,67,67]
[{"$nulls":5},"Custo Horário de Execução =>",null,null,null,0]
[{"$nulls":5},"Fator de Influencia da Chuva - FIC =>",null,null,null,0]
[{"$nulls":5},"Custo do FIC =>",null,null,null,0]
[{"$nulls":5},"Produção de Equipe =>",null,null,null,1]
[{"$nulls":5},"Custo Unitário de Execução =>",null,null,null,0]
["D","Banco","Código","Atividades Auxiliares","Quantidade","Unidade","Preço Unitário",null,null,"Custo Horário"]
["Atividade Auxiliar","SICRO3",1107892,"Concreto fck = 20 MPa - confecção em betoneira e lançamento manual - areia e brita comerciais",4.2000000000000003E-2,"m³",469.11,null,null,19.7026]
["Atividade Auxiliar","SICRO3",2003842,"Enchimento de junta de concreto com argamassa asfáltica de densidade 1.700 kg/m³ - espessura de 1 cm",5.9499999999999997E-2,"kg",67.08,null,null,3.9912999999999998]
["Atividade Auxiliar","SICRO3",3103302,"Fôrmas de tábuas de pinho para dispositivos de drenagem - utilização de 3 vezes - confecção, instalação e retirada",0.54749999999999999,"m²",76.78,null,null,42.037100000000002]
["Atividade Auxiliar","SICRO3",4805750,"Escavação manual em material de 1ª categoria na profundidade de até 1 m",0.03,"m³",42.19,null,null,1.2657]
[{"$nulls":5},"Custo Total das Atividades =>",null,null,null,66.996700000000004]
[]
[]
[]
[20,"Código","Banco","Descrição","Tipo",null,"Und","Quant.","Valor Unit","Total"]
["Composição"," 4915724 ","SICRO3","Caiação mecanizada com fixador de cal","",null,"m²",1,1.83,1.83]
["A","Código","Banco","Equipamentos","Quantidade","Utilização",null,"Custo Operacional",null,"Custo Horário"]
[{"$nulls":5},"Operativa","Improdutiva","Operativa","Improdutiva"]
["Insumo","E9256","SICRO3","Equipamento para pintura com cal rebocável com dois bicos aplicadores e capacidade de",1,1,0,31.965,28.0213,31.965]
["Insumo","E9156","SICRO3","Soprador de ar costal - 2,6 kW",1,1,0,5.6558000000000002,0.48809999999999998,5.6558000000000002]
["Insumo","E9577","SICRO3","Trator agrícola sobre pneus - 77 kW",1,1,0,140.85749999999999,50.441800000000001,140.85749999999999]
[{"$nulls":5},"Custo Horário de Equipamentos =>",null,null,null,178.47829999999999]
["B","Código","Banco","Mão de Obra","Quantidade","Salário Hora",null,null,null,"Custo Horário"]
["Insumo","P9824","SICRO3","Servente",2,null,null,null,20.652699999999999,41.305399999999999]
[{"$nulls":5},"Custo Horário da Mão de Obra =>",null,null,null,41.305399999999999]
[{"$nulls":5},"Adc.M.O. - Ferramentas (0,0%) =>",null,null,null,0]
[{"$nulls":5},"Custo Horário de Execução =>",null,null,null,219.78370000000001]
[{"$nulls":5},"Fator de Influencia da Chuva - FIC =>",null,null,null,0]
[{"$nulls":5},"Custo do FIC =>",null,null,null,0]
[{"$nulls":5},"Produção de Equipe =>",null,null,null,155.59]
[{"$nulls":5},"Custo Unitário de Execução =>",null,null,null,1.4126000000000001]
["C","Banco","Código","Material","Quantidade","Unidade","Preço Unitário",null,null,"Custo Horário"]
["Insumo","SICRO3","M0345","Cal hidratada - saco",0.41654999999999998,"kg",0.81799999999999995,null,null,0.3407]
["Insumo","SICRO3","M0729","Fixador de cal para pintura",6.8999999999999997E-4,"l",4.4683999999999999,null,null,3.0999999999999999E-3]
["Insumo","SICRO3","M0043","Óleo diesel",1.389E-2,"l",5.1524000000000001,null,null,7.1599999999999997E-2]
[{"$nulls":5},"Custo Total do Material =>",null,null,null,0.41539999999999999]
[]
[]
[]
[22,"Código","Banco","Descrição","Tipo",null,"Und","Quant.","Valor Unit","Total"]
["Composição"," CODEVASF  104 ","Próprio","Conserto de quebra no ramal na rua sem pavimento com fornecimento de material hidráulico","ASTU - ASSENTAMENTO DE TUBOS E PECAS",null,"m",1,23.54,23.54]
[{"$nulls":5},"Custo Horário de Execução =>",null,null,null,0]
[{"$nulls":5},"Fator de Influencia da Chuva - FIC =>",null,null,null,0]
[{"$nulls":5},"Custo do FIC =>",null,null,null,0]
[{"$nulls":5},"Produção de Equipe =>",null,null,null,1]
[{"$nulls":5},"Custo Unitário de Execução =>",null,null,null,0]
["C","Banco","Código","Material","Quantidade","Unidade","Preço Unitário",null,null,"Custo Horário"]
["Insumo","SINAPI",9867,"TUBO PVC, SOLDAVEL, DE 20 MM, AGUA FRIA (NBR-5648)",4.16,"M",3.06,null,null,12.7296]
["Insumo","ORSE",10585,"Arco de serra",0.1,"un",19.899999999999999,null,null,1.99]
["Insumo","SINAPI",3859,"LUVA SOLDAVEL COM ROSCA, PVC, 20 MM X 1/2\", PARA AGUA FRIA PREDIAL",2,"UN",1.1000000000000001,null,null,2.2000000000000002]
[{"$nulls":5},"Custo Total do Material =>",null,null,null,16.919599999999999]
["D","Banco","Código","Atividades Auxiliares","Quantidade","Unidade","Preço Unitário",null,null,"Custo Horário"]
["Atividade Auxiliar","SINAPI",88316,"SERVENTE COM ENCARGOS COMPLEMENTARES",0.2,"H",20.420000000000002,null,null,4.0839999999999996]
["Atividade Auxiliar","SINAPI",88267,"ENCANADOR OU BOMBEIRO HIDRÁULICO COM ENCARGOS COMPLEMENTARES",0.1,"H",25.39,null,null,2.5390000000000001]
[{"$nulls":5},"Custo Total das Atividades =>",null,null,null,6.6230000000000002]
[]
[]
[]
[]
[23,"Código","Banco","Descrição","Tipo",null,"Und","Quant.","Valor Unit","Total"]
["Composição"," 5914359 ","SICRO3","Transporte com caminhão basculante de 10 m³ - rodovia em leito natural","",null,"tkm",1,1.19,1.19]
["A","Código","Banco","Equipamentos","Quantidade","Utilização",null,"Custo Operacional",null,"Custo Horário"]
[{"$nulls":5},"Operativa","Improdutiva","Operativa","Improdutiva"]
["Insumo","E9579","SICRO3","Caminhão basculante com capacidade de 10 m³ - 188 kW",1,1,0,290.12920000000003,84.182400000000001,290.12920000000003]
[{"$nulls":5},"Custo Horário de Equipamentos =>",null,null,null,290.12920000000003]
[{"$nulls":5},"Custo Horário de Execução =>",null,null,null,290.12920000000003]
[{"$nulls":5},"Fator de Influencia da Chuva - FIC =>",null,null,null,2.1399999999999999E-2]
[{"$nulls":5},"Custo do FIC =>",null,null,null,2.5000000000000001E-2]
[{"$nulls":5},"Produção de Equipe =>",null,null,null,249]
[{"$nulls":5},"Custo Unitário de Execução =>",null,null,null,1.1652]
[]
[]
[]
[24,"Código","Banco","Descrição","Tipo",null,"Und","Quant.","Valor Unit","Total"]
["Composição"," 5914374 ","SICRO3","Transporte com caminhão basculante de 10 m³ - rodovia em revestimento primário","",null,"tkm",1,0.95,0.95]
["A","Código","Banco","Equipamentos","Quantidade","Utilização",null,"Custo Operacional",null,"Custo Horário"]
[{"$nulls":5},"Operativa","Improdutiva","Operativa","Improdutiva"]
["Insumo","E9579","SICRO3","Caminhão basculante com capacidade de 10 m³ - 188 kW",1,1,0,290.12920000000003,84.182400000000001,290.12920000000003]
[{"$nulls":5},"Custo Horário de Equipamentos =>",null,null,null,290.12920000000003]
[{"$nulls":5},"Custo Horário de Execução =>",null,null,null,290.12920000000003]
[{"$nulls":5},"Fator de Influencia da Chuva - FIC =>",null,null,null,2.1399999999999999E-2]
[{"$nulls":5},"Custo do FIC =>",null,null,null,0.02]
[{"$nulls":5},"Produção de Equipe =>",null,null,null,311.25]
[{"$nulls":5},"Custo Unitário de Execução =>",null,null,null,0.93210000000000004]
[]
[]
[]
[25,"Código","Banco","Descrição","Tipo",null,"Und","Quant.","Valor Unit","Total"]
["Composição"," 5914389 ","SICRO3","Transporte com caminhão basculante de 10 m³ - rodovia pavimentada","",null,"tkm",1,0.78,0.78]
["A","Código","Banco","Equipamentos","Quantidade","Utilização",null,"Custo Operacional",null,"Custo Horário"]
[{"$nulls":5},"Operativa","Improdutiva","Operativa","Improdutiva"]
["Insumo","E9579","SICRO3","Caminhão basculante com capacidade de 10 m³ - 188 kW",1,1,0,290.12920000000003,84.182400000000001,290.12920000000003]
[{"$nulls":5},"Custo Horário de Equipamentos =>",null,null,null,290.12920000000003]
[{"$nulls":5},"Custo Horário de Execução =>",null,null,null,290.12920000000003]
[{"$nulls":5},"Fator de Influencia da Chuva - FIC =>",null,null,null,0]
[{"$nulls":5},"Custo do FIC =>",null,null,null,0]
[{"$nulls":5},"Produção de Equipe =>",null,null,null,373.5]
[{"$nulls":5},"Custo Unitário de Execução =>",null,null,null,0.77680000000000005]
[]
[]
[]
[26,"Código","Banco","Descrição","Tipo",null,"Und","Quant.","Valor Unit","Total"]
["Composição"," 5914449 ","SICRO3","Transporte com caminhão carroceria de 15 t - rodovia em leito natural","",null,"tkm",1,1.06,1.06]
["A","Código","Banco","Equipamentos","Quantidade","Utilização",null,"Custo Operacional",null,"Custo Horário"]
[{"$nulls":5},"Operativa","Improdutiva","Operativa","Improdutiva"]
["Insumo","E9592","SICRO3","Caminhão carroceria com capacidade de 15 t - 188 kW",1,1,0,257.65910000000002,75.803200000000004,257.65910000000002]
[{"$nulls":5},"Custo Horário de Equipamentos =>",null,null,null,257.65910000000002]
[{"$nulls":5},"Custo Horário de Execução =>",null,null,null,257.65910000000002]
[{"$nulls":5},"Fator de Influencia da Chuva - FIC =>",null,null,null,2.1399999999999999E-2]
[{"$nulls":5},"Custo do FIC =>",null,null,null,2.2200000000000001E-2]
[{"$nulls":5},"Produção de Equipe =>",null,null,null,248.59]
[{"$nulls":5},"Custo Unitário de Execução =>",null,null,null,1.0365]
[]
[]
[]
[27,"Código","Banco","Descrição","Tipo",null,"Und","Quant.","Valor Unit","Total"]
["Composição"," 5914464 ","SICRO3","Transporte com caminhão carroceria de 15 t - rodovia em revestimento primário","",null,"tkm",1,0.85,0.85]
["A","Código","Banco","Equipamentos","Quantidade","Utilização",null,"Custo Operacional",null,"Custo Horário"]
[{"$nulls":5},"Operativa","Improdutiva","Operativa","Improdutiva"]
["Insumo","E9592","SICRO3","Caminhão carroceria com capacidade de 15 t - 188 kW",1,1,0,257.65910000000002,75.803200000000004,257.65910000000002]
[{"$nulls":5},"Custo Horário de Equipamentos =>",null,null,null,257.65910000000002]
[{"$nulls":5},"Custo Horário de Execução =>",null,null,null,257.65910000000002]
[{"$nulls":5},"Fator de Influencia da Chuva - FIC =>",null,null,null,2.1399999999999999E-2]
[{"$nulls":5},"Custo do FIC =>",null,null,null,1.78E-2]
[{"$nulls":5},"Produção de Equipe =>",null,null,null,310.73]
[{"$nulls":5},"Custo Unitário de Execução =>",null,null,null,0.82920000000000005]
[]
[]
[]
[28,"Código","Banco","Descrição","Tipo",null,"Und","Quant.","Valor Unit","Total"]
["Composição"," 5914479 ","SICRO3","Transporte com caminhão carroceria de 15 t - rodovia pavimentada","",null,"tkm",1,0.69,0.69]
["A","Código","Banco","Equipamentos","Quantidade","Utilização",null,"Custo Operacional",null,"Custo Horário"]
[{"$nulls":5},"Operativa","Improdutiva","Operativa","Improdutiva"]
["Insumo","E9592","SICRO3","Caminhão carroceria com capacidade de 15 t - 188 kW",1,1,0,257.65910000000002,75.803200000000004,257.65910000000002]
[{"$nulls":5},"Custo Horário de Equipamentos =>",null,null,null,257.65910000000002]
[{"$nulls":5},"Custo Horário de Execução =>",null,null,null,257.65910000000002]
[{"$nulls":5},"Fator de Influencia da Chuva - FIC =>",null,null,null,0]
[{"$nulls":5},"Custo do FIC =>",null,null,null,0]
[{"$nulls":5},"Produção de Equipe =>",null,null,null,372.88]
[{"$nulls":5},"Custo Unitário de Execução =>",null,null,null,0.69099999999999995]
[]
[]
[]
["Composições Auxiliares"]
[null,"Código","Banco","Descrição","Tipo",null,"Und","Quant.","Valor Unit","Total"]
["Composição"," 5914647 ","SICRO3","Carga, manobra e descarga de agregados ou solos em caminhão basculante de 10 m³ - carga com carregadeira de 3,40 m³(exclusa) e descarga livre","",null,"t",1,1.71,1.71]
["A","Código","Banco","Equipamentos","Quantidade","Utilização",null,"Custo Operacional",null,"Custo Horário"]
[{"$nulls":5},"Operativa","Improdutiva","Operativa","Improdutiva"]
["Insumo","E9579","SICRO3","Caminhão basculante com capacidade de 10 m³ - 188 kW",3,0.86,0.14000000000000001,290.12920000000003,84.182400000000001,783.88990000000001]
[{"$nulls":5},"Custo Horário de Equipamentos =>",null,null,null,783.88990000000001]
[{"$nulls":5},"Custo Horário de Execução =>",null,null,null,783.88990000000001]
[{"$nulls":5},"Fator de Influencia da Chuva - FIC =>",null,null,null,0]
[{"$nulls":5},"Custo do FIC =>",null,null,null,0]
[{"$nulls":5},"Produção de Equipe =>",null,null,null,457.16]
[{"$nulls":5},"Custo Unitário de Execução =>",null,null,null,1.7146999999999999]
[]
[]
[]
[null,"Código","Banco","Descrição","Tipo",null,"Und","Quant.","Valor Unit","Total"]
["Composição"," 5914354 ","SICRO3","Carga, manobra e descarga de agregados ou solos em caminhão basculante de 10 m³ - carga com escavadeira de 1,56 m³(exclusa) e descarga livre","",null,"t",1,1.79,1.79]
["A","Código","Banco","Equipamentos","Quantidade","Utilização",null,"Custo Operacional",null,"Custo Horário"]
[{"$nulls":5},"Operativa","Improdutiva","Operativa","Improdutiva"]
["Insumo","E9579","SICRO3","Caminhão basculante com capacidade de 10 m³ - 188 kW",3,0.84,0.16,290.12920000000003,84.182400000000001,771.53309999999999]
[{"$nulls":5},"Custo Horário de Equipamentos =>",null,null,null,771.53309999999999]
[{"$nulls":5},"Custo Horário de Execução =>",null,null,null,771.53309999999999]
[{"$nulls":5},"Fator de Influencia da Chuva - FIC =>",null,null,null,0]
[{"$nulls":5},"Custo do FIC =>",null,null,null,0]
[{"$nulls":5},"Produção de Equipe =>",null,null,null,431.6]
[{"$nulls":5},"Custo Unitário de Execução =>",null,null,null,1.7876000000000001]
[]
[]
[]
[null,"Código","Banco","Descrição","Tipo",null,"Und","Quant.","Valor Unit","Total"]
["Composição"," 5914333 ","SICRO3","Carga, manobra e descarga de materiais diversos em caminhão carroceria de 15 t - carga e descarga com caminhãoguindauto de 20 t.m","",null,"t",1,31.98,31.98]
["A","Código","Banco","Equipamentos","Quantidade","Utilização",null,"Custo Operacional",null,"Custo Horário"]
[{"$nulls":5},"Operativa","Improdutiva","Operativa","Improdutiva"]
["Insumo","E9592","SICRO3","Caminhão carroceria com capacidade de 15 t - 188 kW",2,0.53,0.47,257.65910000000002,75.803200000000004,344.37369999999999]
["Insumo","E9686","SICRO3","Caminhão carroceria com guindauto com capacidade de 20 t.m - 136 kW",1,1,0,297.82150000000001,111.6431,297.82150000000001]
[{"$nulls":5},"Custo Horário de Equipamentos =>",null,null,null,642.1952]
["B","Código","Banco","Mão de Obra","Quantidade","Salário Hora",null,null,null,"Custo Horário"]
["Insumo","P9824","SICRO3","Servente",2,null,null,null,20.652699999999999,41.305399999999999]
[{"$nulls":5},"Custo Horário da Mão de Obra =>",null,null,null,41.305399999999999]
[{"$nulls":5},"Adc.M.O. - Ferramentas (0,0%) =>",null,null,null,0]
[{"$nulls":5},"Custo Horário de Execução =>",null,null,null,683.50059999999996]
[{"$nulls":5},"Fator de Influencia da Chuva - FIC =>",null,null,null,0]
[{"$nulls":5},"Custo do FIC =>",null,null,null,0]
[{"$nulls":5},"Produção de Equipe =>",null,null,null,21.37]
[{"$nulls":5},"Custo Unitário de Execução =>",null,null,null,31.984100000000002]
[]
[]
[]
[null,"Código","Banco","Descrição","Tipo",null,"Und","Quant.","Valor Unit","Total"]
["Composição"," 012 Codevasf ","Próprio","ACOMPANHAMENTO DAS FRENTES DE SERVIÇO","PAVI - PAVIMENTAÇÃO",null,"CJ",1,36368.06,36368.06]
[{"$nulls":5},"Custo Horário de Execução =>",null,null,null,0]
[{"$nulls":5},"Fator de Influencia da Chuva - FIC =>",null,null,null,0]
[{"$nulls":5},"Custo do FIC =>",null,null,null,0]
[{"$nulls":5},"Produção de Equipe =>",null,null,null,1]
[{"$nulls":5},"Custo Unitário de Execução =>",null,null,null,0]
["D","Banco","Código","Atividades Auxiliares","Quantidade","Unidade","Preço Unitário",null,null,"Custo Horário"]
["Atividade Auxiliar","Próprio","013 Codevasf","FRENTE DE SERVIÇOS DE PAVIMENTAÇÃO",1,"CJ",23635.58,null,null,23635.58]
["Atividade Auxiliar","Próprio","014 Codevasf","FRENTE DE SERVIÇOS DE SINALIZAÇÃO ",1,"CJ",1024.45,null,null,1024.45]
["Atividade Auxiliar","Próprio","015 Codevasf","FRENTE DE SERVIÇOS DE DRENAGEM ",1,"CJ",11708.03,null,null,11708.03]
[{"$nulls":5},"Custo Total das Atividades =>",null,null,null,36368.06]
[]
[]
[]
[null,"Código","Banco","Descrição","Tipo",null,"Und","Quant.","Valor Unit","Total"]
["Composição"," 88260 ","SINAPI","CALCETEIRO COM ENCARGOS COMPLEMENTARES","SEDI - SERVIÇOS DIVERSOS",null,"H",1,25.94,25.94]
["Composição Auxiliar"," 95328 ","SINAPI","CURSO DE CAPACITAÇÃO PARA CALCETEIRO (ENCARGOS COMPLEMENTARES) - HORISTA","SEDI - SERVIÇOS DIVERSOS",null,"H",1,0.25,0.25]
["Insumo"," 00004759 ","SINAPI","CALCETEIRO / RASTELEIRO (HORISTA)","Mão de Obra",null,"H",1,19.12,19.12]
["Insumo"," 00037370 ","SINAPI","ALIMENTACAO - HORISTA (COLETADO CAIXA - ENCARGOS COMPLEMENTARES)","Material",null,"H",1,2.39,2.39]
["Insumo"," 00037371 ","SINAPI","TRANSPORTE - HORISTA (COLETADO CAIXA - ENCARGOS COMPLEMENTARES)","Material",null,"H",1,0.74,0.74]
["Insumo"," 00037372 ","SINAPI","EXAMES - HORISTA (COLETADO CAIXA - ENCARGOS COMPLEMENTARES)","Material",null,"H",1,1.34,1.34]
["Insumo"," 00037373 ","SINAPI","SEGURO - HORISTA (COLETADO CAIXA - ENCARGOS COMPLEMENTARES)","Material",null,"H",1,0.04,0.04]
["Insumo"," 00043465 ","SINAPI","FERRAMENTAS - FAMILIA PEDREIRO - HORISTA (ENCARGOS COMPLEMENTARES - COLETADO CAIXA)","Material",null,"H",1,0.82,0.82]
["Insumo"," 00043489 ","SINAPI","EPI - FAMILIA PEDREIRO - HORISTA (ENCARGOS COMPLEMENTARES - COLETADO CAIXA)","Material",null,"H",1,1.24,1.24]
[]
[]
[]
[null,"Código","Banco","Descrição","Tipo",null,"Und","Quant.","Valor Unit","Total"]
["Composição"," 88262 ","SINAPI","CARPINTEIRO DE FORMAS COM ENCARGOS COMPLEMENTARES","SEDI - SERVIÇOS DIVERSOS",null,"H",1,25.8,25.8]
["Composição Auxiliar"," 95330 ","SINAPI","CURSO DE CAPACITAÇÃO PARA CARPINTEIRO DE FÔRMAS (ENCARGOS COMPLEMENTARES) - HORISTA","SEDI - SERVIÇOS DIVERSOS",null,"H",1,0.25,0.25]
["Insumo"," 00001213 ","SINAPI","CARPINTEIRO DE FORMAS (HORISTA)","Mão de Obra",null,"H",1,19.12,19.12]
["Insumo"," 00037370 ","SINAPI","ALIMENTACAO - HORISTA (COLETADO CAIXA - ENCARGOS COMPLEMENTARES)","Material",null,"H",1,2.39,2.39]
["Insumo"," 00037371 ","SINAPI","TRANSPORTE - HORISTA (COLETADO CAIXA - ENCARGOS COMPLEMENTARES)","Material",null,"H",1,0.74,0.74]
["Insumo"," 00037372 ","SINAPI","EXAMES - HORISTA (COLETADO CAIXA - ENCARGOS COMPLEMENTARES)","Material",null,"H",1,1.34,1.34]
["Insumo"," 00037373 ","SINAPI","SEGURO - HORISTA (COLETADO CAIXA - ENCARGOS COMPLEMENTARES)","Material",null,"H",1,0.04,0.04]
["Insumo"," 00043459 ","SINAPI","FERRAMENTAS - FAMILIA CARPINTEIRO DE FORMAS - HORISTA (ENCARGOS COMPLEMENTARES - COLETADO CAIXA)","Material",null,"H",1,0.49,0.49]
["Insumo"," 00043483 ","SINAPI","EPI - FAMILIA CARPINTEIRO DE FORMAS - HORISTA (ENCARGOS COMPLEMENTARES - COLETADO CAIXA)","Material",null,"H",1,1.43,1.43]
[]
[]
[]
[null,"Código","Banco","Descrição","Tipo",null,"Und","Quant.","Valor Unit","Total"]
["Composição"," 011 Codevasf ","Próprio","COORDENAÇÃO DAS FRENTES DE SERVIÇO E CONTROLE TECNOLÓGICO DA OBRA (PARCELA VARIÁVEL)\t\t\t\t\t\t","PAVI - PAVIMENTAÇÃO",null,"CJ",1,48076.09,48076.09]
[{"$nulls":5},"Custo Horário de Execução =>",null,null,null,0]
[{"$nulls":5},"Fator de Influencia da Chuva - FIC =>",null,null,null,0]
[{"$nulls":5},"Custo do FIC =>",null,null,null,0]
[{"$nulls":5},"Produção de Equipe =>",null,null,null,1]
[{"$nulls":5},"Custo Unitário de Execução =>",null,null,null,0]
["D","Banco","Código","Atividades Auxiliares","Quantidade","Unidade","Preço Unitário",null,null,"Custo Horário"]
["Atividade Auxiliar","Próprio","012 Codevasf","ACOMPANHAMENTO DAS FRENTES DE SERVIÇO",1,"CJ",36368.06,null,null,36368.06]
["Atividade Auxiliar","Próprio","015 Codevasf","FRENTE DE SERVIÇOS DE DRENAGEM ",1,"CJ",11708.03,null,null,11708.03]
[{"$nulls":5},"Custo Total das Atividades =>",null,null,null,48076.09]
[]
[]
[]
[null,"Código","Banco","Descrição","Tipo",null,"Und","Quant.","Valor Unit","Total"]
["Composição"," 91285 ","SINAPI","CORTADORA DE PISO COM MOTOR 4 TEMPOS A GASOLINA, POTÊNCIA DE 13 HP, COM DISCO DE CORTE DIAMANTADO SEGMENTADO PARA CONCRETO, DIÂMETRO DE 350 MM, FURO DE 1\" (14 X 1\") - CHI DIURNO. AF_08/2015","CHOR - CUSTOS HORÁRIOS DE MÁQUINAS E EQUIPAMENTOS",null,"CHI",1,1.06,1.06]
["Composição Auxiliar"," 91279 ","SINAPI","CORTADORA DE PISO COM MOTOR 4 TEMPOS A GASOLINA, POTÊNCIA DE 13 HP, COM DISCO DE CORTE DIAMANTADO SEGMENTADO PARA CONCRETO, DIÂMETRO DE 350 MM, FURO DE 1\" (14 X 1\") - DEPRECIAÇÃO. AF_08/2015","CHOR - CUSTOS HORÁRIOS DE MÁQUINAS E EQUIPAMENTOS",null,"H",1,0.87,0.87]
["Composição Auxiliar"," 91280 ","SINAPI","CORTADORA DE PISO COM MOTOR 4 TEMPOS A GASOLINA, POTÊNCIA DE 13 HP, COM DISCO DE CORTE DIAMANTADO SEGMENTADO PARA CONCRETO, DIÂMETRO DE 350 MM, FURO DE 1\" (14 X 1\") - JUROS. AF_08/2015","CHOR - CUSTOS HORÁRIOS DE MÁQUINAS E EQUIPAMENTOS",null,"H",1,0.19,0.19]
[]
[]
[]
[null,"Código","Banco","Descrição","Tipo",null,"Und","Quant.","Valor Unit","Total"]
["Composição"," 91283 ","SINAPI","CORTADORA DE PISO COM MOTOR 4 TEMPOS A GASOLINA, POTÊNCIA DE 13 HP, COM DISCO DE CORTE DIAMANTADO SEGMENTADO PARA CONCRETO, DIÂMETRO DE 350 MM, FURO DE 1\" (14 X 1\") - CHP DIURNO. AF_08/2015","CHOR - CUSTOS HORÁRIOS DE MÁQUINAS E EQUIPAMENTOS",null,"CHP",1,11.28,11.28]
["Composição Auxiliar"," 91279 ","SINAPI","CORTADORA DE PISO COM MOTOR 4 TEMPOS A GASOLINA, POTÊNCIA DE 13 HP, COM DISCO DE CORTE DIAMANTADO SEGMENTADO PARA CONCRETO, DIÂMETRO DE 350 MM, FURO DE 1\" (14 X 1\") - DEPRECIAÇÃO. AF_08/2015","CHOR - CUSTOS HORÁRIOS DE MÁQUINAS E EQUIPAMENTOS",null,"H",1,0.87,0.87]
["Composição Auxiliar"," 91280 ","SINAPI","CORTADORA DE PISO COM MOTOR 4 TEMPOS A GASOLINA, POTÊNCIA DE 13 HP, COM DISCO DE CORTE DIAMANTADO SEGMENTADO PARA CONCRETO, DIÂMETRO DE 350 MM, FURO DE 1\" (14 X 1\") - JUROS. AF_08/2015","CHOR - CUSTOS HORÁRIOS DE MÁQUINAS E EQUIPAMENTOS",null,"H",1,0.19,0.19]
["Composição Auxiliar"," 91281 ","SINAPI","CORTADORA DE PISO COM MOTOR 4 TEMPOS A GASOLINA, POTÊNCIA DE 13 HP, COM DISCO DE CORTE DIAMANTADO SEGMENTADO PARA CONCRETO, DIÂMETRO DE 350 MM, FURO DE 1\" (14 X 1\") - MANUTENÇÃO. AF_08/2015","CHOR - CUSTOS HORÁRIOS DE MÁQUINAS E EQUIPAMENTOS",null,"H",1,1.0900000000000001,1.0900000000000001]
["Composição Auxiliar"," 91282 ","SINAPI","CORTADORA DE PISO COM MOTOR 4 TEMPOS A GASOLINA, POTÊNCIA DE 13 HP, COM DISCO DE CORTE DIAMANTADO SEGMENTADO PARA CONCRETO, DIÂMETRO DE 350 MM, FURO DE 1\" (14 X 1\") - MATERIAIS NA OPERAÇÃO. AF_08/2015","CHOR - CUSTOS HORÁRIOS DE MÁQUINAS E EQUIPAMENTOS",null,"H",1,9.1300000000000008,9.1300000000000008]
[]
[]
[]
[null,"Código","Banco","Descrição","Tipo",null,"Und","Quant.","Valor Unit","Total"]
["Composição"," 91279 ","SINAPI","CORTADORA DE PISO COM MOTOR 4 TEMPOS A GASOLINA, POTÊNCIA DE 13 HP, COM DISCO DE CORTE DIAMANTADO SEGMENTADO PARA CONCRETO, DIÂMETRO DE 350 MM, FURO DE 1\" (14 X 1\") - DEPRECIAÇÃO. AF_08/2015","CHOR - CUSTOS HORÁRIOS DE MÁQUINAS E EQUIPAMENTOS",null,"H",1,0.87,0.87]
["Insumo"," 00011280 ","SINAPI","CORTADEIRA DE PISO DE CONCRETO E ASFALTO, PARA DISCO PADRAO DE DIAMETRO 350 MM (14\") OU 450 MM (18\"), MOTOR A GASOLINA, POTENCIA 13 HP, SEM DISCO","Equipamento para Aquisição Permanente",null,"UN",6.3999999999999997E-5,13366.55,0.85]
["Insumo"," 00013887 ","SINAPI","DISCO DE CORTE DIAMANTADO SEGMENTADO PARA CONCRETO, DIAMETRO DE 350 MM, FURO DE 1\" (14 X 1 \")","Material",null,"UN",6.3999999999999997E-5,426.16,0.02]
[]
[]
[]
[null,"Código","Banco","Descrição","Tipo",null,"Und","Quant.","Valor Unit","Total"]
["Composição"," 91280 ","SINAPI","CORTADORA DE PISO COM MOTOR 4 TEMPOS A GASOLINA, POTÊNCIA DE 13 HP, COM DISCO DE CORTE DIAMANTADO SEGMENTADO PARA CONCRETO, DIÂMETRO DE 350 MM, FURO DE 1\" (14 X 1\") - JUROS. AF_08/2015","CHOR - CUSTOS HORÁRIOS DE MÁQUINAS E EQUIPAMENTOS",null,"H",1,0.19,0.19]
["Insumo"," 00011280 ","SINAPI","CORTADEIRA DE PISO DE CONCRETO E ASFALTO, PARA DISCO PADRAO DE DIAMETRO 350 MM (14\") OU 450 MM (18\"), MOTOR A GASOLINA, POTENCIA 13 HP, SEM DISCO","Equipamento para Aquisição Permanente",null,"UN",1.4800000000000001E-5,13366.55,0.19]
[]
[]
[]
[null,"Código","Banco","Descrição","Tipo",null,"Und","Quant.","Valor Unit","Total"]
["Composição"," 91281 ","SINAPI","CORTADORA DE PISO COM MOTOR 4 TEMPOS A GASOLINA, POTÊNCIA DE 13 HP, COM DISCO DE CORTE DIAMANTADO SEGMENTADO PARA CONCRETO, DIÂMETRO DE 350 MM, FURO DE 1\" (14 X 1\") - MANUTENÇÃO. AF_08/2015","CHOR - CUSTOS HORÁRIOS DE MÁQUINAS E EQUIPAMENTOS",null,"H",1,1.0900000000000001,1.0900000000000001]
["Insumo"," 00011280 ","SINAPI","CORTADEIRA DE PISO DE CONCRETO E ASFALTO, PARA DISCO PADRAO DE DIAMETRO 350 MM (14\") OU 450 MM (18\"), MOTOR A GASOLINA, POTENCIA 13 HP, SEM DISCO","Equipamento para Aquisição Permanente",null,"UN",8.0000000000000007E-5,13366.55,1.06]
["Insumo"," 00013887 ","SINAPI","DISCO DE CORTE DIAMANTADO SEGMENTADO PARA CONCRETO, DIAMETRO DE 350 MM, FURO DE 1\" (14 X 1 \")","Material",null,"UN",8.0000000000000007E-5,426.16,0.03]
[]
[]
[]
[null,"Código","Banco","Descrição","Tipo",null,"Und","Quant.","Valor Unit","Total"]
["Composição"," 91282 ","SINAPI","CORTADORA DE PISO COM MOTOR 4 TEMPOS A GASOLINA, POTÊNCIA DE 13 HP, COM DISCO DE CORTE DIAMANTADO SEGMENTADO PARA CONCRETO, DIÂMETRO DE 350 MM, FURO DE 1\" (14 X 1\") - MATERIAIS NA OPERAÇÃO. AF_08/2015","CHOR - CUSTOS HORÁRIOS DE MÁQUINAS E EQUIPAMENTOS",null,"H",1,9.1300000000000008,9.1300000000000008]
["Insumo"," 00004222 ","SINAPI","GASOLINA COMUM","Material",null,"L",1.45,6.3,9.1300000000000008]
[]
[]
[]
[null,"Código","Banco","Descrição","Tipo",null,"Und","Quant.","Valor Unit","Total"]
["Composição"," 95328 ","SINAPI","CURSO DE CAPACITAÇÃO PARA CALCETEIRO (ENCARGOS COMPLEMENTARES) - HORISTA","SEDI - SERVIÇOS DIVERSOS",null,"H",1,0.25,0.25]
["Insumo"," 00004759 ","SINAPI","CALCETEIRO / RASTELEIRO (HORISTA)","Mão de Obra",null,"H",1.328E-2,19.12,0.25]
[]
[]
[]
[null,"Código","Banco","Descrição","Tipo",null,"Und","Quant.","Valor Unit","Total"]
["Composição"," 95330 ","SINAPI","CURSO DE CAPACITAÇÃO PARA CARPINTEIRO DE FÔRMAS (ENCARGOS COMPLEMENTARES) - HORISTA","SEDI - SERVIÇOS DIVERSOS",null,"H",1,0.25,0.25]
["Insumo"," 00001213 ","SINAPI","CARPINTEIRO DE FORMAS (HORISTA)","Mão de Obra",null,"H",1.328E-2,19.12,0.25]
[]
[]
[]
[null,"Código","Banco","Descrição","Tipo",null,"Und","Quant.","Valor Unit","Total"]
["Composição"," 95335 ","SINAPI","CURSO DE CAPACITAÇÃO PARA ENCANADOR OU BOMBEIRO HIDRÁULICO (ENCARGOS COMPLEMENTARES) - HORISTA","SEDI - SERVIÇOS DIVERSOS",null,"H",1,0.39,0.39]
["Insumo"," 00002696 ","SINAPI","ENCANADOR OU BOMBEIRO HIDRAULICO (HORISTA)","Mão de Obra",null,"H",2.07E-2,19.12,0.39]
[]
[]
[]
[null,"Código","Banco","Descrição","Tipo",null,"Und","Quant.","Valor Unit","Total"]
["Composição"," 95372 ","SINAPI","CURSO DE CAPACITAÇÃO PARA PINTOR (ENCARGOS COMPLEMENTARES) - HORISTA","SEDI - SERVIÇOS DIVERSOS",null,"H",1,0.32,0.32]
["Insumo"," 00004783 ","SINAPI","PINTOR (HORISTA)","Mão de Obra",null,"H",1.6990000000000002E-2,19.12,0.32]
[]
[]
[]
[null,"Código","Banco","Descrição","Tipo",null,"Und","Quant.","Valor Unit","Total"]
["Composição"," 95378 ","SINAPI","CURSO DE CAPACITAÇÃO PARA SERVENTE (ENCARGOS COMPLEMENTARES) - HORISTA","SEDI - SERVIÇOS DIVERSOS",null,"H",1,0.33,0.33]
["Insumo"," 00006111 ","SINAPI","SERVENTE DE OBRAS (HORISTA)","Mão de Obra",null,"H",2.4420000000000001E-2,13.64,0.33]
[]
[]
[]
[null,"Código","Banco","Descrição","Tipo",null,"Und","Quant.","Valor Unit","Total"]
["Composição"," 5914655 ","SICRO3","Carga, manobra e descarga de materiais diversos em caminhão carroceria de 15 t - carga e descarga manuais","",null,"t",1,32.229999999999997,32.229999999999997]
["A","Código","Banco","Equipamentos","Quantidade","Utilização",null,"Custo Operacional",null,"Custo Horário"]
[{"$nulls":5},"Operativa","Improdutiva","Operativa","Improdutiva"]
["Insumo","E9592","SICRO3","Caminhão carroceria com capacidade de 15 t - 188 kW",1,1,0,257.65910000000002,75.803200000000004,257.65910000000002]
[{"$nulls":5},"Custo Horário de Equipamentos =>",null,null,null,257.65910000000002]
["B","Código","Banco","Mão de Obra","Quantidade","Salário Hora",null,null,null,"Custo Horário"]
["Insumo","P9824","SICRO3","Servente",6,null,null,null,20.652699999999999,123.9162]
[{"$nulls":5},"Custo Horário da Mão de Obra =>",null,null,null,123.9162]
[{"$nulls":5},"Adc.M.O. - Ferramentas (0,0%) =>",null,null,null,0]
[{"$nulls":5},"Custo Horário de Execução =>",null,null,null,381.57530000000003]
[{"$nulls":5},"Fator de Influencia da Chuva - FIC =>",null,null,null,0]
[{"$nulls":5},"Custo do FIC =>",null,null,null,0]
[{"$nulls":5},"Produção de Equipe =>",null,null,null,11.84]
[{"$nulls":5},"Custo Unitário de Execução =>",null,null,null,32.227600000000002]
[]
[]
[]
[null,"Código","Banco","Descrição","Tipo",null,"Und","Quant.","Valor Unit","Total"]
["Composição"," 5914655 ","SICRO3","Carga, manobra e descarga de materiais diversos em caminhão carroceria de 15 t - carga e descarga manuais","",null,"t",1,32.229999999999997,32.229999999999997]
["A","Código","Banco","Equipamentos","Quantidade","Utilização",null,"Custo Operacional",null,"Custo Horário"]
[{"$nulls":5},"Operativa","Improdutiva","Operativa","Improdutiva"]
["Insumo","E9592","SICRO3","Caminhão carroceria com capacidade de 15 t - 188 kW",1,1,0,257.65910000000002,75.803200000000004,257.65910000000002]
[{"$nulls":5},"Custo Horário de Equipamentos =>",null,null,null,257.65910000000002]
["B","Código","Banco","Mão de Obra","Quantidade","Salário Hora",null,null,null,"Custo Horário"]
["Insumo","P9824","SICRO3","Servente",6,null,null,null,20.652699999999999,123.9162]
[{"$nulls":5},"Custo Horário da Mão de Obra =>",null,null,null,123.9162]
[{"$nulls":5},"Adc.M.O. - Ferramentas (0,0%) =>",null,null,null,0]
[{"$nulls":5},"Custo Horário de Execução =>",null,null,null,381.57530000000003]
[{"$nulls":5},"Fator de Influencia da Chuva - FIC =>",null,null,null,0]
[{"$nulls":5},"Custo do FIC =>",null,null,null,0]
[{"$nulls":5},"Produção de Equipe =>",null,null,null,11.84]
[{"$nulls":5},"Custo Unitário de Execução =>",null,null,null,32.227600000000002]
[]
[]
[]
[null,"Código","Banco","Descrição","Tipo",null,"Und","Quant.","Valor Unit","Total"]
["Composição"," 1107892 ","SICRO3","Concreto fck = 20 MPa - confecção em betoneira e lançamento manual - areia e brita comerciais","",null,"m³",1,469.11,469.11]
["A","Código","Banco","Equipamentos","Quantidade","Utilização",null,"Custo Operacional",null,"Custo Horário"]
[{"$nulls":5},"Operativa","Improdutiva","Operativa","Improdutiva"]
["Insumo","E9010","SICRO3","Balança plataforma digital à bateria, com mesa de 75 x 75 cm e capacidade de 500 kg",1,1,0,1.2435,0.83540000000000003,1.2435]
["Insumo","E9519","SICRO3","Betoneira com motor a gasolina com capacidade de 600 l - 10 kW",1,1,0,47.139699999999998,26.426200000000001,47.139699999999998]
["Insumo","E9071","SICRO3","Transportador manual carrinho de mão com capacidade de 80 l",4,0.9,0.1,0.72030000000000005,0.48970000000000002,2.7890000000000001]
["Insumo","E9064","SICRO3","Transportador manual gerica com capacidade de 180 l",3,0.41,0.59,1.5347,1.0432999999999999,3.7343000000000002]
[{"$nulls":5},"Custo Horário de Equipamentos =>",null,null,null,54.906500000000001]
["B","Código","Banco","Mão de Obra","Quantidade","Salário Hora",null,null,null,"Custo Horário"]
["Insumo","P9821","SICRO3","Pedreiro",1,null,null,null,25.616099999999999,25.616099999999999]
["Insumo","P9824","SICRO3","Servente",9,null,null,null,20.652699999999999,185.87430000000001]
[{"$nulls":5},"Custo Horário da Mão de Obra =>",null,null,null,211.49039999999999]
[{"$nulls":5},"Adc.M.O. - Ferramentas (0,0%) =>",null,null,null,0]
[{"$nulls":5},"Custo Horário de Execução =>",null,null,null,266.39690000000002]
[{"$nulls":5},"Fator de Influencia da Chuva - FIC =>",null,null,null,0]
[{"$nulls":5},"Custo do FIC =>",null,null,null,0]
[{"$nulls":5},"Produção de Equipe =>",null,null,null,3.9289999999999998]
[{"$nulls":5},"Custo Unitário de Execução =>",null,null,null,67.802899999999994]
["C","Banco","Código","Material","Quantidade","Unidade","Preço Unitário",null,null,"Custo Horário"]
["Insumo","SICRO3","M0030","Aditivo plastificante e retardador de pega para concreto e argamassa",0.84645999999999999,"kg",7.3074000000000003,null,null,6.1853999999999996]
["Insumo","SICRO3","M0082","Areia média lavada",0.63334000000000001,"m³",133.62430000000001,null,null,84.629599999999996]
["Insumo","SICRO3","M0191","Brita 1",0.36753999999999998,"m³",149.14840000000001,null,null,54.817999999999998]
["Insumo","SICRO3","M0192","Brita 2",0.36753999999999998,"m³",148.76689999999999,null,null,54.677799999999998]
["Insumo","SICRO3","M0424","Cimento Portland CP II - 32 - saco",282.15206999999998,"kg",0.66759999999999997,null,null,188.3647]
[{"$nulls":5},"Custo Total do Material =>",null,null,null,388.6755]
["E","Banco","Insumo","Tempos Fixos","Código","Quantidade","Unidade","Preço Unitário",null,"Custo Horário"]
["Tempo Fixo","SICRO3","M0030","Carga, manobra e descarga de materiais diversos em caminhão carroceria de 15 t - carga e descarga manuais",5914655,8.4999999999999995E-4,"t",32.229999999999997,null,2.7400000000000001E-2]
["Tempo Fixo","SICRO3","M0082","Carga, manobra e descarga de agregados ou solos em caminhão basculante de 10 m³ - carga com carregadeira de 3,40 m³(exclusa) e descarga livre",5914647,0.95001000000000002,"t",1.71,null,1.6245000000000001]
["Tempo Fixo","SICRO3","M0191","Carga, manobra e descarga de agregados ou solos em caminhão basculante de 10 m³ - carga com carregadeira de 3,40 m³(exclusa) e descarga livre",5914647,0.55130999999999997,"t",1.71,null,0.94269999999999998]
["Tempo Fixo","SICRO3","M0192","Carga, manobra e descarga de agregados ou solos em caminhão basculante de 10 m³ - carga com carregadeira de 3,40 m³(exclusa) e descarga livre",5914647,0.55130999999999997,"t",1.71,null,0.94269999999999998]
["Tempo Fixo","SICRO3","M0424","Carga, manobra e descarga de materiais diversos em caminhão carroceria de 15 t - carga e descarga manuais",5914655,0.28215000000000001,"t",32.229999999999997,null,9.0937000000000001]
[{"$nulls":5},"Custo Total dos Tempos Fixos =>",null,null,null,12.631]
["F","Banco","Insumo","Momento de Transporte","Quantidade","Unidade","Distância Média de Transporte (DMT)",null,null,"Custo Horário"]
[{"$nulls":6},"LN","RP","P"]
["Momento de Transporte","SICRO3","M0030","Aditivo plastificante e retardador de pega para concreto e argamassa - Caminhão carroceria com capacidade de 15 t - 188 kW",8.4999999999999995E-4,"tkm","5914449\n0,000\nR$ 1,06","5914464\n0,000\nR$ 0,85","5914479\n0,000\nR$ 0,69",0]
["Momento de Transporte","SICRO3","M0082","Areia média lavada - Caminhão basculante com capacidade de 10 m³ - 188 kW",0.95001000000000002,"tkm","5914359\n0,000\nR$ 1,19","5914374\n0,000\nR$ 0,95","5914389\n0,000\nR$ 0,78",0]
["Momento de Transporte","SICRO3","M0191","Brita 1 - Caminhão basculante com capacidade de 10 m³ - 188 kW",0.55130999999999997,"tkm","5914359\n0,000\nR$ 1,19","5914374\n0,000\nR$ 0,95","5914389\n0,000\nR$ 0,78",0]
["Momento de Transporte","SICRO3","M0192","Brita 2 - Caminhão basculante com capacidade de 10 m³ - 188 kW",0.55130999999999997,"tkm","5914359\n0,000\nR$ 1,19","5914374\n0,000\nR$ 0,95","5914389\n0,000\nR$ 0,78",0]
["Momento de Transporte","SICRO3","M0424","Cimento Portland CP II - 32 - saco - Caminhão carroceria com capacidade de 15 t - 188 kW",0.28215000000000001,"tkm","5914449\n0,000\nR$ 1,06","5914464\n0,000\nR$ 0,85","5914479\n0,000\nR$ 0,69",0]
[{"$nulls":5},"Custo total dos Momentos de Transportes =>",null,null,null,0]
[]
[]
[]
[null,"Código","Banco","Descrição","Tipo",null,"Und","Quant.","Valor Unit","Total"]
["Composição"," 88267 ","SINAPI","ENCANADOR OU BOMBEIRO HIDRÁULICO COM ENCARGOS COMPLEMENTARES","SEDI - SERVIÇOS DIVERSOS",null,"H",1,25.39,25.39]
["Composição Auxiliar"," 95335 ","SINAPI","CURSO DE CAPACITAÇÃO PARA ENCANADOR OU BOMBEIRO HIDRÁULICO (ENCARGOS COMPLEMENTARES) - HORISTA","SEDI - SERVIÇOS DIVERSOS",null,"H",1,0.39,0.39]
["Insumo"," 00002696 ","SINAPI","ENCANADOR OU BOMBEIRO HIDRAULICO (HORISTA)","Mão de Obra",null,"H",1,19.12,19.12]
["Insumo"," 00037370 ","SINAPI","ALIMENTACAO - HORISTA (COLETADO CAIXA - ENCARGOS COMPLEMENTARES)","Material",null,"H",1,2.39,2.39]
["Insumo"," 00037371 ","SINAPI","TRANSPORTE - HORISTA (COLETADO CAIXA - ENCARGOS COMPLEMENTARES)","Material",null,"H",1,0.74,0.74]
["Insumo"," 00037372 ","SINAPI","EXAMES - HORISTA (COLETADO CAIXA - ENCARGOS COMPLEMENTARES)","Material",null,"H",1,1.34,1.34]
["Insumo"," 00037373 ","SINAPI","SEGURO - HORISTA (COLETADO CAIXA - ENCARGOS COMPLEMENTARES)","Material",null,"H",1,0.04,0.04]
["Insumo"," 00043461 ","SINAPI","FERRAMENTAS - FAMILIA ENCANADOR - HORISTA (ENCARGOS COMPLEMENTARES - COLETADO CAIXA)","Material",null,"H",1,0.31,0.31]
["Insumo"," 00043485 ","SINAPI","EPI - FAMILIA ENCANADOR - HORISTA (ENCARGOS COMPLEMENTARES - COLETADO CAIXA)","Material",null,"H",1,1.06,1.06]
[]
[]
[]
[null,"Código","Banco","Descrição","Tipo",null,"Und","Quant.","Valor Unit","Total"]
["Composição"," 007 Codevasf ","Próprio","ENCARREGADOS DE PRODUÇÃO","PAVI - PAVIMENTAÇÃO",null,"CJ",1,56285.79,56285.79]
[{"$nulls":5},"Custo Horário de Execução =>",null,null,null,0]
[{"$nulls":5},"Fator de Influencia da Chuva - FIC =>",null,null,null,0]
[{"$nulls":5},"Custo do FIC =>",null,null,null,0]
[{"$nulls":5},"Produção de Equipe =>",null,null,null,1]
[{"$nulls":5},"Custo Unitário de Execução =>",null,null,null,0]
["D","Banco","Código","Atividades Auxiliares","Quantidade","Unidade","Preço Unitário",null,null,"Custo Horário"]
["Atividade Auxiliar","Próprio","008 Codevasf","EQUIPE DE PRODUÇÃO DE PAVIMENTAÇÃO",1,"CJ",56285.79,null,null,56285.79]
[{"$nulls":5},"Custo Total das Atividades =>",null,null,null,56285.79]
[]
[]
[]
[null,"Código","Banco","Descrição","Tipo",null,"Und","Quant.","Valor Unit","Total"]
["Composição"," 009 Codevasf ","Próprio","EQUIPE DE MEDICINA E SEGURANÇA DO TRABALHO","PAVI - PAVIMENTAÇÃO",null,"CJ",1,49175.53,49175.53]
["B","Código","Banco","Mão de Obra","Quantidade","Salário Hora",null,null,null,"Custo Horário"]
["Insumo","P9876","SICRO3","Técnico de segurança do trabalho",7,null,null,null,7025.0758999999998,49175.531300000002]
[{"$nulls":5},"Custo Horário da Mão de Obra =>",null,null,null,49175.531300000002]
[{"$nulls":5},"Custo Horário de Execução =>",null,null,null,49175.531300000002]
[{"$nulls":5},"Fator de Influencia da Chuva - FIC =>",null,null,null,0]
[{"$nulls":5},"Custo do FIC =>",null,null,null,0]
[{"$nulls":5},"Produção de Equipe =>",null,null,null,1]
[{"$nulls":5},"Custo Unitário de Execução =>",null,null,null,49175.531300000002]
[]
[]
[]
[null,"Código","Banco","Descrição","Tipo",null,"Und","Quant.","Valor Unit","Total"]
["Composição"," 008 Codevasf ","Próprio","EQUIPE DE PRODUÇÃO DE PAVIMENTAÇÃO","PAVI - PAVIMENTAÇÃO",null,"CJ",1,56285.79,56285.79]
["A","Código","Banco","Equipamentos","Quantidade","Utilização",null,"Custo Operacional",null,"Custo Horário"]
[{"$nulls":5},"Operativa","Improdutiva","Operativa","Improdutiva"]
["Insumo","E9093","SICRO3","Veículo leve - 53 kW (sem motorista)",1320,0.2,0.8,35.639099999999999,6.1081000000000003,15858.876]
[{"$nulls":5},"Custo Horário de Equipamentos =>",null,null,null,15858.876]
["B","Código","Banco","Mão de Obra","Quantidade","Salário Hora",null,null,null,"Custo Horário"]
["Insumo","P9893","SICRO3","Encarregado de pavimentação",6,null,null,null,6737.8181999999997,40426.909200000002]
[{"$nulls":5},"Custo Horário da Mão de Obra =>",null,null,null,40426.909200000002]
[{"$nulls":5},"Custo Horário de Execução =>",null,null,null,56285.785199999998]
[{"$nulls":5},"Fator de Influencia da Chuva - FIC =>",null,null,null,0]
[{"$nulls":5},"Custo do FIC =>",null,null,null,0]
[{"$nulls":5},"Produção de Equipe =>",null,null,null,1]
[{"$nulls":5},"Custo Unitário de Execução =>",null,null,null,56285.785199999998]
[]
[]
[]
[null,"Código","Banco","Descrição","Tipo",null,"Und","Quant.","Valor Unit","Total"]
["Composição"," 010 Codevasf ","Próprio","EQUIPE DE TOPOGRAFIA","PAVI - PAVIMENTAÇÃO",null,"CJ",1,99600.44,99600.44]
["A","Código","Banco","Equipamentos","Quantidade","Utilização",null,"Custo Operacional",null,"Custo Horário"]
[{"$nulls":5},"Operativa","Improdutiva","Operativa","Improdutiva"]
["Insumo","E9093","SICRO3","Veículo leve - 53 kW (sem motorista)",1320,0.2,0.8,35.639099999999999,6.1081000000000003,15858.876]
[{"$nulls":5},"Custo Horário de Equipamentos =>",null,null,null,15858.876]
["B","Código","Banco","Mão de Obra","Quantidade","Salário Hora",null,null,null,"Custo Horário"]
["Insumo","P9949","SICRO3","Topógrafo",6,null,null,null,8451.7703000000001,50710.621800000001]
["Insumo","P9950","SICRO3","Auxiliar de topografia",6,null,null,null,5505.1570000000002,33030.942000000003]
[{"$nulls":5},"Custo Horário da Mão de Obra =>",null,null,null,83741.563800000004]
[{"$nulls":5},"Custo Horário de Execução =>",null,null,null,99600.439799999993]
[{"$nulls":5},"Fator de Influencia da Chuva - FIC =>",null,null,null,0]
[{"$nulls":5},"Custo do FIC =>",null,null,null,0]
[{"$nulls":5},"Produção de Equipe =>",null,null,null,1]
[{"$nulls":5},"Custo Unitário de Execução =>",null,null,null,99600.439799999993]
[]
[]
[]
[null,"Código","Banco","Descrição","Tipo",null,"Und","Quant.","Valor Unit","Total"]
["Composição"," 006 Codevasf ","Próprio","EQUIPES ASSOCIADAS EXCLUSIVAMENTE À EXECUÇÃO DOS SERVIÇOS EM CAMPO OU SETOR DE MEDICINA E SEGURANÇA DO TRABALHO (PARCELA VINCULADA)\t\t\t\t\t\t\t","PAVI - PAVIMENTAÇÃO",null,"CJ",1,205061.76000000001,205061.76000000001]
[{"$nulls":5},"Custo Horário de Execução =>",null,null,null,0]
[{"$nulls":5},"Fator de Influencia da Chuva - FIC =>",null,null,null,0]
[{"$nulls":5},"Custo do FIC =>",null,null,null,0]
[{"$nulls":5},"Produção de Equipe =>",null,null,null,1]
[{"$nulls":5},"Custo Unitário de Execução =>",null,null,null,0]
["D","Banco","Código","Atividades Auxiliares","Quantidade","Unidade","Preço Unitário",null,null,"Custo Horário"]
["Atividade Auxiliar","Próprio","007 Codevasf","ENCARREGADOS DE PRODUÇÃO",1,"CJ",56285.79,null,null,56285.79]
["Atividade Auxiliar","Próprio","009 Codevasf","EQUIPE DE MEDICINA E SEGURANÇA DO TRABALHO",1,"CJ",49175.53,null,null,49175.53]
["Atividade Auxiliar","Próprio","010 Codevasf","EQUIPE DE TOPOGRAFIA",1,"CJ",99600.44,null,null,99600.44]
[{"$nulls":5},"Custo Total das Atividades =>",null,null,null,205061.76000000001]
[]
[]
[]
[null,"Código","Banco","Descrição","Tipo",null,"Und","Quant.","Valor Unit","Total"]
["Composição"," 2003842 ","SICRO3","Enchimento de junta de concreto com argamassa asfáltica de densidade 1.700 kg/m³ - espessura de 1 cm","",null,"kg",1,67.08,67.08]
["B","Código","Banco","Mão de Obra","Quantidade","Salário Hora",null,null,null,"Custo Horário"]
["Insumo","P9824","SICRO3","Servente",2,null,null,null,20.652699999999999,41.305399999999999]
[{"$nulls":5},"Custo Horário da Mão de Obra =>",null,null,null,41.305399999999999]
[{"$nulls":5},"Adc.M.O. - Ferramentas (0,0%) =>",null,null,null,0]
[{"$nulls":5},"Custo Horário de Execução =>",null,null,null,41.305399999999999]
[{"$nulls":5},"Fator de Influencia da Chuva - FIC =>",null,null,null,0]
[{"$nulls":5},"Custo do FIC =>",null,null,null,0]
[{"$nulls":5},"Produção de Equipe =>",null,null,null,1]
[{"$nulls":5},"Custo Unitário de Execução =>",null,null,null,41.305399999999999]
["C","Banco","Código","Material","Quantidade","Unidade","Preço Unitário",null,null,"Custo Horário"]
["Insumo","SICRO3","M2158","Argamassa asfáltica",1,"kg",25.741499999999998,null,null,25.741499999999998]
[{"$nulls":5},"Custo Total do Material =>",null,null,null,25.741499999999998]
["E","Banco","Insumo","Tempos Fixos","Código","Quantidade","Unidade","Preço Unitário",null,"Custo Horário"]
["Tempo Fixo","SICRO3","M2158","Carga, manobra e descarga de materiais diversos em caminhão carroceria de 15 t - carga e descarga manuais",5914655,1E-3,"t",32.229999999999997,null,3.2199999999999999E-2]
[{"$nulls":5},"Custo Total dos Tempos Fixos =>",null,null,null,3.2199999999999999E-2]
["F","Banco","Insumo","Momento de Transporte","Quantidade","Unidade","Distância Média de Transporte (DMT)",null,null,"Custo Horário"]
[{"$nulls":6},"LN","RP","P"]
["Momento de Transporte","SICRO3","M2158","Argamassa asfáltica - Caminhão carroceria com capacidade de 15 t - 188 kW",1E-3,"tkm","5914449\n0,000\nR$ 1,06","5914464\n0,000\nR$ 0,85","5914479\n0,000\nR$ 0,69",0]
[{"$nulls":5},"Custo total dos Momentos de Transportes =>",null,null,null,0]
[]
[]
[]
[null,"Código","Banco","Descrição","Tipo",null,"Und","Quant.","Valor Unit","Total"]
["Composição"," 4016096 ","SICRO3","Escavação e carga de material de jazida com escavadeira hidráulica de 1,56 m³","",null,"m³",1,1.33,1.33]
["A","Código","Banco","Equipamentos","Quantidade","Utilização",null,"Custo Operacional",null,"Custo Horário"]
[{"$nulls":5},"Operativa","Improdutiva","Operativa","Improdutiva"]
["Insumo","E9515","SICRO3","Escavadeira hidráulica sobre esteiras com caçamba com capacidade de 1,56 m³ - 118 kW",1,1,0,278.95460000000003,124.60599999999999,278.95460000000003]
[{"$nulls":5},"Custo Horário de Equipamentos =>",null,null,null,278.95460000000003]
["B","Código","Banco","Mão de Obra","Quantidade","Salário Hora",null,null,null,"Custo Horário"]
["Insumo","P9824","SICRO3","Servente",1,null,null,null,20.652699999999999,20.652699999999999]
[{"$nulls":5},"Custo Horário da Mão de Obra =>",null,null,null,20.652699999999999]
[{"$nulls":5},"Adc.M.O. - Ferramentas (0,0%) =>",null,null,null,0]
[{"$nulls":5},"Custo Horário de Execução =>",null,null,null,299.60730000000001]
[{"$nulls":5},"Fator de Influencia da Chuva - FIC =>",null,null,null,2.1399999999999999E-2]
[{"$nulls":5},"Custo do FIC =>",null,null,null,2.7900000000000001E-2]
[{"$nulls":5},"Produção de Equipe =>",null,null,null,230.19]
[{"$nulls":5},"Custo Unitário de Execução =>",null,null,null,1.3016000000000001]
[]
[]
[]
[null,"Código","Banco","Descrição","Tipo",null,"Und","Quant.","Valor Unit","Total"]
["Composição"," 4805750 ","SICRO3","Escavação manual em material de 1ª categoria na profundidade de até 1 m","",null,"m³",1,42.19,42.19]
["B","Código","Banco","Mão de Obra","Quantidade","Salário Hora",null,null,null,"Custo Horário"]
["Insumo","P9824","SICRO3","Servente",1,null,null,null,20.652699999999999,20.652699999999999]
[{"$nulls":5},"Custo Horário da Mão de Obra =>",null,null,null,20.652699999999999]
[{"$nulls":5},"Adc.M.O. - Ferramentas (0,0%) =>",null,null,null,0]
[{"$nulls":5},"Custo Horário de Execução =>",null,null,null,20.652699999999999]
[{"$nulls":5},"Fator de Influencia da Chuva - FIC =>",null,null,null,2.1399999999999999E-2]
[{"$nulls":5},"Custo do FIC =>",null,null,null,0.88560000000000005]
[{"$nulls":5},"Produção de Equipe =>",null,null,null,0.5]
[{"$nulls":5},"Custo Unitário de Execução =>",null,null,null,41.305399999999999]
[]
[]
[]
[null,"Código","Banco","Descrição","Tipo",null,"Und","Quant.","Valor Unit","Total"]
["Composição"," 4805750 ","SICRO3","Escavação manual em material de 1ª categoria na profundidade de até 1 m","",null,"m³",1,42.19,42.19]
["B","Código","Banco","Mão de Obra","Quantidade","Salário Hora",null,null,null,"Custo Horário"]
["Insumo","P9824","SICRO3","Servente",1,null,null,null,20.652699999999999,20.652699999999999]
[{"$nulls":5},"Custo Horário da Mão de Obra =>",null,null,null,20.652699999999999]
[{"$nulls":5},"Adc.M.O. - Ferramentas (0,0%) =>",null,null,null,0]
[{"$nulls":5},"Custo Horário de Execução =>",null,null,null,20.652699999999999]
[{"$nulls":5},"Fator de Influencia da Chuva - FIC =>",null,null,null,2.1399999999999999E-2]
[{"$nulls":5},"Custo do FIC =>",null,null,null,0.88560000000000005]
[{"$nulls":5},"Produção de Equipe =>",null,null,null,0.5]
[{"$nulls":5},"Custo Unitário de Execução =>",null,null,null,41.305399999999999]
[]
[]
[]
[null,"Código","Banco","Descrição","Tipo",null,"Und","Quant.","Valor Unit","Total"]
["Composição"," 015 Codevasf ","Próprio","FRENTE DE SERVIÇOS DE DRENAGEM ","PAVI - PAVIMENTAÇÃO",null,"CJ",1,11708.03,11708.03]
["B","Código","Banco","Mão de Obra","Quantidade","Salário Hora",null,null,null,"Custo Horário"]
["Insumo","P9875","SICRO3","Encarregado de turma",1.6,null,null,null,5107.7035999999998,8172.3257999999996]
["Insumo","P9804","SICRO3","Apontador",0.8,null,null,null,4419.6270000000004,3535.7015999999999]
[{"$nulls":5},"Custo Horário da Mão de Obra =>",null,null,null,11708.027400000001]
[{"$nulls":5},"Custo Horário de Execução =>",null,null,null,11708.027400000001]
[{"$nulls":5},"Fator de Influencia da Chuva - FIC =>",null,null,null,0]
[{"$nulls":5},"Custo do FIC =>",null,null,null,0]
[{"$nulls":5},"Produção de Equipe =>",null,null,null,1]
[{"$nulls":5},"Custo Unitário de Execução =>",null,null,null,11708.027400000001]
[]
[]
[]
[null,"Código","Banco","Descrição","Tipo",null,"Und","Quant.","Valor Unit","Total"]
["Composição"," 013 Codevasf ","Próprio","FRENTE DE SERVIÇOS DE PAVIMENTAÇÃO","PAVI - PAVIMENTAÇÃO",null,"CJ",1,23635.58,23635.58]
["B","Código","Banco","Mão de Obra","Quantidade","Salário Hora",null,null,null,"Custo Horário"]
["Insumo","P9875","SICRO3","Encarregado de turma",3.23,null,null,null,5107.7035999999998,16497.882600000001]
["Insumo","P9804","SICRO3","Apontador",1.615,null,null,null,4419.6270000000004,7137.6976000000004]
[{"$nulls":5},"Custo Horário da Mão de Obra =>",null,null,null,23635.5802]
[{"$nulls":5},"Custo Horário de Execução =>",null,null,null,23635.5802]
[{"$nulls":5},"Fator de Influencia da Chuva - FIC =>",null,null,null,0]
[{"$nulls":5},"Custo do FIC =>",null,null,null,0]
[{"$nulls":5},"Produção de Equipe =>",null,null,null,1]
[{"$nulls":5},"Custo Unitário de Execução =>",null,null,null,23635.5802]
[]
[]
[]
[null,"Código","Banco","Descrição","Tipo",null,"Und","Quant.","Valor Unit","Total"]
["Composição"," 014 Codevasf ","Próprio","FRENTE DE SERVIÇOS DE SINALIZAÇÃO ","PAVI - PAVIMENTAÇÃO",null,"CJ",1,1024.45,1024.45]
["B","Código","Banco","Mão de Obra","Quantidade","Salário Hora",null,null,null,"Custo Horário"]
["Insumo","P9875","SICRO3","Encarregado de turma",0.14000000000000001,null,null,null,5107.7035999999998,715.07849999999996]
["Insumo","P9804","SICRO3","Apontador",7.0000000000000007E-2,null,null,null,4419.6270000000004,309.37389999999999]
[{"$nulls":5},"Custo Horário da Mão de Obra =>",null,null,null,1024.4523999999999]
[{"$nulls":5},"Custo Horário de Execução =>",null,null,null,1024.4523999999999]
[{"$nulls":5},"Fator de Influencia da Chuva - FIC =>",null,null,null,0]
[{"$nulls":5},"Custo do FIC =>",null,null,null,0]
[{"$nulls":5},"Produção de Equipe =>",null,null,null,1]
[{"$nulls":5},"Custo Unitário de Execução =>",null,null,null,1024.4523999999999]
[]
[]
[]
[null,"Código","Banco","Descrição","Tipo",null,"Und","Quant.","Valor Unit","Total"]
["Composição"," 3103302 ","SICRO3","Fôrmas de tábuas de pinho para dispositivos de drenagem - utilização de 3 vezes - confecção, instalação e retirada","",null,"m²",1,76.78,76.78]
["A","Código","Banco","Equipamentos","Quantidade","Utilização",null,"Custo Operacional",null,"Custo Horário"]
[{"$nulls":5},"Operativa","Improdutiva","Operativa","Improdutiva"]
["Insumo","E9066","SICRO3","Grupo gerador - 14 kVA",9.3719999999999998E-2,1,0,17.817399999999999,4.6128999999999998,1.6698]
["Insumo","E9535","SICRO3","Serra circular com bancada - D = 30 cm - 4 kW",9.3719999999999998E-2,1,0,23.985700000000001,23.6309,2.2479]
[{"$nulls":5},"Custo Horário de Equipamentos =>",null,null,null,3.9177]
["B","Código","Banco","Mão de Obra","Quantidade","Salário Hora",null,null,null,"Custo Horário"]
["Insumo","P9801","SICRO3","Ajudante",0.9,null,null,null,20.668099999999999,18.601299999999998]
["Insumo","P9808","SICRO3","Carpinteiro",0.9,null,null,null,25.6448,23.080300000000001]
[{"$nulls":5},"Custo Horário da Mão de Obra =>",null,null,null,41.681600000000003]
[{"$nulls":5},"Adc.M.O. - Ferramentas (0,0%) =>",null,null,null,0]
[{"$nulls":5},"Custo Horário de Execução =>",null,null,null,45.599299999999999]
[{"$nulls":5},"Fator de Influencia da Chuva - FIC =>",null,null,null,0]
[{"$nulls":5},"Custo do FIC =>",null,null,null,0]
[{"$nulls":5},"Produção de Equipe =>",null,null,null,1]
[{"$nulls":5},"Custo Unitário de Execução =>",null,null,null,45.599299999999999]
["C","Banco","Código","Material","Quantidade","Unidade","Preço Unitário",null,null,"Custo Horário"]
["Insumo","SICRO3","M0560","Desmoldante para fôrmas de madeira",1.8519999999999998E-2,"l",12.788600000000001,null,null,0.23680000000000001]
["Insumo","SICRO3","M1205","Prego de ferro",2.3650000000000001E-2,"kg",15.58,null,null,0.36849999999999999]
["Insumo","SICRO3","M0290","Tábua - E = 2,5 cm e L = 10 cm",1.21489,"m",5.6853999999999996,null,null,6.9070999999999998]
["Insumo","SICRO3","M1429","Tábua de pinho de terceira - E = 2,5 cm",0.40429999999999999,"m²",57.481099999999998,null,null,23.239599999999999]
[{"$nulls":5},"Custo Total do Material =>",null,null,null,30.751999999999999]
["E","Banco","Insumo","Tempos Fixos","Código","Quantidade","Unidade","Preço Unitário",null,"Custo Horário"]
["Tempo Fixo","SICRO3","M0560","Carga, manobra e descarga de materiais diversos em caminhão carroceria de 15 t - carga e descarga manuais",5914655,2.0000000000000002E-5,"t",32.229999999999997,null,5.9999999999999995E-4]
["Tempo Fixo","SICRO3","M1205","Carga, manobra e descarga de materiais diversos em caminhão carroceria de 15 t - carga e descarga manuais",5914655,2.0000000000000002E-5,"t",32.229999999999997,null,5.9999999999999995E-4]
["Tempo Fixo","SICRO3","M0290","Carga, manobra e descarga de materiais diversos em caminhão carroceria de 15 t - carga e descarga manuais",5914655,3.0400000000000002E-3,"t",32.229999999999997,null,9.8000000000000004E-2]
["Tempo Fixo","SICRO3","M1429","Carga, manobra e descarga de materiais diversos em caminhão carroceria de 15 t - carga e descarga manuais",5914655,1.0109999999999999E-2,"t",32.229999999999997,null,0.32579999999999998]
[{"$nulls":5},"Custo Total dos Tempos Fixos =>",null,null,null,0.42499999999999999]
["F","Banco","Insumo","Momento de Transporte","Quantidade","Unidade","Distância Média de Transporte (DMT)",null,null,"Custo Horário"]
[{"$nulls":6},"LN","RP","P"]
["Momento de Transporte","SICRO3","M0560","Desmoldante para fôrmas de madeira - Caminhão carroceria com capacidade de 15 t - 188 kW",2.0000000000000002E-5,"tkm","5914449\n0,000\nR$ 1,06","5914464\n0,000\nR$ 0,85","5914479\n0,000\nR$ 0,69",0]
["Momento de Transporte","SICRO3","M1205","Prego de ferro - Caminhão carroceria com capacidade de 15 t - 188 kW",2.0000000000000002E-5,"tkm","5914449\n0,000\nR$ 1,06","5914464\n0,000\nR$ 0,85","5914479\n0,000\nR$ 0,69",0]
["Momento de Transporte","SICRO3","M0290","Tábua - E = 2,5 cm e L = 10 cm - Caminhão carroceria com capacidade de 15 t - 188 kW",3.0400000000000002E-3,"tkm","5914449\n0,000\nR$ 1,06","5914464\n0,000\nR$ 0,85","5914479\n0,000\nR$ 0,69",0]
["Momento de Transporte","SICRO3","M1429","Tábua de pinho de terceira - E = 2,5 cm - Caminhão carroceria com capacidade de 15 t - 188 kW",1.0109999999999999E-2,"tkm","5914449\n0,000\nR$ 1,06","5914464\n0,000\nR$ 0,85","5914479\n0,000\nR$ 0,69",0]
[{"$nulls":5},"Custo total dos Momentos de Transportes =>",null,null,null,0]
[]
[]
[]
[null,"Código","Banco","Descrição","Tipo",null,"Und","Quant.","Valor Unit","Total"]
["Composição"," 001 Codevasf ","Próprio","GERENCIAMENTO DA OBRA, DOS CANTEIROS E DOS ACAMPAMENTOS (PARCELA FIXA)\t \t\t","PAVI - PAVIMENTAÇÃO",null,"CJ",1,601581.63,601581.63]
[{"$nulls":5},"Custo Horário de Execução =>",null,null,null,0]
[{"$nulls":5},"Fator de Influencia da Chuva - FIC =>",null,null,null,0]
[{"$nulls":5},"Custo do FIC =>",null,null,null,0]
[{"$nulls":5},"Produção de Equipe =>",null,null,null,1]
[{"$nulls":5},"Custo Unitário de Execução =>",null,null,null,0]
["D","Banco","Código","Atividades Auxiliares","Quantidade","Unidade","Preço Unitário",null,null,"Custo Horário"]
["Atividade Auxiliar","Próprio","002 Codevasf","GERÊNCIA TÉCNICA GERAL",1,"CJ",309610.96999999997,null,null,309610.96999999997]
["Atividade Auxiliar","Próprio","003 Codevasf","GERÊNCIA TÉCNICA AUXILIAR",1,"CJ",153874.75,null,null,153874.75]
["Atividade Auxiliar","Próprio","004 Codevasf","GERÊNCIA ADMINISTRATIVA GERAL",1,"CJ",108712.11,null,null,108712.11]
["Atividade Auxiliar","Próprio","005 Codevasf","GERÊNCIA ADMINISTRATIVA AUXILIAR",1,"CJ",29383.8,null,null,29383.8]
[{"$nulls":5},"Custo Total das Atividades =>",null,null,null,601581.63]
[]
[]
[]
[null,"Código","Banco","Descrição","Tipo",null,"Und","Quant.","Valor Unit","Total"]
["Composição"," 005 Codevasf ","Próprio","GERÊNCIA ADMINISTRATIVA AUXILIAR","PAVI - PAVIMENTAÇÃO",null,"CJ",1,29383.8,29383.8]
["B","Código","Banco","Mão de Obra","Quantidade","Salário Hora",null,null,null,"Custo Horário"]
["Insumo","P9806","SICRO3","Auxiliar administrativo",7,null,null,null,4197.6863999999996,29383.804800000002]
[{"$nulls":5},"Custo Horário da Mão de Obra =>",null,null,null,29383.804800000002]
[{"$nulls":5},"Custo Horário de Execução =>",null,null,null,29383.804800000002]
[{"$nulls":5},"Fator de Influencia da Chuva - FIC =>",null,null,null,0]
[{"$nulls":5},"Custo do FIC =>",null,null,null,0]
[{"$nulls":5},"Produção de Equipe =>",null,null,null,1]
[{"$nulls":5},"Custo Unitário de Execução =>",null,null,null,29383.804800000002]
[]
[]
[]
[null,"Código","Banco","Descrição","Tipo",null,"Und","Quant.","Valor Unit","Total"]
["Composição"," 004 Codevasf ","Próprio","GERÊNCIA ADMINISTRATIVA GERAL","PAVI - PAVIMENTAÇÃO",null,"CJ",1,108712.11,108712.11]
["B","Código","Banco","Mão de Obra","Quantidade","Salário Hora",null,null,null,"Custo Horário"]
["Insumo","P9883","SICRO3","Chefe do setor administrativo",7,null,null,null,7765.2767999999996,54356.937599999997]
["Insumo","P9809","SICRO3","Encarregado administrativo",7,null,null,null,7765.0249000000003,54355.174299999999]
[{"$nulls":5},"Custo Horário da Mão de Obra =>",null,null,null,108712.1119]
[{"$nulls":5},"Custo Horário de Execução =>",null,null,null,108712.1119]
[{"$nulls":5},"Fator de Influencia da Chuva - FIC =>",null,null,null,0]
[{"$nulls":5},"Custo do FIC =>",null,null,null,0]
[{"$nulls":5},"Produção de Equipe =>",null,null,null,1]
[{"$nulls":5},"Custo Unitário de Execução =>",null,null,null,108712.1119]
[]
[]
[]
[null,"Código","Banco","Descrição","Tipo",null,"Und","Quant.","Valor Unit","Total"]
["Composição"," 003 Codevasf ","Próprio","GERÊNCIA TÉCNICA AUXILIAR","PAVI - PAVIMENTAÇÃO",null,"CJ",1,153874.75,153874.75]
["B","Código","Banco","Mão de Obra","Quantidade","Salário Hora",null,null,null,"Custo Horário"]
["Insumo","P9946","SICRO3","Engenheiro auxiliar",7,null,null,null,21982.107,153874.74900000001]
[{"$nulls":5},"Custo Horário da Mão de Obra =>",null,null,null,153874.74900000001]
[{"$nulls":5},"Custo Horário de Execução =>",null,null,null,153874.74900000001]
[{"$nulls":5},"Fator de Influencia da Chuva - FIC =>",null,null,null,0]
[{"$nulls":5},"Custo do FIC =>",null,null,null,0]
[{"$nulls":5},"Produção de Equipe =>",null,null,null,1]
[{"$nulls":5},"Custo Unitário de Execução =>",null,null,null,153874.74900000001]
[]
[]
[]
[null,"Código","Banco","Descrição","Tipo",null,"Und","Quant.","Valor Unit","Total"]
["Composição"," 002 Codevasf ","Próprio","GERÊNCIA TÉCNICA GERAL","PAVI - PAVIMENTAÇÃO",null,"CJ",1,309610.96999999997,309610.96999999997]
["A","Código","Banco","Equipamentos","Quantidade","Utilização",null,"Custo Operacional",null,"Custo Horário"]
[{"$nulls":5},"Operativa","Improdutiva","Operativa","Improdutiva"]
["Insumo","E9093","SICRO3","Veículo leve - 53 kW (sem motorista)",1540,0.2,0.8,35.639099999999999,6.1081000000000003,18502.022000000001]
["Insumo","E9134","SICRO3","Miniônibus com capacidade para 30 passageiros - 111 kW",1540,0.2,0.8,218.8767,69.430800000000005,152952.76920000001]
[{"$nulls":5},"Custo Horário de Equipamentos =>",null,null,null,171454.79120000001]
["B","Código","Banco","Mão de Obra","Quantidade","Salário Hora",null,null,null,"Custo Horário"]
["Insumo","P9955","SICRO3","Engenheiro chefe",3.5,null,null,null,30052.9329,105185.26519999999]
["Insumo","P9840","SICRO3","Encarregado geral",3.5,null,null,null,9420.2612000000008,32970.914199999999]
[{"$nulls":5},"Custo Horário da Mão de Obra =>",null,null,null,138156.17939999999]
[{"$nulls":5},"Custo Horário de Execução =>",null,null,null,309610.9706]
[{"$nulls":5},"Fator de Influencia da Chuva - FIC =>",null,null,null,0]
[{"$nulls":5},"Custo do FIC =>",null,null,null,0]
[{"$nulls":5},"Produção de Equipe =>",null,null,null,1]
[{"$nulls":5},"Custo Unitário de Execução =>",null,null,null,309610.9706]
[]
[]
[]
[null,"Código","Banco","Descrição","Tipo",null,"Und","Quant.","Valor Unit","Total"]
["Composição"," 88310 ","SINAPI","PINTOR COM ENCARGOS COMPLEMENTARES","SEDI - SERVIÇOS DIVERSOS",null,"H",1,27.65,27.65]
["Composição Auxiliar"," 95372 ","SINAPI","CURSO DE CAPACITAÇÃO PARA PINTOR (ENCARGOS COMPLEMENTARES) - HORISTA","SEDI - SERVIÇOS DIVERSOS",null,"H",1,0.32,0.32]
["Insumo"," 00004783 ","SINAPI","PINTOR (HORISTA)","Mão de Obra",null,"H",1,19.12,19.12]
["Insumo"," 00037370 ","SINAPI","ALIMENTACAO - HORISTA (COLETADO CAIXA - ENCARGOS COMPLEMENTARES)","Material",null,"H",1,2.39,2.39]
["Insumo"," 00037371 ","SINAPI","TRANSPORTE - HORISTA (COLETADO CAIXA - ENCARGOS COMPLEMENTARES)","Material",null,"H",1,0.74,0.74]
["Insumo"," 00037372 ","SINAPI","EXAMES - HORISTA (COLETADO CAIXA - ENCARGOS COMPLEMENTARES)","Material",null,"H",1,1.34,1.34]
["Insumo"," 00037373 ","SINAPI","SEGURO - HORISTA (COLETADO CAIXA - ENCARGOS COMPLEMENTARES)","Material",null,"H",1,0.04,0.04]
["Insumo"," 00043466 ","SINAPI","FERRAMENTAS - FAMILIA PINTOR - HORISTA (ENCARGOS COMPLEMENTARES - COLETADO CAIXA)","Material",null,"H",1,1.97,1.97]
["Insumo"," 00043490 ","SINAPI","EPI - FAMILIA PINTOR - HORISTA (ENCARGOS COMPLEMENTARES - COLETADO CAIXA)","Material",null,"H",1,1.73,1.73]
[]
[]
[]
[null,"Código","Banco","Descrição","Tipo",null,"Und","Quant.","Valor Unit","Total"]
["Composição"," 102234 ","SINAPI","PINTURA IMUNIZANTE PARA MADEIRA, 2 DEMÃOS. AF_01/2021","PINT - PINTURAS",null,"m²",1,25.92,25.92]
["Composição Auxiliar"," 88310 ","SINAPI","PINTOR COM ENCARGOS COMPLEMENTARES","SEDI - SERVIÇOS DIVERSOS",null,"H",0.45290000000000002,27.65,12.52]
["Insumo"," 00007340 ","SINAPI","IMUNIZANTE PARA MADEIRA, INCOLOR","Material",null,"L",0.32569999999999999,41.15,13.4]
[]
[]
[]
[null,"Código","Banco","Descrição","Tipo",null,"Und","Quant.","Valor Unit","Total"]
["Composição"," 91278 ","SINAPI","PLACA VIBRATÓRIA REVERSÍVEL COM MOTOR 4 TEMPOS A GASOLINA, FORÇA CENTRÍFUGA DE 25 KN (2500 KGF), POTÊNCIA 5,5 CV - CHI DIURNO. AF_08/2015","CHOR - CUSTOS HORÁRIOS DE MÁQUINAS E EQUIPAMENTOS",null,"CHI",1,0.71,0.71]
["Composição Auxiliar"," 91273 ","SINAPI","PLACA VIBRATÓRIA REVERSÍVEL COM MOTOR 4 TEMPOS A GASOLINA, FORÇA CENTRÍFUGA DE 25 KN (2500 KGF), POTÊNCIA 5,5 CV - DEPRECIAÇÃO. AF_08/2015","CHOR - CUSTOS HORÁRIOS DE MÁQUINAS E EQUIPAMENTOS",null,"H",1,0.56000000000000005,0.56000000000000005]
["Composição Auxiliar"," 91274 ","SINAPI","PLACA VIBRATÓRIA REVERSÍVEL COM MOTOR 4 TEMPOS A GASOLINA, FORÇA CENTRÍFUGA DE 25 KN (2500 KGF), POTÊNCIA 5,5 CV - JUROS. AF_08/2015","CHOR - CUSTOS HORÁRIOS DE MÁQUINAS E EQUIPAMENTOS",null,"H",1,0.15,0.15]
[]
[]
[]
[null,"Código","Banco","Descrição","Tipo",null,"Und","Quant.","Valor Unit","Total"]
["Composição"," 91277 ","SINAPI","PLACA VIBRATÓRIA REVERSÍVEL COM MOTOR 4 TEMPOS A GASOLINA, FORÇA CENTRÍFUGA DE 25 KN (2500 KGF), POTÊNCIA 5,5 CV - CHP DIURNO. AF_08/2015","CHOR - CUSTOS HORÁRIOS DE MÁQUINAS E EQUIPAMENTOS",null,"CHP",1,10.48,10.48]
["Composição Auxiliar"," 91273 ","SINAPI","PLACA VIBRATÓRIA REVERSÍVEL COM MOTOR 4 TEMPOS A GASOLINA, FORÇA CENTRÍFUGA DE 25 KN (2500 KGF), POTÊNCIA 5,5 CV - DEPRECIAÇÃO. AF_08/2015","CHOR - CUSTOS HORÁRIOS DE MÁQUINAS E EQUIPAMENTOS",null,"H",1,0.56000000000000005,0.56000000000000005]
["Composição Auxiliar"," 91274 ","SINAPI","PLACA VIBRATÓRIA REVERSÍVEL COM MOTOR 4 TEMPOS A GASOLINA, FORÇA CENTRÍFUGA DE 25 KN (2500 KGF), POTÊNCIA 5,5 CV - JUROS. AF_08/2015","CHOR - CUSTOS HORÁRIOS DE MÁQUINAS E EQUIPAMENTOS",null,"H",1,0.15,0.15]
["Composição Auxiliar"," 91275 ","SINAPI","PLACA VIBRATÓRIA REVERSÍVEL COM MOTOR 4 TEMPOS A GASOLINA, FORÇA CENTRÍFUGA DE 25 KN (2500 KGF), POTÊNCIA 5,5 CV - MANUTENÇÃO. AF_08/2015","CHOR - CUSTOS HORÁRIOS DE MÁQUINAS E EQUIPAMENTOS",null,"H",1,0.7,0.7]
["Composição Auxiliar"," 91276 ","SINAPI","PLACA VIBRATÓRIA REVERSÍVEL COM MOTOR 4 TEMPOS A GASOLINA, FORÇA CENTRÍFUGA DE 25 KN (2500 KGF), POTÊNCIA 5,5 CV - MATERIAIS NA OPERAÇÃO. AF_08/2015","CHOR - CUSTOS HORÁRIOS DE MÁQUINAS E EQUIPAMENTOS",null,"H",1,9.07,9.07]
[]
[]
[]
[null,"Código","Banco","Descrição","Tipo",null,"Und","Quant.","Valor Unit","Total"]
["Composição"," 91273 ","SINAPI","PLACA VIBRATÓRIA REVERSÍVEL COM MOTOR 4 TEMPOS A GASOLINA, FORÇA CENTRÍFUGA DE 25 KN (2500 KGF), POTÊNCIA 5,5 CV - DEPRECIAÇÃO. AF_08/2015","CHOR - CUSTOS HORÁRIOS DE MÁQUINAS E EQUIPAMENTOS",null,"H",1,0.56000000000000005,0.56000000000000005]
["Insumo"," 00001442 ","SINAPI","COMPACTADOR DE SOLO TIPO PLACA VIBRATORIA REVERSIVEL, A GASOLINA 4 TEMPOS, PESO 125 A 150 KG, FORCA CENTRIF. 2500 A 2800 KGF, LARG. TRABALHO 400 A 450 MM, FREQ. VIBRACAO 4300 A 4500 RPM, VELOC. TRABALHO 15 A 20 M/MIN, POT. 5,5 A 6,0 HP","Equipamento para Aquisição Permanente",null,"UN",5.3300000000000001E-5,10512.92,0.56000000000000005]
[]
[]
[]
[null,"Código","Banco","Descrição","Tipo",null,"Und","Quant.","Valor Unit","Total"]
["Composição"," 91274 ","SINAPI","PLACA VIBRATÓRIA REVERSÍVEL COM MOTOR 4 TEMPOS A GASOLINA, FORÇA CENTRÍFUGA DE 25 KN (2500 KGF), POTÊNCIA 5,5 CV - JUROS. AF_08/2015","CHOR - CUSTOS HORÁRIOS DE MÁQUINAS E EQUIPAMENTOS",null,"H",1,0.15,0.15]
["Insumo"," 00001442 ","SINAPI","COMPACTADOR DE SOLO TIPO PLACA VIBRATORIA REVERSIVEL, A GASOLINA 4 TEMPOS, PESO 125 A 150 KG, FORCA CENTRIF. 2500 A 2800 KGF, LARG. TRABALHO 400 A 450 MM, FREQ. VIBRACAO 4300 A 4500 RPM, VELOC. TRABALHO 15 A 20 M/MIN, POT. 5,5 A 6,0 HP","Equipamento para Aquisição Permanente",null,"UN",1.43E-5,10512.92,0.15]
[]
[]
[]
[null,"Código","Banco","Descrição","Tipo",null,"Und","Quant.","Valor Unit","Total"]
["Composição"," 91275 ","SINAPI","PLACA VIBRATÓRIA REVERSÍVEL COM MOTOR 4 TEMPOS A GASOLINA, FORÇA CENTRÍFUGA DE 25 KN (2500 KGF), POTÊNCIA 5,5 CV - MANUTENÇÃO. AF_08/2015","CHOR - CUSTOS HORÁRIOS DE MÁQUINAS E EQUIPAMENTOS",null,"H",1,0.7,0.7]
["Insumo"," 00001442 ","SINAPI","COMPACTADOR DE SOLO TIPO PLACA VIBRATORIA REVERSIVEL, A GASOLINA 4 TEMPOS, PESO 125 A 150 KG, FORCA CENTRIF. 2500 A 2800 KGF, LARG. TRABALHO 400 A 450 MM, FREQ. VIBRACAO 4300 A 4500 RPM, VELOC. TRABALHO 15 A 20 M/MIN, POT. 5,5 A 6,0 HP","Equipamento para Aquisição Permanente",null,"UN",6.6699999999999995E-5,10512.92,0.7]
[]
[]
[]
[null,"Código","Banco","Descrição","Tipo",null,"Und","Quant.","Valor Unit","Total"]
["Composição"," 91276 ","SINAPI","PLACA VIBRATÓRIA REVERSÍVEL COM MOTOR 4 TEMPOS A GASOLINA, FORÇA CENTRÍFUGA DE 25 KN (2500 KGF), POTÊNCIA 5,5 CV - MATERIAIS NA OPERAÇÃO. AF_08/2015","CHOR - CUSTOS HORÁRIOS DE MÁQUINAS E EQUIPAMENTOS",null,"H",1,9.07,9.07]
["Insumo"," 00004222 ","SINAPI","GASOLINA COMUM","Material",null,"L",1.44,6.3,9.07]
[]
[]
[]
[null,"Código","Banco","Descrição","Tipo",null,"Und","Quant.","Valor Unit","Total"]
["Composição"," 5212552 ","SICRO3","Pintura eletrostática a pó com tinta poliéster em chapa de aço","",null,"m²",1,16.28,16.28]
["A","Código","Banco","Equipamentos","Quantidade","Utilização",null,"Custo Operacional",null,"Custo Horário"]
[{"$nulls":5},"Operativa","Improdutiva","Operativa","Improdutiva"]
["Insumo","E9076","SICRO3","Equipamento para pintura eletrostática com cabine dupla de 7,00 kW e estufa de 80.000 kCal",1,1,0,42.122999999999998,36.274700000000003,42.122999999999998]
["Insumo","E9753","SICRO3","Grupo gerador - 23 kVA",1,1,0,26.039899999999999,5.5092999999999996,26.039899999999999]
[{"$nulls":5},"Custo Horário de Equipamentos =>",null,null,null,68.162899999999993]
["B","Código","Banco","Mão de Obra","Quantidade","Salário Hora",null,null,null,"Custo Horário"]
["Insumo","P9801","SICRO3","Ajudante",1,null,null,null,20.668099999999999,20.668099999999999]
["Insumo","P9822","SICRO3","Pintor",2,null,null,null,29.9053,59.810600000000001]
[{"$nulls":5},"Custo Horário da Mão de Obra =>",null,null,null,80.478700000000003]
[{"$nulls":5},"Adc.M.O. - Ferramentas (0,0%) =>",null,null,null,0]
[{"$nulls":5},"Custo Horário de Execução =>",null,null,null,148.64160000000001]
[{"$nulls":5},"Fator de Influencia da Chuva - FIC =>",null,null,null,0]
[{"$nulls":5},"Custo do FIC =>",null,null,null,0]
[{"$nulls":5},"Produção de Equipe =>",null,null,null,19.149999999999999]
[{"$nulls":5},"Custo Unitário de Execução =>",null,null,null,7.7619999999999996]
["C","Banco","Código","Material","Quantidade","Unidade","Preço Unitário",null,null,"Custo Horário"]
["Insumo","SICRO3","M3153","Tinta em pó à base de resina poliéster",0.112,"kg",76.045699999999997,null,null,8.5170999999999992]
[{"$nulls":5},"Custo Total do Material =>",null,null,null,8.5170999999999992]
["E","Banco","Insumo","Tempos Fixos","Código","Quantidade","Unidade","Preço Unitário",null,"Custo Horário"]
["Tempo Fixo","SICRO3","M3153","Carga, manobra e descarga de materiais diversos em caminhão carroceria de 15 t - carga e descarga manuais",5914655,1.1E-4,"t",32.229999999999997,null,3.5000000000000001E-3]
[{"$nulls":5},"Custo Total dos Tempos Fixos =>",null,null,null,3.5000000000000001E-3]
["F","Banco","Insumo","Momento de Transporte","Quantidade","Unidade","Distância Média de Transporte (DMT)",null,null,"Custo Horário"]
[{"$nulls":6},"LN","RP","P"]
["Momento de Transporte","SICRO3","M3153","Tinta em pó à base de resina poliéster - Caminhão carroceria com capacidade de 15 t - 188 kW",1.1E-4,"tkm","5914449\n0,000\nR$ 1,06","5914464\n0,000\nR$ 0,85","5914479\n0,000\nR$ 0,69",0]
[{"$nulls":5},"Custo total dos Momentos de Transportes =>",null,null,null,0]
[]
[]
[]
[null,"Código","Banco","Descrição","Tipo",null,"Und","Quant.","Valor Unit","Total"]
["Composição"," 5213414 ","SICRO3","Placa em aço nº 16 galvanizado com película retrorrefletiva tipo I + SI - confecção","",null,"m²",1,556.41,556.41]
["A","Código","Banco","Equipamentos","Quantidade","Utilização",null,"Custo Operacional",null,"Custo Horário"]
[{"$nulls":5},"Operativa","Improdutiva","Operativa","Improdutiva"]
["Insumo","E9568","SICRO3","Furadeira de impacto de 12,5 mm - 0,80 kW",0.15060000000000001,1,0,0.20549999999999999,0.1363,3.09E-2]
["Insumo","E9753","SICRO3","Grupo gerador - 23 kVA",0.48193000000000003,1,0,26.039899999999999,5.5092999999999996,12.5494]
["Insumo","E9623","SICRO3","Máquina de bancada guilhotina - 4,00 kW",0.20080000000000001,1,0,14.9892,9.5280000000000005,3.0097999999999998]
["Insumo","E9622","SICRO3","Máquina de bancada universal para corte de chapa - 1,50 kW",0.48193000000000003,1,0,12.3794,7.8691000000000004,5.9660000000000002]
[{"$nulls":5},"Custo Horário de Equipamentos =>",null,null,null,21.556100000000001]
["B","Código","Banco","Mão de Obra","Quantidade","Salário Hora",null,null,null,"Custo Horário"]
["Insumo","P9801","SICRO3","Ajudante",2,null,null,null,20.668099999999999,41.336199999999998]
["Insumo","P9830","SICRO3","Montador",1,null,null,null,30.709900000000001,30.709900000000001]
["Insumo","P9823","SICRO3","Serralheiro",1,null,null,null,27.748899999999999,27.748899999999999]
["Insumo","P9824","SICRO3","Servente",2,null,null,null,20.652699999999999,41.305399999999999]
[{"$nulls":5},"Custo Horário da Mão de Obra =>",null,null,null,141.10040000000001]
[{"$nulls":5},"Adc.M.O. - Ferramentas (0,0%) =>",null,null,null,0]
[{"$nulls":5},"Custo Horário de Execução =>",null,null,null,162.65649999999999]
[{"$nulls":5},"Fator de Influencia da Chuva - FIC =>",null,null,null,0]
[{"$nulls":5},"Custo do FIC =>",null,null,null,0]
[{"$nulls":5},"Produção de Equipe =>",null,null,null,4]
[{"$nulls":5},"Custo Unitário de Execução =>",null,null,null,40.664099999999998]
["C","Banco","Código","Material","Quantidade","Unidade","Preço Unitário",null,null,"Custo Horário"]
["Insumo","SICRO3","M1367","Chapa fina em aço galvanizado",11.775,"kg",11.680300000000001,null,null,137.53550000000001]
["Insumo","SICRO3","M3229","Película retrorrefletiva tipo I + SI (sinal impresso com película de sobreposição tipo V)",1,"m²",361.53980000000001,null,null,361.53980000000001]
[{"$nulls":5},"Custo Total do Material =>",null,null,null,499.07530000000003]
["D","Banco","Código","Atividades Auxiliares","Quantidade","Unidade","Preço Unitário",null,null,"Custo Horário"]
["Atividade Auxiliar","SICRO3",5212552,"Pintura eletrostática a pó com tinta poliéster em chapa de aço",1,"m²",16.28,null,null,16.28]
[{"$nulls":5},"Custo Total das Atividades =>",null,null,null,16.28]
["E","Banco","Insumo","Tempos Fixos","Código","Quantidade","Unidade","Preço Unitário",null,"Custo Horário"]
["Tempo Fixo","SICRO3","M1367","Carga, manobra e descarga de materiais diversos em caminhão carroceria de 15 t - carga e descarga com caminhãoguindauto de 20 t.m",5914333,1.1780000000000001E-2,"t",31.98,null,0.37669999999999998]
["Tempo Fixo","SICRO3","M3229","Carga, manobra e descarga de materiais diversos em caminhão carroceria de 15 t - carga e descarga manuais",5914655,4.4000000000000002E-4,"t",32.229999999999997,null,1.4200000000000001E-2]
[{"$nulls":5},"Custo Total dos Tempos Fixos =>",null,null,null,0.39090000000000003]
["F","Banco","Insumo","Momento de Transporte","Quantidade","Unidade","Distância Média de Transporte (DMT)",null,null,"Custo Horário"]
[{"$nulls":6},"LN","RP","P"]
["Momento de Transporte","SICRO3","M1367","Chapa fina em aço galvanizado - Caminhão carroceria com capacidade de 15 t - 188 kW",1.1780000000000001E-2,"tkm","5914449\n0,000\nR$ 1,06","5914464\n0,000\nR$ 0,85","5914479\n0,000\nR$ 0,69",0]
["Momento de Transporte","SICRO3","M3229","Película retrorrefletiva tipo I + SI (sinal impresso com película de sobreposição tipo V) - Caminhão carroceria com capacidade de 15 t - 188 kW",4.4000000000000002E-4,"tkm","5914449\n0,000\nR$ 1,06","5914464\n0,000\nR$ 0,85","5914479\n0,000\nR$ 0,69",0]
[{"$nulls":5},"Custo total dos Momentos de Transportes =>",null,null,null,0]
[]
[]
[]
[null,"Código","Banco","Descrição","Tipo",null,"Und","Quant.","Valor Unit","Total"]
["Composição"," 88316 ","SINAPI","SERVENTE COM ENCARGOS COMPLEMENTARES","SEDI - SERVIÇOS DIVERSOS",null,"H",1,20.420000000000002,20.420000000000002]
["Composição Auxiliar"," 95378 ","SINAPI","CURSO DE CAPACITAÇÃO PARA SERVENTE (ENCARGOS COMPLEMENTARES) - HORISTA","SEDI - SERVIÇOS DIVERSOS",null,"H",1,0.33,0.33]
["Insumo"," 00006111 ","SINAPI","SERVENTE DE OBRAS (HORISTA)","Mão de Obra",null,"H",1,13.64,13.64]
["Insumo"," 00037370 ","SINAPI","ALIMENTACAO - HORISTA (COLETADO CAIXA - ENCARGOS COMPLEMENTARES)","Material",null,"H",1,2.39,2.39]
["Insumo"," 00037371 ","SINAPI","TRANSPORTE - HORISTA (COLETADO CAIXA - ENCARGOS COMPLEMENTARES)","Material",null,"H",1,0.74,0.74]
["Insumo"," 00037372 ","SINAPI","EXAMES - HORISTA (COLETADO CAIXA - ENCARGOS COMPLEMENTARES)","Material",null,"H",1,1.34,1.34]
["Insumo"," 00037373 ","SINAPI","SEGURO - HORISTA (COLETADO CAIXA - ENCARGOS COMPLEMENTARES)","Material",null,"H",1,0.04,0.04]
["Insumo"," 00043467 ","SINAPI","FERRAMENTAS - FAMILIA SERVENTE - HORISTA (ENCARGOS COMPLEMENTARES - COLETADO CAIXA)","Material",null,"H",1,0.61,0.61]
["Insumo"," 00043491 ","SINAPI","EPI - FAMILIA SERVENTE - HORISTA (ENCARGOS COMPLEMENTARES - COLETADO CAIXA)","Material",null,"H",1,1.33,1.33]
[]
[]
[]
[null,"Código","Banco","Descrição","Tipo",null,"Und","Quant.","Valor Unit","Total"]
["Composição"," 5914359 ","SICRO3","Transporte com caminhão basculante de 10 m³ - rodovia em leito natural","",null,"tkm",1,1.19,1.19]
["A","Código","Banco","Equipamentos","Quantidade","Utilização",null,"Custo Operacional",null,"Custo Horário"]
[{"$nulls":5},"Operativa","Improdutiva","Operativa","Improdutiva"]
["Insumo","E9579","SICRO3","Caminhão basculante com capacidade de 10 m³ - 188 kW",1,1,0,290.12920000000003,84.182400000000001,290.12920000000003]
[{"$nulls":5},"Custo Horário de Equipamentos =>",null,null,null,290.12920000000003]
[{"$nulls":5},"Custo Horário de Execução =>",null,null,null,290.12920000000003]
[{"$nulls":5},"Fator de Influencia da Chuva - FIC =>",null,null,null,2.1399999999999999E-2]
[{"$nulls":5},"Custo do FIC =>",null,null,null,2.5000000000000001E-2]
[{"$nulls":5},"Produção de Equipe =>",null,null,null,249]
[{"$nulls":5},"Custo Unitário de Execução =>",null,null,null,1.1652]
[]
[]
[]
[null,"Código","Banco","Descrição","Tipo",null,"Und","Quant.","Valor Unit","Total"]
["Composição"," 5914374 ","SICRO3","Transporte com caminhão basculante de 10 m³ - rodovia em revestimento primário","",null,"tkm",1,0.95,0.95]
["A","Código","Banco","Equipamentos","Quantidade","Utilização",null,"Custo Operacional",null,"Custo Horário"]
[{"$nulls":5},"Operativa","Improdutiva","Operativa","Improdutiva"]
["Insumo","E9579","SICRO3","Caminhão basculante com capacidade de 10 m³ - 188 kW",1,1,0,290.12920000000003,84.182400000000001,290.12920000000003]
[{"$nulls":5},"Custo Horário de Equipamentos =>",null,null,null,290.12920000000003]
[{"$nulls":5},"Custo Horário de Execução =>",null,null,null,290.12920000000003]
[{"$nulls":5},"Fator de Influencia da Chuva - FIC =>",null,null,null,2.1399999999999999E-2]
[{"$nulls":5},"Custo do FIC =>",null,null,null,0.02]
[{"$nulls":5},"Produção de Equipe =>",null,null,null,311.25]
[{"$nulls":5},"Custo Unitário de Execução =>",null,null,null,0.93210000000000004]
[]
[]
[]
[null,"Código","Banco","Descrição","Tipo",null,"Und","Quant.","Valor Unit","Total"]
["Composição"," 5914389 ","SICRO3","Transporte com caminhão basculante de 10 m³ - rodovia pavimentada","",null,"tkm",1,0.78,0.78]
["A","Código","Banco","Equipamentos","Quantidade","Utilização",null,"Custo Operacional",null,"Custo Horário"]
[{"$nulls":5},"Operativa","Improdutiva","Operativa","Improdutiva"]
["Insumo","E9579","SICRO3","Caminhão basculante com capacidade de 10 m³ - 188 kW",1,1,0,290.12920000000003,84.182400000000001,290.12920000000003]
[{"$nulls":5},"Custo Horário de Equipamentos =>",null,null,null,290.12920000000003]
[{"$nulls":5},"Custo Horário de Execução =>",null,null,null,290.12920000000003]
[{"$nulls":5},"Fator de Influencia da Chuva - FIC =>",null,null,null,0]
[{"$nulls":5},"Custo do FIC =>",null,null,null,0]
[{"$nulls":5},"Produção de Equipe =>",null,null,null,373.5]
[{"$nulls":5},"Custo Unitário de Execução =>",null,null,null,0.77680000000000005]
[]
[]
[]
[null,"Código","Banco","Descrição","Tipo",null,"Und","Quant.","Valor Unit","Total"]
["Composição"," 5914449 ","SICRO3","Transporte com caminhão carroceria de 15 t - rodovia em leito natural","",null,"tkm",1,1.06,1.06]
["A","Código","Banco","Equipamentos","Quantidade","Utilização",null,"Custo Operacional",null,"Custo Horário"]
[{"$nulls":5},"Operativa","Improdutiva","Operativa","Improdutiva"]
["Insumo","E9592","SICRO3","Caminhão carroceria com capacidade de 15 t - 188 kW",1,1,0,257.65910000000002,75.803200000000004,257.65910000000002]
[{"$nulls":5},"Custo Horário de Equipamentos =>",null,null,null,257.65910000000002]
[{"$nulls":5},"Custo Horário de Execução =>",null,null,null,257.65910000000002]
[{"$nulls":5},"Fator de Influencia da Chuva - FIC =>",null,null,null,2.1399999999999999E-2]
[{"$nulls":5},"Custo do FIC =>",null,null,null,2.2200000000000001E-2]
[{"$nulls":5},"Produção de Equipe =>",null,null,null,248.59]
[{"$nulls":5},"Custo Unitário de Execução =>",null,null,null,1.0365]
[]
[]
[]
[null,"Código","Banco","Descrição","Tipo",null,"Und","Quant.","Valor Unit","Total"]
["Composição"," 5914464 ","SICRO3","Transporte com caminhão carroceria de 15 t - rodovia em revestimento primário","",null,"tkm",1,0.85,0.85]
["A","Código","Banco","Equipamentos","Quantidade","Utilização",null,"Custo Operacional",null,"Custo Horário"]
[{"$nulls":5},"Operativa","Improdutiva","Operativa","Improdutiva"]
["Insumo","E9592","SICRO3","Caminhão carroceria com capacidade de 15 t - 188 kW",1,1,0,257.65910000000002,75.803200000000004,257.65910000000002]
[{"$nulls":5},"Custo Horário de Equipamentos =>",null,null,null,257.65910000000002]
[{"$nulls":5},"Custo Horário de Execução =>",null,null,null,257.65910000000002]
[{"$nulls":5},"Fator de Influencia da Chuva - FIC =>",null,null,null,2.1399999999999999E-2]
[{"$nulls":5},"Custo do FIC =>",null,null,null,1.78E-2]
[{"$nulls":5},"Produção de Equipe =>",null,null,null,310.73]
[{"$nulls":5},"Custo Unitário de Execução =>",null,null,null,0.82920000000000005]
[]
[]
[]
[null,"Código","Banco","Descrição","Tipo",null,"Und","Quant.","Valor Unit","Total"]
["Composição"," 5914479 ","SICRO3","Transporte com caminhão carroceria de 15 t - rodovia pavimentada","",null,"tkm",1,0.69,0.69]
["A","Código","Banco","Equipamentos","Quantidade","Utilização",null,"Custo Operacional",null,"Custo Horário"]
[{"$nulls":5},"Operativa","Improdutiva","Operativa","Improdutiva"]
["Insumo","E9592","SICRO3","Caminhão carroceria com capacidade de 15 t - 188 kW",1,1,0,257.65910000000002,75.803200000000004,257.65910000000002]
[{"$nulls":5},"Custo Horário de Equipamentos =>",null,null,null,257.65910000000002]
[{"$nulls":5},"Custo Horário de Execução =>",null,null,null,257.65910000000002]
[{"$nulls":5},"Fator de Influencia da Chuva - FIC =>",null,null,null,0]
[{"$nulls":5},"Custo do FIC =>",null,null,null,0]
[{"$nulls":5},"Produção de Equipe =>",null,null,null,372.88]
[{"$nulls":5},"Custo Unitário de Execução =>",null,null,null,0.69099999999999995]

{"sheet":"Curva ABC de Serviços","index":12,"n_rows":33,"n_cols":10,"rows_kept":33,"cut":false,"hidden":false,"merged":[[0,4,0,6],[0,7,0,9],[1,4,1,6],[1,7,1,9],[2,0,2,9],[34,0,34,2],[35,0,35,2],[32,0,32,2],[32,5,32,6],[32,7,32,9]]}
[null,null,"Obra","Bancos","B.D.I.",null,null,"Encargos Sociais"]
[null,null,"ITEM 2 - INTERTRAVADO","SINAPI - 07/2024 - Sergipe\nSICRO3 - 04/2024 - Sergipe\nORSE - 06/2024 - Sergipe\n",{"$f":"'RESUMO MODULO TOTAL'!$J$7","v":0.23080000000000001},null,null,"Não Desonerado: embutido nos preços unitário dos insumos de mão de obra, de acordo com as bases."]
["Curva ABC de Serviços"]
["Código","Banco","Descrição","Reajustamento","Und","Quant.","Valor  Unit","Total","Peso (%)","Peso Acumulado (%)"]
[36170,"SINAPI","Bloquete/piso intertravado de concreto - modelo onda/16 faces/retangular/tijolinho/paver/holandes/paralelepipedo, *22 cm c 11 cm, e= 8 cm, resistência de 35 Mpa (NBR 9781), cor natural","Pavimentos de Concreto de Cimento Portland","m²",120480,82.68,{"$f":"VLOOKUP($A5,'RESUMO MODULO TOTAL'!$D$12:$N$48,11,FALSE)","v":9961286.4000000004},{"$f":"H5/$H$33","v":0.34077625641398945},{"$f":"I5","v":0.34077625641398945}]
[2003373,"SICRO","Meio-fio de concreto - MFC 03 - areia e brita comerciais - fôrma de madeira","Drenagem","m",48000,82.46,{"$f":"VLOOKUP($A6,'RESUMO MODULO TOTAL'!$D$12:$N$48,11,FALSE)","v":3958080},{"$f":"H6/$H$33","v":0.13540617454660106},{"$f":"I6+J5","v":0.47618243096059054}]
[5914389,"SICRO","Transporte com caminhão basculante de 10 m³ - rodovia pavimentada","Terraplenagem","tkm",3713961.69,0.96,{"$f":"VLOOKUP($A7,'RESUMO MODULO TOTAL'!$D$12:$N$48,11,FALSE)","v":3426381.95},{"$f":"H7/$H$33","v":0.11721674963240343},{"$f":"I7+J6","v":0.59339918059299401}]
[5915014,"SICRO","Transporte com caminhão carroceria com capacidade de 11 t e com guindauto de 45 t.m - rodovia pavimentada","Terraplenagem","tkm",2112000,1.67,{"$f":"VLOOKUP($A8,'RESUMO MODULO TOTAL'!$D$12:$N$48,11,FALSE)","v":3527040},0.12066026807766489,0.71405944867065885]
["CODEVASF 325","SINAPI","Execução de pavimento em piso intertravado, com bloco 16 faces de 22 x 11 cm, espessura 8 cm. af_10/2022 - exclusive fornecimento de bloquete","Pavimentos de Concreto de Cimento Portland","m²",120000,21.48,{"$f":"VLOOKUP($A9,'RESUMO MODULO TOTAL'!$D$12:$N$48,11,FALSE)","v":2577600},8.8179863850988083E-2,0.80223931252164693]
[4011233,"SICRO","Sub-base estabilizada granulometricamente com mistura solo brita (70% - 30%) na pista com material de jazida e brita comercial","Pavimentação","m³",18000,90.35,{"$f":"VLOOKUP($A10,'RESUMO MODULO TOTAL'!$D$12:$N$48,11,FALSE)","v":1626300},5.5635828903189757E-2,0.85787514142483667]
["Adm Local","Codevasf","Administração Local da Obra","Administração Local","und",1,1519136.51,{"$f":"VLOOKUP($A11,'RESUMO MODULO TOTAL'!$D$12:$N$48,11,FALSE)","v":1519136.51},5.1969758931899909E-2,0.9098449003567366]
[5915321,"SICRO","Transporte com caminhão basculante de 14 m³ - rodovia pavimentada (colchão de areia)","Terraplenagem","tkm",599400,0.76,{"$f":"'RESUMO MODULO TOTAL'!$N$26+'RESUMO MODULO TOTAL'!$N$27","v":455544},1.5584189904614571E-2,0.92542909026135112]
["Proj. Executivo","Codevasf","Projeto Executivo","Consultoria, Supervisão e Projeto","m²",120000,2.91,{"$f":"VLOOKUP($A13,'RESUMO MODULO TOTAL'!$D$12:$N$48,11,FALSE)","v":349200},1.1946154739589168E-2,0.93737524500094027]
[5502114,"SICRO","Escavação, carga e transporte de material de 1ª categoria - DMT de 1.000 a 1.200 m - caminho de serviço em leito natural -com escavadeira e caminhão basculante de 14 m³","Terraplenagem","m³",33600,9.36,{"$f":"VLOOKUP($A14,'RESUMO MODULO TOTAL'!$D$12:$N$48,11,FALSE)","v":314496},1.0758928639695976E-2,0.94813417364063624]
["Mob","Codevasf","Mobilização","Mobilização e Desmobilização","kmxfrente",1200,236.26,{"$f":"VLOOKUP($A15,'RESUMO MODULO TOTAL'!$D$12:$N$48,11,FALSE)","v":283968},9.7145637717401395E-3,0.95784873741237642]
["Mob","Codevasf","Desmobilização","Mobilização e Desmobilização","kmxfrente",1200,236.26,{"$f":"VLOOKUP($A16,'RESUMO MODULO TOTAL'!$D$12:$N$48,11,FALSE)","v":283968},9.7145637717401395E-3,0.9675633011841166]
[5914374,"SICRO","Transporte com caminhão basculante de 10 m³ - rodovia em revestimento primário","Terraplenagem","tkm",165089.13,1.1599999999999999,{"$f":"VLOOKUP($A17,'RESUMO MODULO TOTAL'!$D$12:$N$48,11,FALSE)","v":191503.39},6.5513434424281014E-3,0.97411464462654473]
[4011209,"SICRO","Regularização do subleito","Pavimentação","m²",120000,1.37,{"$f":"VLOOKUP($A18,'RESUMO MODULO TOTAL'!$D$12:$N$48,11,FALSE)","v":164400},5.6241347055797797E-3,0.9797387793321245]
[5213400,"SICRO","Pintura de faixa com tinta acrílica - espessura de 0,4 mm","Sinalização Horizontal","m²",4800,29.82,{"$f":"VLOOKUP($A19,'RESUMO MODULO TOTAL'!$D$12:$N$48,11,FALSE)","v":143136},4.896691880887271E-3,0.98463547121301176]
[5213863,"SICRO","Suporte metálico galvanizado para placa de advertência ou regulamentação - lado ou diâmetro de 0,60 m - fornecimento e implantação","Sinalização Vertical","und",144,558.03,{"$f":"VLOOKUP($A20,'RESUMO MODULO TOTAL'!$D$12:$N$48,11,FALSE)","v":80356.320000000007},2.7489949399311111E-3,0.98738446615294284]
["CODEVASF 104","Codevasf","Conserto de quebra no ramal na rua sem pavimento com fornecimento de material hidráulico","Conservação Rodoviária","m",2400,28.97,{"$f":"VLOOKUP($A21,'RESUMO MODULO TOTAL'!$D$12:$N$48,11,FALSE)","v":69528},2.3785574076006749E-3,0.98976302356054346]
[5914359,"SICRO","Transporte com caminhão basculante de 10 m³ - rodovia em leito natural","Terraplenagem","tkm",41272.28,1.46,{"$f":"VLOOKUP($A22,'RESUMO MODULO TOTAL'!$D$12:$N$48,11,FALSE)","v":60257.52},2.0614136831153753E-3,0.99182443724365887]
["Canteiro","Codevasf","Canteiro de Obras e Almoxarifado","Administração Local","frente",12,4909.72,{"$f":"VLOOKUP($A23,'RESUMO MODULO TOTAL'!$D$12:$N$48,11,FALSE)","v":58916.639999999999},2.0155420909984787E-3,0.9938399793346574]
[103689,"SINAPI","Fornecimento e instalação de placa de obra com chapa galvanizada e estrutura de madeira. af_03/2022_ps","Sinalização Vertical","m²",96,429.45,{"$f":"VLOOKUP($A24,'RESUMO MODULO TOTAL'!$D$12:$N$48,11,FALSE)","v":41227.199999999997},1.4103851966780943E-3,0.99525036453133553]
[5914479,"SICRO","Transporte com caminhão carroceria de 15 t - rodovia pavimentada","Terraplenagem","tkm",41400.769999999997,0.84,{"$f":"VLOOKUP($A25,'RESUMO MODULO TOTAL'!$D$12:$N$48,11,FALSE)","v":34776.639999999999},1.1897111190234428E-3,0.99644007565035897]
[4413942,"SICRO","Espalhamento de material em bota-fora","Terraplenagem","m³",12000,2.37,{"$f":"VLOOKUP($A26,'RESUMO MODULO TOTAL'!$D$12:$N$48,11,FALSE)","v":28440},9.7293425198715906E-4,0.99741300990234616]
[4915724,"SICRO","Caiação mecanizada com fixador de cal","Conservação Rodoviária","m²",11520,2.25,{"$f":"VLOOKUP($A27,'RESUMO MODULO TOTAL'!$D$12:$N$48,11,FALSE)","v":25920},8.8672488788703102E-4,0.99829973479023315]
[5213464,"SICRO","Placa de advertência em aço, lado de 0,60 m - película retrorrefletiva tipo I + SI - fornecimento e implantação","Sinalização Vertical","und",72,310.27999999999997,{"$f":"VLOOKUP($A28,'RESUMO MODULO TOTAL'!$D$12:$N$48,11,FALSE)","v":22340.16},7.642583283710777E-4,0.99906399311860428]
[5213440,"SICRO","Placa de regulamentação em aço D = 0,60 m - película retrorrefletiva tipo I + SI - fornecimento e implantação","Sinalização Vertical","und",72,310.24,{"$f":"VLOOKUP($A29,'RESUMO MODULO TOTAL'!$D$12:$N$48,11,FALSE)","v":22337.279999999999},7.6415980338353465E-4,0.99982815292198779]
[5914464,"SICRO","Transporte com caminhão carroceria de 15 t - rodovia em revestimento primário","Terraplenagem","tkm",3680.07,1.04,{"$f":"VLOOKUP($A30,'RESUMO MODULO TOTAL'!$D$12:$N$48,11,FALSE)","v":3827.27},1.3093115592837181E-4,0.99995908407791612]
[5914449,"SICRO","Transporte com caminhão carroceria de 15 t - rodovia em leito natural","Terraplenagem","tkm",920.02,1.3,{"$f":"VLOOKUP($A31,'RESUMO MODULO TOTAL'!$D$12:$N$48,11,FALSE)","v":1196.02},4.0915922083744093E-5,0.99999999999999989]
[]
[{"$nulls":5},"Total",null,{"$f":"SUM(H5:H31)","v":29231163.300000004}]