{"text_format":"2","workbook":"xlsx","n_sheets":10,"sheets":["PFP","PFP1.1_Topo","PFP1.2_Geo","PFP1.3_Amb","PFP2.1_FatorKa","PFP2.2_FatorKb","PFP2.3_FatorKc","PFP3_FatorKd","CRO1_Ins-Pro","CRO2_Pro-Mes"],"not_rendered":{"charts":0,"images":1,"macros":0,"external_links":0,"defined_names":11,"comments":0,"pivot_tables":0},"unopened":[],"bounds":{"document_bytes":16777216,"sheet_cells":100000,"run_cost":"one","rows_first":2000,"rows_last":500,"rows_between":2000,"halvings":0,"cell_chars":16384,"cell_head_chars":4096},"cells_cut":0,"cells_raw":0,"read":"whole","date_system":"1900"}

{"sheet":"PFP","index":0,"n_rows":37,"n_cols":11,"rows_kept":37,"cut":false,"hidden":false,"merged":[[7,9,7,10],[7,5,7,8],[19,0,19,6],[19,7,19,10],[7,0,7,4],[18,0,18,6],[18,7,18,10],[0,0,1,8],[6,5,6,8],[0,9,0,10],[1,9,1,10],[6,9,6,10],[6,0,6,4],[2,0,3,10],[4,0,4,10],[5,0,5,10],[36,0,36,10],[28,0,28,10],[30,0,30,10],[23,0,23,10],[29,0,29,10],[25,0,25,10],[31,0,31,10],[32,0,32,10],[33,0,33,10],[34,0,34,10],[26,0,26,10],[35,0,35,10],[21,7,21,10],[21,0,21,6],[20,7,20,10],[20,0,20,6],[27,0,27,10],[22,0,22,6],[22,7,22,10],[24,0,24,10]]}
["PROPOSTA FINANCEIRA DO PROJETO",{"$nulls":8},"CODIGO:"]
[{"$nulls":9},"PFP"]
["ADAPTAÇÃO DO PROJETO EXECUTIVO DO SISTEMA ADUTOR DE MARCOLÂNDIA-PI E DISTRITO DE SERRÂNIA (ARARIPINA-PE)"]
[]
["NOME DA EMPRESA:"]
[]
["PROJETO:",{"$nulls":4},"CONTRATANTE:",null,null,null,"BASE:"]
["ADAPTAÇÃO DO PROJETO EXECUTIVO DO SISTEMA ADUTOR DE MARCOLÂNDIA-PI E DISTRITO DE SERRÂNIA (ARARIPINA-PE)",{"$nulls":4},"CODEVASF (7SR)",null,null,null,"SICRO: abr/24\nCODE: out/24*\n"]
["Base","Cod1","Cod2","Categoria / Insumo","Uni","Qde","CUD","PU","FatorK","CT","PT"]
["SICRO","MO3","C","Engenheiro consultor especial - P8060","mês",{"$f":"VLOOKUP(C10,'CRO1_Ins-Pro'!$A$4:$S$14,4,FALSE)","v":0.2},21440.03,{"$f":"ROUND(I10*G10,2)","v":30961.55},{"$f":"IF(B10=\"MO1\",Ka,IF(B10=\"MO2\",Kb,IF(B10=\"MO3\",Kc,Kd)))","v":1.4440999999999999},{"$f":"ROUND(F10*G10,2)","v":4288.01},{"$f":"ROUND(F10*H10,2)","v":6192.31}]
["SICRO","MO2","P0","Engenheiro de projetos sênior - P8067","mês",{"$f":"VLOOKUP(C11,'CRO1_Ins-Pro'!$A$4:$S$14,4,FALSE)","v":0.8},15564.54,26386.560000000001,1.6953,12451.63,21109.25]
["SICRO","MO1","P1","Engenheiro de projetos pleno - P8066","mês",{"$f":"VLOOKUP(C12,'CRO1_Ins-Pro'!$A$4:$S$14,4,FALSE)","v":1.6999999999999997},12379.96,29012.44,2.3435000000000001,21045.93,49321.15]
["SICRO","MO1","P3","Engenheiro de projetos júnior - P8065","mês",{"$f":"VLOOKUP(C13,'CRO1_Ins-Pro'!$A$4:$S$14,4,FALSE)","v":1.4},12002,28126.69,2.3435000000000001,16802.8,39377.370000000003]
["SICRO","MO1","T2","Técnico de obras - P8147","mês",{"$f":"VLOOKUP(C14,'CRO1_Ins-Pro'!$A$4:$S$14,4,FALSE)","v":0.64999999999999991},3167.62,7423.32,2.3435000000000001,2058.9499999999998,4825.16]
["SICRO","MO1","A0","Secretária - P8135","mês",{"$f":"VLOOKUP(C15,'CRO1_Ins-Pro'!$A$4:$S$14,4,FALSE)","v":0.23999999999999996},2604.7800000000002,6104.3,2.3435000000000001,625.15,1465.03]
{"$rows_left_out":23}
{"sheet":"PFP1.1_Topo","index":1,"n_rows":24,"n_cols":7,"rows_kept":24,"cut":false,"hidden":true,"merged":[[23,0,23,6],[5,0,5,3],[3,0,3,6],[4,0,4,6],[17,0,17,5],[22,0,22,6],[0,0,1,5],[6,0,6,3],[5,4,5,5],[6,4,6,5],[21,0,21,6],[18,0,18,6],[19,0,19,6],[20,0,20,6],[2,0,2,6]]}
["SERVIÇOS TOPOGRÁFICOS/CARTOGRÁFICOS",{"$nulls":5},"CODIGO:"]
[{"$nulls":6},"PFP-1.1"]
[{"$f":"PFP!A3","v":"ADAPTAÇÃO DO PROJETO EXECUTIVO DO SISTEMA ADUTOR DE MARCOLÂNDIA-PI E DISTRITO DE SERRÂNIA (ARARIPINA-PE)"}]
["NOME DA EMPRESA:"]
[]
["PROJETO:",null,null,null,"CONTRATANTE:",null,{"$f":"PFP!J7","v":"BASE:"}]
[{"$f":"PFP!A8","v":"ADAPTAÇÃO DO PROJETO EXECUTIVO DO SISTEMA ADUTOR DE MARCOLÂNDIA-PI E DISTRITO DE SERRÂNIA (ARARIPINA-PE)"},null,null,null,{"$f":"PFP!F8","v":"CODEVASF (7SR)"},null,{"$f":"PFP!J8","v":"SICRO: abr/24\nCODE: out/24*\n"}]
["Cod.","Base","Insumos","Uni","Qde","Preço Unitário (PU)","Preço Total (PT)"]
["TP17","CODE","LEVANTAMENTO PLANIALTIMÉTRICO SEMI-CADASTRAL","ha",null,1290.68,{"$f":"ROUND(F9*E9,2)","v":0}]
["TP19","CODE","PONTOS GPS, COM RECEPTORES DE DUPLA FREQUENCIA (L1/L2)","und",null,965.49,0]
["TP30","CODE","IMAGEM DE SATÉLITE DE ALTA DEFINIÇÃO 0,5 M","km2",null,129.11000000000001,0]
["TP31","CODE","PROCEDIMENTO DE ORTORRETIFICAÇÃO DE IMAGEM","km2",null,22.26,0]
[null,"CODE"]
[null,"CODE"]
[null,"CODE"]
{"$rows_left_out":10}
{"sheet":"PFP1.2_Geo","index":2,"n_rows":45,"n_cols":7,"rows_kept":45,"cut":false,"hidden":true,"merged":[[5,0,5,3],[5,4,5,5],[3,0,3,6],[4,0,4,6],[0,0,1,5],[2,0,2,6],[38,0,38,5],[42,0,42,6],[6,0,6,3],[6,4,6,5],[44,0,44,6],[39,0,39,6],[40,0,40,6],[41,0,41,6],[43,0,43,6]]}
["SERVIÇOS GEOLÓGICOS/GEOTÉCNICOS",{"$nulls":5},"CODIGO:"]
[{"$nulls":6},"PFP-1.2"]
[{"$f":"PFP!A3","v":"ADAPTAÇÃO DO PROJETO EXECUTIVO DO SISTEMA ADUTOR DE MARCOLÂNDIA-PI E DISTRITO DE SERRÂNIA (ARARIPINA-PE)"}]
["NOME DA EMPRESA:"]
[]
["PROJETO:",null,null,null,"CONTRATANTE:",null,{"$f":"PFP!J7","v":"BASE:"}]
[{"$f":"PFP!A8","v":"ADAPTAÇÃO DO PROJETO EXECUTIVO DO SISTEMA ADUTOR DE MARCOLÂNDIA-PI E DISTRITO DE SERRÂNIA (ARARIPINA-PE)"},null,null,null,{"$f":"PFP!F8","v":"CODEVASF (7SR)"},null,{"$f":"PFP!J8","v":"SICRO: abr/24\nCODE: out/24*\n"}]
["Cod.","Base","Insumos","Uni","Qde","Preço Unitário\n(PU)","Preço Total\n(PT)"]
["GT08","CODE","SONDAGEM À PERCUSSÃO: MOBILIZAÇÃO E DESMOBILIZAÇÃO DE EQUIPAMENTOS","und",null,1014.41,{"$f":"ROUND(F9*E9,2)","v":0}]
["GT09","CODE","SONDAGEM À PERCUSSÃO COM SPT","m",null,88.96,0]
["GT10","CODE","SONDAGEM À PERCUSSÃO: DESLOCAMENTO DE 0 A 200 METROS","und",null,770.99,0]
["GT11","CODE","SONDAGEM À PERCUSSÃO: DESLOCAMENTO DE 201 A 500 METROS","und",null,1146.5999999999999,0]
["GT12","CODE","SONDAGEM À PERCUSSÃO: DESLOCAMENTO ACIMA DE 500 METROS","und",null,1522.21,0]
["GT14","CODE","SONDAGEM A TRADO (4\")","m",null,76.849999999999994,0]
["GT16","CODE","Ensaio: UMIDADE NATURAL ","und",null,83.56,0]
{"$rows_left_out":25}
{"sheet":"PFP1.3_Amb","index":3,"n_rows":35,"n_cols":14,"rows_kept":35,"cut":false,"hidden":true,"merged":[[34,0,34,6],[33,0,33,6],[0,0,1,5],[2,0,2,6],[3,0,3,6],[4,0,4,3],[4,4,4,5],[5,0,5,3],[5,4,5,5],[28,0,28,5],[29,0,29,6],[30,0,30,6],[31,0,31,6],[32,0,32,6]]}
["SERVIÇOS ANÁLISE AMBIENTAL - QUALIDADE DA ÁGUA DO MANANCIAL",{"$nulls":5},"CODIGO:"]
[{"$nulls":6},"PFP-1.3"]
["NOME DA EMPRESA:"]
[{"$nulls":11},"Coluna 39 – Consultoria (Supervisão e Projetos)"]
["PROJETO:",null,null,null,"CONTRATANTE:",null,{"$f":"PFP!J7","v":"BASE:"},{"$nulls":4},"2021-07-01","2023-07-01"]
[{"$f":"PFP!A8","v":"ADAPTAÇÃO DO PROJETO EXECUTIVO DO SISTEMA ADUTOR DE MARCOLÂNDIA-PI E DISTRITO DE SERRÂNIA (ARARIPINA-PE)"},null,null,null,"CODEVASF 7ª/SR",null,{"$f":"PFP!J8","v":"SICRO: abr/24\nCODE: out/24*\n"},{"$nulls":4},251.077,287.45999999999998,{"$f":"ROUND(M6/L6,4)","v":1.1449}]
["Cod.","Base","Insumos","Uni","Qde","Preço Unitário (PU)","Preço Total (PT)",{"$nulls":4},"Preço Unitário (PU)","Preço Unitário (PU)"]
["AM01","PROP","Alcalinidade Total","un",2,47.5,{"$f":"ROUND(E8*F8,2)","v":95},{"$nulls":4},41.49,{"$f":"ROUND(L8*$N$6,2)","v":47.5}]
["AM02","PROP","Condutividade","un",2,48.29,{"$f":"ROUND(E9*F9,2)","v":96.58},{"$nulls":4},42.18,{"$f":"ROUND(L9*$N$6,2)","v":48.29}]
["AM03","PROP","DBO","un",2,46.56,93.12,{"$nulls":4},40.67,46.56]
["AM04","PROP","DQO","un",2,56.73,113.46,{"$nulls":4},49.55,56.73]
["AM05","PROP","Salinidade","un",2,53.46,106.92,{"$nulls":4},46.69,53.46]
["AM06","PROP","Sólidos Dissolvidos Totais","un",2,39.51,79.02,{"$nulls":4},34.51,39.51]
["AM07","PROP","Sólidos Suspensos","un",2,43.13,86.26,{"$nulls":4},37.67,43.13]
["AM08","PROP","Sólidos Totais","un",2,39.51,79.02,{"$nulls":4},34.51,39.51]
{"$rows_left_out":21}
{"sheet":"PFP2.1_FatorKa","index":4,"n_rows":45,"n_cols":6,"rows_kept":45,"cut":false,"hidden":false,"merged":[[7,1,7,3],[36,1,36,3],[38,1,38,3],[39,1,39,3],[21,1,21,3],[22,1,22,3],[23,1,23,3],[24,1,24,3],[27,1,27,3],[28,1,28,3],[8,1,8,3],[18,1,18,3],[9,1,9,3],[14,1,14,3],[15,1,15,3],[16,1,16,3],[0,0,1,4],[3,0,3,5],[6,0,6,1],[6,2,6,4],[5,2,5,4],[4,0,4,5],[2,0,2,5],[17,1,17,3],[10,1,10,3],[11,1,11,3],[12,1,12,3],[13,1,13,3],[19,1,19,3],[20,1,20,3],[25,1,25,3],[44,0,44,5],[43,0,43,5],[42,0,42,5],[41,0,41,5],[26,1,26,3],[33,1,33,3],[34,1,34,3],[32,1,32,3],[29,1,29,3],[30,1,30,3],[31,1,31,3],[37,1,37,3],[35,1,35,3]]}
["DETALHAMENTO DOS ENCARGOS SOCIAIS: Ka",{"$nulls":4},"CODIGO:"]
[{"$nulls":5},"PFP-2.1"]
[{"$f":"PFP!A3","v":"ADAPTAÇÃO DO PROJETO EXECUTIVO DO SISTEMA ADUTOR DE MARCOLÂNDIA-PI E DISTRITO DE SERRÂNIA (ARARIPINA-PE)"}]
["NOME DA CONSULTORA:"]
[]
["PROJETO:",null,"CONTRATANTE:",null,null,{"$f":"PFP!J7","v":"BASE:"}]
[{"$f":"PFP!A8","v":"ADAPTAÇÃO DO PROJETO EXECUTIVO DO SISTEMA ADUTOR DE MARCOLÂNDIA-PI E DISTRITO DE SERRÂNIA (ARARIPINA-PE)"},null,{"$f":"PFP!F8","v":"CODEVASF (7SR)"},null,null,{"$f":"CONCATENATE(PFP!J8,\"E.S. = SINAPI - PI\")","v":"SICRO: abr/24\nCODE: out/24*\nE.S. = SINAPI - PI"}]
["Cod","DESCRIÇÃO",null,null,"%","R$"]
["A","ENCARGOS SOCIAIS BÁSICOS",null,null,{"$f":"ROUND(SUM(E10:E18),4)","v":0.36799999999999999},{"$f":"ROUND(E9*SUMIF(PFP!$B$10:$B$18,\"MO1\",PFP!$J$10:$J$18),2)","v":14916.08}]
["A1","INSS",null,null,0.2,{"$f":"ROUND(E10*SUMIF(PFP!$B$10:$B$18,\"MO1\",PFP!$J$10:$J$18),2)","v":8106.57}]
["A2","SESI",null,null,1.4999999999999999E-2,{"$f":"ROUND(E11*SUMIF(PFP!$B$10:$B$18,\"MO1\",PFP!$J$10:$J$18),2)","v":607.99}]
["A3","SENAI",null,null,0.01,{"$f":"ROUND(E12*SUMIF(PFP!$B$10:$B$18,\"MO1\",PFP!$J$10:$J$18),2)","v":405.33}]
["A4","INCRA",null,null,2E-3,{"$f":"ROUND(E13*SUMIF(PFP!$B$10:$B$18,\"MO1\",PFP!$J$10:$J$18),2)","v":81.069999999999993}]
["A5","SEBRAE",null,null,6.0000000000000001E-3,{"$f":"ROUND(E14*SUMIF(PFP!$B$10:$B$18,\"MO1\",PFP!$J$10:$J$18),2)","v":243.2}]
["A6","Salário Educação",null,null,2.5000000000000001E-2,{"$f":"ROUND(E15*SUMIF(PFP!$B$10:$B$18,\"MO1\",PFP!$J$10:$J$18),2)","v":1013.32}]
{"$rows_left_out":31}
{"sheet":"PFP2.2_FatorKb","index":5,"n_rows":45,"n_cols":6,"rows_kept":45,"cut":false,"hidden":false,"merged":[[22,1,22,3],[0,0,1,4],[3,0,3,5],[4,0,4,5],[5,2,5,4],[6,0,6,1],[6,2,6,4],[8,1,8,3],[18,1,18,3],[21,1,21,3],[9,1,9,3],[10,1,10,3],[11,1,11,3],[17,1,17,3],[7,1,7,3],[13,1,13,3],[44,0,44,5],[41,0,41,5],[42,0,42,5],[43,0,43,5],[36,1,36,3],[37,1,37,3],[38,1,38,3],[39,1,39,3],[35,1,35,3],[23,1,23,3],[24,1,24,3],[26,1,26,3],[27,1,27,3],[28,1,28,3],[29,1,29,3],[30,1,30,3],[31,1,31,3],[32,1,32,3],[33,1,33,3],[34,1,34,3],[25,1,25,3],[19,1,19,3],[20,1,20,3],[2,0,2,5],[14,1,14,3],[15,1,15,3],[16,1,16,3],[12,1,12,3]]}
["DETALHAMENTO DOS ENCARGOS SOCIAIS: Kb",{"$nulls":4},"CODIGO:"]
[{"$nulls":5},"PFP-2.2"]
[{"$f":"PFP!A3","v":"ADAPTAÇÃO DO PROJETO EXECUTIVO DO SISTEMA ADUTOR DE MARCOLÂNDIA-PI E DISTRITO DE SERRÂNIA (ARARIPINA-PE)"}]
["NOME DA CONSULTORA:"]
[]
["PROJETO:",null,"CONTRATANTE:",null,null,{"$f":"PFP!J7","v":"BASE:"}]
[{"$f":"PFP!A8","v":"ADAPTAÇÃO DO PROJETO EXECUTIVO DO SISTEMA ADUTOR DE MARCOLÂNDIA-PI E DISTRITO DE SERRÂNIA (ARARIPINA-PE)"},null,{"$f":"PFP!F8","v":"CODEVASF (7SR)"},null,null,{"$f":"'PFP2.1_FatorKa'!F7","v":"SICRO: abr/24\nCODE: out/24*\nE.S. = SINAPI - PI"}]
["Cod","DESCRIÇÃO",null,null,"%","R$"]
["A","ENCARGOS SOCIAIS BÁSICOS",null,null,{"$f":"ROUND(SUM(E10:E18),4)","v":0.2},{"$f":"ROUND(E9*SUMIF(PFP!$B$10:$B$18,\"MO2\",PFP!$J$10:$J$18),2)","v":2490.33}]
["A1","INSS",null,null,0.2,{"$f":"ROUND(E10*SUMIF(PFP!$B$10:$B$18,\"MO2\",PFP!$J$10:$J$18),2)","v":2490.33}]
["A2","SESI",null,null,0,{"$f":"ROUND(E11*SUMIF(PFP!$B$10:$B$18,\"MO2\",PFP!$J$10:$J$18),2)","v":0}]
["A3","SENAI",null,null,0,{"$f":"ROUND(E12*SUMIF(PFP!$B$10:$B$18,\"MO2\",PFP!$J$10:$J$18),2)","v":0}]
["A4","INCRA",null,null,0,{"$f":"ROUND(E13*SUMIF(PFP!$B$10:$B$18,\"MO2\",PFP!$J$10:$J$18),2)","v":0}]
["A5","SEBRAE",null,null,0,{"$f":"ROUND(E14*SUMIF(PFP!$B$10:$B$18,\"MO2\",PFP!$J$10:$J$18),2)","v":0}]
["A6","Salário Educação",null,null,0,{"$f":"ROUND(E15*SUMIF(PFP!$B$10:$B$18,\"MO2\",PFP!$J$10:$J$18),2)","v":0}]
{"$rows_left_out":31}
{"sheet":"PFP2.3_FatorKc","index":6,"n_rows":45,"n_cols":6,"rows_kept":45,"cut":false,"hidden":false,"merged":[[43,0,43,5],[44,0,44,5],[34,1,34,3],[35,1,35,3],[36,1,36,3],[37,1,37,3],[38,1,38,3],[39,1,39,3],[41,0,41,5],[42,0,42,5],[33,1,33,3],[21,1,21,3],[22,1,22,3],[23,1,23,3],[24,1,24,3],[26,1,26,3],[27,1,27,3],[28,1,28,3],[29,1,29,3],[30,1,30,3],[31,1,31,3],[32,1,32,3],[12,1,12,3],[13,1,13,3],[19,1,19,3],[20,1,20,3],[25,1,25,3],[14,1,14,3],[15,1,15,3],[16,1,16,3],[17,1,17,3],[18,1,18,3],[7,1,7,3],[8,1,8,3],[9,1,9,3],[10,1,10,3],[11,1,11,3],[0,0,1,4],[3,0,3,5],[4,0,4,5],[5,2,5,4],[6,0,6,1],[6,2,6,4],[2,0,2,5]]}
["DETALHAMENTO DOS ENCARGOS SOCIAIS: Kc",{"$nulls":4},"CODIGO:"]
[{"$nulls":5},"PFP-2.3"]
[{"$f":"PFP!A3","v":"ADAPTAÇÃO DO PROJETO EXECUTIVO DO SISTEMA ADUTOR DE MARCOLÂNDIA-PI E DISTRITO DE SERRÂNIA (ARARIPINA-PE)"}]
["NOME DA CONSULTORA:"]
[]
["PROJETO:",null,"CONTRATANTE:",null,null,{"$f":"PFP!J7","v":"BASE:"}]
[{"$f":"PFP!A8","v":"ADAPTAÇÃO DO PROJETO EXECUTIVO DO SISTEMA ADUTOR DE MARCOLÂNDIA-PI E DISTRITO DE SERRÂNIA (ARARIPINA-PE)"},null,{"$f":"PFP!F8","v":"CODEVASF (7SR)"},null,null,{"$f":"'PFP2.1_FatorKa'!F7","v":"SICRO: abr/24\nCODE: out/24*\nE.S. = SINAPI - PI"}]
["Cod","DESCRIÇÃO",null,null,"%","R$"]
["A","ENCARGOS SOCIAIS BÁSICOS",null,null,{"$f":"ROUND(SUM(E10:E18),4)","v":0},{"$f":"ROUND(E9*SUMIF(PFP!$B$10:$B$18,\"MO3\",PFP!$J$10:$J$18),2)","v":0}]
["A1","INSS",null,null,0,{"$f":"ROUND(E10*SUMIF(PFP!$B$10:$B$18,\"MO3\",PFP!$J$10:$J$18),2)","v":0}]
["A2","SESI",null,null,0,{"$f":"ROUND(E11*SUMIF(PFP!$B$10:$B$18,\"MO3\",PFP!$J$10:$J$18),2)","v":0}]
["A3","SENAI",null,null,0,{"$f":"ROUND(E12*SUMIF(PFP!$B$10:$B$18,\"MO3\",PFP!$J$10:$J$18),2)","v":0}]
["A4","INCRA",null,null,0,{"$f":"ROUND(E13*SUMIF(PFP!$B$10:$B$18,\"MO3\",PFP!$J$10:$J$18),2)","v":0}]
["A5","SEBRAE",null,null,0,{"$f":"ROUND(E14*SUMIF(PFP!$B$10:$B$18,\"MO3\",PFP!$J$10:$J$18),2)","v":0}]
["A6","Salário Educação",null,null,0,{"$f":"ROUND(E15*SUMIF(PFP!$B$10:$B$18,\"MO3\",PFP!$J$10:$J$18),2)","v":0}]
{"$rows_left_out":31}
{"sheet":"PFP3_FatorKd","index":7,"n_rows":36,"n_cols":6,"rows_kept":36,"cut":false,"hidden":false,"merged":[[34,0,34,5],[35,0,35,5],[17,1,17,3],[14,1,14,3],[15,1,15,3],[16,1,16,3],[22,0,22,5],[27,0,27,5],[28,0,28,5],[23,0,23,5],[24,0,24,5],[25,0,25,5],[29,0,29,5],[30,0,30,5],[31,0,31,5],[32,0,32,5],[8,1,8,2],[26,0,26,5],[7,1,7,2],[0,0,1,4],[3,0,3,5],[6,0,6,1],[6,2,6,4],[5,2,5,4],[4,0,4,5],[2,0,2,5],[33,0,33,5],[13,1,13,3],[12,1,12,3],[9,1,9,2],[10,1,10,2],[11,1,11,2]]}
["DESPESAS FISCAIS E CUSTOS DIVERSOS: Kd",{"$nulls":4},"CODIGO:"]
[{"$nulls":5},"PFP-3"]
[{"$f":"PFP!A3","v":"ADAPTAÇÃO DO PROJETO EXECUTIVO DO SISTEMA ADUTOR DE MARCOLÂNDIA-PI E DISTRITO DE SERRÂNIA (ARARIPINA-PE)"}]
["NOME DA CONSULTORA:"]
[]
["PROJETO:",null,"CONTRATANTE:",null,null,{"$f":"PFP!J7","v":"BASE:"}]
[{"$f":"PFP!A8","v":"ADAPTAÇÃO DO PROJETO EXECUTIVO DO SISTEMA ADUTOR DE MARCOLÂNDIA-PI E DISTRITO DE SERRÂNIA (ARARIPINA-PE)"},null,"CODEVASF (SEDE)",null,null,{"$f":"PFP!J8","v":"SICRO: abr/24\nCODE: out/24*\n"}]
["Cod","DESCRIÇÃO1",null,"% preço2","% custo4","R$"]
["K4","TAXAS E IMPOSTOS",null,{"$f":"ROUND(D10+D11+D12,4)","v":0.124},{"$f":"ROUND(E10+E11+E12,4)","v":0.1416},{"$f":"E9*SUM(SUMIF(PFP!$B$10:$B$18,\"MO1\",PFP!$J$10:$J$18)*(1+'PFP2.1_FatorKa'!$E$39)+SUMIF(PFP!$B$10:$B$18,\"MO2\",PFP!$J$10:$J$18)*(1+'PFP2.2_FatorKb'!$E$39)+SUMIF(PFP!$B$10:$B$18,\"<>MO*\",PFP!$J$10:$J$18)+$F$14+$F$13)","v":15171.590786652958}]
["K4.1","ISS",null,0.05,{"$f":"ROUND((1/(1-$D$9))*D10,4)","v":5.7099999999999998E-2},{"$f":"E10*SUM(SUMIF(PFP!$B$10:$B$18,\"MO1\",PFP!$J$10:$J$18)*(1+'PFP2.1_FatorKa'!$E$39)+SUMIF(PFP!$B$10:$B$18,\"MO2\",PFP!$J$10:$J$18)*(1+'PFP2.2_FatorKb'!$E$39)+SUMIF(PFP!$B$10:$B$18,\"<>MO*\",PFP!$J$10:$J$18)+$F$14+$F$13)","v":6117.9225559172592}]
["K4.2","PIS3 - aliquota efetiva com percentual-desconto",null,{"$f":"ROUND(1.65%*0.8,4)","v":1.32E-2},{"$f":"ROUND((1/(1-$D$9))*D11,4)","v":1.5100000000000001E-2},{"$f":"E11*SUM(SUMIF(PFP!$B$10:$B$18,\"MO1\",PFP!$J$10:$J$18)*(1+'PFP2.1_FatorKa'!$E$39)+SUMIF(PFP!$B$10:$B$18,\"MO2\",PFP!$J$10:$J$18)*(1+'PFP2.2_FatorKb'!$E$39)+SUMIF(PFP!$B$10:$B$18,\"<>MO*\",PFP!$J$10:$J$18)+$F$14+$F$13)","v":1617.8744412320598}]
["K4.3","COFINS3 - aliquota efetiva com percentual-desconto",null,{"$f":"ROUND(7.6%*0.8,4)","v":6.08E-2},{"$f":"ROUND((1/(1-$D$9))*D12,4)","v":6.9400000000000003E-2},{"$f":"E12*SUM(SUMIF(PFP!$B$10:$B$18,\"MO1\",PFP!$J$10:$J$18)*(1+'PFP2.1_FatorKa'!$E$39)+SUMIF(PFP!$B$10:$B$18,\"MO2\",PFP!$J$10:$J$18)*(1+'PFP2.2_FatorKb'!$E$39)+SUMIF(PFP!$B$10:$B$18,\"<>MO*\",PFP!$J$10:$J$18)+$F$14+$F$13)","v":7435.7937895036393}]
["K3","REMUNERAÇÃO DA EMPRESA (LUCRO)",null,null,0.1,{"$f":"E13*SUM(SUMIF(PFP!$B$10:$B$18,\"MO1\",PFP!$J$10:$J$18)*(1+'PFP2.1_FatorKa'!$E$39)+SUMIF(PFP!$B$10:$B$18,\"MO2\",PFP!$J$10:$J$18)*(1+'PFP2.2_FatorKb'!$E$39)+SUMIF(PFP!$B$10:$B$18,\"<>MO*\",PFP!$J$10:$J$18)+$F$14)","v":9740.3638845999994}]
["K2","CUSTOS DA ADMINISTRAÇÃO CENTRAL",null,null,{"$f":"ROUND(SUM(E15:E17),4)","v":0.15},{"$f":"ROUND(E14*SUMIF(PFP!$B$10:$B$18,\"MO*\",PFP!$J$10:$J$18),2)","v":8590.8700000000008}]
["K2.1","Custos da administração central da empresa (diretoria, pessoal técnico de apoio e pessoal administrativo não diretamente vinculado à prestação dos serviços)",null,null,0.1,{"$f":"ROUND(E15*SUMIF(PFP!$B$10:$B$18,\"MO*\",PFP!$J$10:$J$18),2)","v":5727.25}]
{"$rows_left_out":22}
{"sheet":"CRO1_Ins-Pro","index":8,"n_rows":19,"n_cols":19,"rows_kept":19,"cut":false,"hidden":false,"merged":[[30,6,30,18],[25,6,25,18],[26,6,26,18],[27,6,27,18],[28,6,28,18],[29,6,29,18],[20,6,20,18],[21,6,21,18],[22,6,22,18],[23,6,23,18],[24,6,24,18],[0,14,0,18],[1,14,1,18],[15,0,16,0],[15,1,16,1],[17,0,18,0],[0,0,1,13],[2,0,2,13],[14,12,14,18],[14,7,14,11],[3,7,3,18]]}
["INSUMOS POR ETAPA/PRODUTO",{"$nulls":13},"CODIGO:"]
[{"$nulls":14},"CRO-1"]
[{"$f":"PFP!A3","v":"ADAPTAÇÃO DO PROJETO EXECUTIVO DO SISTEMA ADUTOR DE MARCOLÂNDIA-PI E DISTRITO DE SERRÂNIA (ARARIPINA-PE)"}]
["Cod.","Categoria / Insumo","Uni","Qde","CUD","PU","FatorK","Meses"]
[{"$nulls":7},1,2,3,4,5,6,7,8,9,10,11,12]
["C",{"$f":"VLOOKUP(A6,PFP!$C$9:$K$18,2,FALSE)","v":"Engenheiro consultor especial - P8060"},{"$f":"VLOOKUP(A6,PFP!$C$9:$K$18,3,FALSE)","v":"mês"},{"$f":"SUM(H6:S6)","v":0.2},{"$f":"VLOOKUP(A6,PFP!$C$9:$K$18,5,FALSE)","v":21440.03},{"$f":"VLOOKUP(A6,PFP!$C$9:$K$18,6,FALSE)","v":30961.55},{"$f":"VLOOKUP(A6,PFP!$C$9:$K$18,7,FALSE)","v":1.4440999999999999},{"$nulls":5},0.1,0.1]
["P0",{"$f":"VLOOKUP(A7,PFP!$C$9:$K$18,2,FALSE)","v":"Engenheiro de projetos sênior - P8067"},{"$f":"VLOOKUP(A7,PFP!$C$9:$K$18,3,FALSE)","v":"mês"},{"$f":"SUM(H7:S7)","v":0.8},{"$f":"VLOOKUP(A7,PFP!$C$9:$K$18,5,FALSE)","v":15564.54},{"$f":"VLOOKUP(A7,PFP!$C$9:$K$18,6,FALSE)","v":26386.560000000001},{"$f":"VLOOKUP(A7,PFP!$C$9:$K$18,7,FALSE)","v":1.6953},{"$nulls":5},0.15,0.15,0.1,0.1,0.15,0.15]
["P1",{"$f":"VLOOKUP(A8,PFP!$C$9:$K$18,2,FALSE)","v":"Engenheiro de projetos pleno - P8066"},{"$f":"VLOOKUP(A8,PFP!$C$9:$K$18,3,FALSE)","v":"mês"},1.6999999999999997,{"$f":"VLOOKUP(A8,PFP!$C$9:$K$18,5,FALSE)","v":12379.96},{"$f":"VLOOKUP(A8,PFP!$C$9:$K$18,6,FALSE)","v":29012.44},{"$f":"VLOOKUP(A8,PFP!$C$9:$K$18,7,FALSE)","v":2.3435000000000001},0.1,0.1,0.1,0.1,0.1,0.2,0.2,0.15,0.15,0.2,0.2,0.1]
["P3",{"$f":"VLOOKUP(A9,PFP!$C$9:$K$18,2,FALSE)","v":"Engenheiro de projetos júnior - P8065"},{"$f":"VLOOKUP(A9,PFP!$C$9:$K$18,3,FALSE)","v":"mês"},1.4,{"$f":"VLOOKUP(A9,PFP!$C$9:$K$18,5,FALSE)","v":12002},{"$f":"VLOOKUP(A9,PFP!$C$9:$K$18,6,FALSE)","v":28126.69},{"$f":"VLOOKUP(A9,PFP!$C$9:$K$18,7,FALSE)","v":2.3435000000000001},0.1,0.1,0.1,0.1,0.1,0.15,0.15,0.1,0.1,0.15,0.15,0.1]
["T2",{"$f":"VLOOKUP(A10,PFP!$C$9:$K$18,2,FALSE)","v":"Técnico de obras - P8147"},{"$f":"VLOOKUP(A10,PFP!$C$9:$K$18,3,FALSE)","v":"mês"},0.64999999999999991,{"$f":"VLOOKUP(A10,PFP!$C$9:$K$18,5,FALSE)","v":3167.62},{"$f":"VLOOKUP(A10,PFP!$C$9:$K$18,6,FALSE)","v":7423.32},{"$f":"VLOOKUP(A10,PFP!$C$9:$K$18,7,FALSE)","v":2.3435000000000001},null,null,0.15,null,null,0.1,0.1,0.05,0.05,0.1,0.1]
["A0",{"$f":"VLOOKUP(A11,PFP!$C$9:$K$18,2,FALSE)","v":"Secretária - P8135"},{"$f":"VLOOKUP(A11,PFP!$C$9:$K$18,3,FALSE)","v":"mês"},0.23999999999999996,{"$f":"VLOOKUP(A11,PFP!$C$9:$K$18,5,FALSE)","v":2604.7800000000002},{"$f":"VLOOKUP(A11,PFP!$C$9:$K$18,6,FALSE)","v":6104.3},{"$f":"VLOOKUP(A11,PFP!$C$9:$K$18,7,FALSE)","v":2.3435000000000001},0.02,0.02,0.02,0.02,0.02,0.02,0.02,0.02,0.02,0.02,0.02,0.02]
["V1",{"$f":"VLOOKUP(A12,PFP!$C$9:$K$18,2,FALSE)","v":"Diárias"},{"$f":"VLOOKUP(A12,PFP!$C$9:$K$18,3,FALSE)","v":"dia"},4,{"$f":"VLOOKUP(A12,PFP!$C$9:$K$18,5,FALSE)","v":353.39},{"$f":"VLOOKUP(A12,PFP!$C$9:$K$18,6,FALSE)","v":443.79},{"$f":"VLOOKUP(A12,PFP!$C$9:$K$18,7,FALSE)","v":1.2558},null,null,4]
["V3",{"$f":"VLOOKUP(A13,PFP!$C$9:$K$18,2,FALSE)","v":"Aluguel de mini Pick-up"},{"$f":"VLOOKUP(A13,PFP!$C$9:$K$18,3,FALSE)","v":"dia"},3,{"$f":"VLOOKUP(A13,PFP!$C$9:$K$18,5,FALSE)","v":427.04},{"$f":"VLOOKUP(A13,PFP!$C$9:$K$18,6,FALSE)","v":536.28},{"$f":"VLOOKUP(A13,PFP!$C$9:$K$18,7,FALSE)","v":1.2558},null,null,3]
["V4",{"$f":"VLOOKUP(A14,PFP!$C$9:$K$18,2,FALSE)","v":"Passagens Aéreas (ida e volta)"},{"$f":"VLOOKUP(A14,PFP!$C$9:$K$18,3,FALSE)","v":"un"},1,{"$f":"VLOOKUP(A14,PFP!$C$9:$K$18,5,FALSE)","v":1613.69},{"$f":"VLOOKUP(A14,PFP!$C$9:$K$18,6,FALSE)","v":2026.47},{"$f":"VLOOKUP(A14,PFP!$C$9:$K$18,7,FALSE)","v":1.2558},null,null,1]
[{"$nulls":6},"ETAPA:","Diagnóstico/Estudos Alternativas",{"$nulls":4},"Projeto Executivo de Engenharia"]
{"$rows_left_out":5}
{"sheet":"CRO2_Pro-Mes","index":9,"n_rows":14,"n_cols":15,"rows_kept":14,"cut":false,"hidden":false,"merged":[[0,0,0,14],[1,0,1,14]]}
["CRONOGRAMA SIMPLIFICADO - CRO"]
[{"$f":"PFP!A3","v":"ADAPTAÇÃO DO PROJETO EXECUTIVO DO SISTEMA ADUTOR DE MARCOLÂNDIA-PI E DISTRITO DE SERRÂNIA (ARARIPINA-PE)"}]
["Cod.","Produto/ Mês","Soma",1,2,3,4,5,6,7,8,9,10,11,12]
["E-1.1","Estudos Preliminares",{"$f":"COUNTA(D4:O4)","v":2},"x","x"]
["E-1.2","Estudos de Diagnóstico",{"$f":"COUNTA(D5:O5)","v":1},null,null,"x"]
["E-1.3","Estudos Populacionais e de Demanda Hídrica",1,null,null,null,"x"]
["E-1.4","Relatório Final do Diagnóstico e Estudo de Alternativas ",1,{"$nulls":4},"x"]
["E-2.1","Projetos Técnicos: hidromecânicos",2,{"$nulls":5},"x","x"]
["E-2.2","Projetos Técnicos: complementares",2,{"$nulls":5},"x","x"]
["E-2.3","Memoriais de cálculo",1,{"$nulls":7},"x"]
["E-2.4","Memorial Descritivo e Especificações Técnicas",2,{"$nulls":7},"x","x"]
["E-2.5","Orçamentos",3,{"$nulls":8},"x","x","x"]
["E-2.6","Estudos ambientais",2,{"$nulls":9},"x","x"]
["E-2.7","Relatório final do projeto executivo de engenharia",1,{"$nulls":11},"x"]