{"text_format":"2","workbook":"xlsx","n_sheets":10,"sheets":["PFP","PFP1.1_Topo","PFP1.2_Geo","PFP1.3_Amb","PFP2.1_FatorKa","PFP2.2_FatorKb","PFP2.3_FatorKc","PFP3_FatorKd","CRO1_Ins-Pro","CRO2_Pro-Mes"],"not_rendered":{"charts":0,"images":1,"macros":0,"external_links":0,"defined_names":11,"comments":0,"pivot_tables":0},"unopened":[],"bounds":{"document_bytes":16777216,"sheet_cells":100000,"run_cost":"one","rows_first":2000,"rows_last":500,"rows_between":2000,"halvings":0,"cell_chars":16384,"cell_head_chars":4096},"cells_cut":0,"cells_raw":0,"read":"whole","date_system":"1900"}

{"sheet":"PFP","index":0,"n_rows":37,"n_cols":11,"rows_kept":37,"cut":false,"hidden":false,"merged":[[7,9,7,10],[7,5,7,8],[19,0,19,6],[19,7,19,10],[7,0,7,4],[18,0,18,6],[18,7,18,10],[0,0,1,8],[6,5,6,8],[0,9,0,10],[1,9,1,10],[6,9,6,10],[6,0,6,4],[2,0,3,10],[4,0,4,10],[5,0,5,10],[36,0,36,10],[28,0,28,10],[30,0,30,10],[23,0,23,10],[29,0,29,10],[25,0,25,10],[31,0,31,10],[32,0,32,10],[33,0,33,10],[34,0,34,10],[26,0,26,10],[35,0,35,10],[21,7,21,10],[21,0,21,6],[20,7,20,10],[20,0,20,6],[27,0,27,10],[22,0,22,6],[22,7,22,10],[24,0,24,10]]}
["PROPOSTA FINANCEIRA DO PROJETO",{"$nulls":8},"CODIGO:"]
[{"$nulls":9},"PFP"]
["ADAPTAÇÃO DO PROJETO EXECUTIVO DO SISTEMA ADUTOR DE MARCOLÂNDIA-PI E DISTRITO DE SERRÂNIA (ARARIPINA-PE)"]
[]
["NOME DA EMPRESA:"]
[]
["PROJETO:",{"$nulls":4},"CONTRATANTE:",null,null,null,"BASE:"]
["ADAPTAÇÃO DO PROJETO EXECUTIVO DO SISTEMA ADUTOR DE MARCOLÂNDIA-PI E DISTRITO DE SERRÂNIA (ARARIPINA-PE)",{"$nulls":4},"CODEVASF (7SR)",null,null,null,"SICRO: abr/24\nCODE: out/24*\n"]
["Base","Cod1","Cod2","Categoria / Insumo","Uni","Qde","CUD","PU","FatorK","CT","PT"]
["SICRO","MO3","C","Engenheiro consultor especial - P8060","mês",{"$f":"VLOOKUP(C10,'CRO1_Ins-Pro'!$A$4:$S$14,4,FALSE)","v":0.2},21440.03,{"$f":"ROUND(I10*G10,2)","v":30961.55},{"$f":"IF(B10=\"MO1\",Ka,IF(B10=\"MO2\",Kb,IF(B10=\"MO3\",Kc,Kd)))","v":1.4440999999999999},{"$f":"ROUND(F10*G10,2)","v":4288.01},{"$f":"ROUND(F10*H10,2)","v":6192.31}]
["SICRO","MO2","P0","Engenheiro de projetos sênior - P8067","mês",{"$f":"VLOOKUP(C11,'CRO1_Ins-Pro'!$A$4:$S$14,4,FALSE)","v":0.8},15564.54,26386.560000000001,1.6953,12451.63,21109.25]
["SICRO","MO1","P1","Engenheiro de projetos pleno - P8066","mês",{"$f":"VLOOKUP(C12,'CRO1_Ins-Pro'!$A$4:$S$14,4,FALSE)","v":1.6999999999999997},12379.96,29012.44,2.3435000000000001,21045.93,49321.15]
["SICRO","MO1","P3","Engenheiro de projetos júnior - P8065","mês",{"$f":"VLOOKUP(C13,'CRO1_Ins-Pro'!$A$4:$S$14,4,FALSE)","v":1.4},12002,28126.69,2.3435000000000001,16802.8,39377.370000000003]
["SICRO","MO1","T2","Técnico de obras - P8147","mês",{"$f":"VLOOKUP(C14,'CRO1_Ins-Pro'!$A$4:$S$14,4,FALSE)","v":0.64999999999999991},3167.62,7423.32,2.3435000000000001,2058.9499999999998,4825.16]
["SICRO","MO1","A0","Secretária - P8135","mês",{"$f":"VLOOKUP(C15,'CRO1_Ins-Pro'!$A$4:$S$14,4,FALSE)","v":0.23999999999999996},2604.7800000000002,6104.3,2.3435000000000001,625.15,1465.03]
["PROP","DP","V1","Diárias","dia",{"$f":"VLOOKUP(C16,'CRO1_Ins-Pro'!$A$4:$S$14,4,FALSE)","v":4},353.39,443.79,1.2558,1413.56,1775.16]
["PROP","DP","V3","Aluguel de mini Pick-up","dia",{"$f":"'CRO1_Ins-Pro'!D13","v":3},427.04,536.28,1.2558,1281.1199999999999,1608.84]
["PROP","DP","V4","Passagens Aéreas (ida e volta)","un",{"$f":"'CRO1_Ins-Pro'!D14","v":1},1613.69,2026.47,1.2558,1613.69,2026.47]
["TOTAL DOS CUSTOS DIRETOS",{"$nulls":6},{"$f":"SUM(J10:J18)","v":61580.84}]
["TOTAL DOS ENCARGOS E DISPESAS DIVERSAS",{"$nulls":6},{"$f":"H21-H19","v":66119.900000000009}]
["TOTAL DA PROPOSTA A PREÇO GLOBAL",{"$nulls":6},{"$f":"ROUND(SUM(K10:K18),2)","v":127700.74}]
["TOTAL DA PROPOSTA A PREÇO UNITÁRIO",{"$nulls":6},0]
["TOTAL DA PROPOSTA",{"$nulls":6},{"$f":"H21+H22","v":127700.74}]
["OBSERVAÇÃO:"]
["Alocar os Insumos MO, com respectivo FatorK, dentro da categoria de vínculo contratual (com ou sem) de cada tipo de profissional"]
["Uni - unidade de medição do insumo;"]
["Qde - Quantidade do Insumo (não pode ocorrer alteração pela Licitante)"]
["CUD - Custo Unitário Direto do Insumo (sem encargos, taxas e impostos, valor não pode ser maior que o Orçado pela Codevasf)"]
["CT - Custo Total (sem encargos, taxas e impostos) - CT = Qde x CUD"]
["FatorK - Taxa de Ressarcimento de Despesas e Encargos (detalhar composição nas Planilhas \"PFP2.1\", \"PFP2.2\", \"PFP3\")"]
["PU - Preço Unitário do Insumo (incluído encargos, taxas e impostos) - PU = CUD x FatorK"]
["PT - Preço Total do Insumo (incluído encargos, taxas e impostos) - PT = Qde x PU"]
["P - Profissionais nível superior nas áreas de Engenharia, Química, Arquitetura, Agronomia e Veterinária, conforme disposições da Lei 4.950-A/66"]
["S - Profissionais de nível superior nas demais áreas de atuação, incluindo Arqueólogo, Biólogo, Geógrafo e Socioólogo"]
["T - Profissionais de nível médio técnico nas diversas áreas de atuação"]
["A - Profissionais de nível médio de apoio técnico-administrativo"]
["* atualizado com base na variação do índice setorial publicado na revista “Conjuntura Econômica” da Fundação Getúlio Vargas, correspondente à coluna 39 (Custo Nacional da Construção Civil) - Serviços de Consultoria; Data inicial: Jan/20 - Data final: out/24."]

{"sheet":"PFP1.1_Topo","index":1,"n_rows":24,"n_cols":7,"rows_kept":24,"cut":false,"hidden":true,"merged":[[23,0,23,6],[5,0,5,3],[3,0,3,6],[4,0,4,6],[17,0,17,5],[22,0,22,6],[0,0,1,5],[6,0,6,3],[5,4,5,5],[6,4,6,5],[21,0,21,6],[18,0,18,6],[19,0,19,6],[20,0,20,6],[2,0,2,6]]}
["SERVIÇOS TOPOGRÁFICOS/CARTOGRÁFICOS",{"$nulls":5},"CODIGO:"]
[{"$nulls":6},"PFP-1.1"]
[{"$f":"PFP!A3","v":"ADAPTAÇÃO DO PROJETO EXECUTIVO DO SISTEMA ADUTOR DE MARCOLÂNDIA-PI E DISTRITO DE SERRÂNIA (ARARIPINA-PE)"}]
["NOME DA EMPRESA:"]
[]
["PROJETO:",null,null,null,"CONTRATANTE:",null,{"$f":"PFP!J7","v":"BASE:"}]
[{"$f":"PFP!A8","v":"ADAPTAÇÃO DO PROJETO EXECUTIVO DO SISTEMA ADUTOR DE MARCOLÂNDIA-PI E DISTRITO DE SERRÂNIA (ARARIPINA-PE)"},null,null,null,{"$f":"PFP!F8","v":"CODEVASF (7SR)"},null,{"$f":"PFP!J8","v":"SICRO: abr/24\nCODE: out/24*\n"}]
["Cod.","Base","Insumos","Uni","Qde","Preço Unitário (PU)","Preço Total (PT)"]
["TP17","CODE","LEVANTAMENTO PLANIALTIMÉTRICO SEMI-CADASTRAL","ha",null,1290.68,{"$f":"ROUND(F9*E9,2)","v":0}]
["TP19","CODE","PONTOS GPS, COM RECEPTORES DE DUPLA FREQUENCIA (L1/L2)","und",null,965.49,0]
["TP30","CODE","IMAGEM DE SATÉLITE DE ALTA DEFINIÇÃO 0,5 M","km2",null,129.11000000000001,0]
["TP31","CODE","PROCEDIMENTO DE ORTORRETIFICAÇÃO DE IMAGEM","km2",null,22.26,0]
[null,"CODE"]
[null,"CODE"]
[null,"CODE"]
[null,"CODE"]
[null,"CODE"]
["TOTAL SERVIÇOS TOPOGRÁFICOS",{"$nulls":5},{"$f":"SUM(G9:G17)","v":0}]
["OBSERVAÇÃO:"]
["Uni - unidade de medição do insumo;"]
["Qde - Quantidade do Insumo (não pode ocorrer alteração pela Licitante)"]
["PU - Preço Unitário (composições padrão da Codevasf, já incluso o FatorK)"]
["PT - Preço Total (incluído encargos, taxas e impostos) - PT = Qde x PU"]
["* atualizado com base na variação do índice setorial publicado na revista “Conjuntura Econômica” da Fundação Getúlio Vargas, correspondente à coluna 39 (Custo Nacional da Construção Civil) - Serviços de Consultoria; Data inicial: Jan/19 - Data final: Mai/24."]

{"sheet":"PFP1.2_Geo","index":2,"n_rows":45,"n_cols":7,"rows_kept":45,"cut":false,"hidden":true,"merged":[[5,0,5,3],[5,4,5,5],[3,0,3,6],[4,0,4,6],[0,0,1,5],[2,0,2,6],[38,0,38,5],[42,0,42,6],[6,0,6,3],[6,4,6,5],[44,0,44,6],[39,0,39,6],[40,0,40,6],[41,0,41,6],[43,0,43,6]]}
["SERVIÇOS GEOLÓGICOS/GEOTÉCNICOS",{"$nulls":5},"CODIGO:"]
[{"$nulls":6},"PFP-1.2"]
[{"$f":"PFP!A3","v":"ADAPTAÇÃO DO PROJETO EXECUTIVO DO SISTEMA ADUTOR DE MARCOLÂNDIA-PI E DISTRITO DE SERRÂNIA (ARARIPINA-PE)"}]
["NOME DA EMPRESA:"]
[]
["PROJETO:",null,null,null,"CONTRATANTE:",null,{"$f":"PFP!J7","v":"BASE:"}]
[{"$f":"PFP!A8","v":"ADAPTAÇÃO DO PROJETO EXECUTIVO DO SISTEMA ADUTOR DE MARCOLÂNDIA-PI E DISTRITO DE SERRÂNIA (ARARIPINA-PE)"},null,null,null,{"$f":"PFP!F8","v":"CODEVASF (7SR)"},null,{"$f":"PFP!J8","v":"SICRO: abr/24\nCODE: out/24*\n"}]
["Cod.","Base","Insumos","Uni","Qde","Preço Unitário\n(PU)","Preço Total\n(PT)"]
["GT08","CODE","SONDAGEM À PERCUSSÃO: MOBILIZAÇÃO E DESMOBILIZAÇÃO DE EQUIPAMENTOS","und",null,1014.41,{"$f":"ROUND(F9*E9,2)","v":0}]
["GT09","CODE","SONDAGEM À PERCUSSÃO COM SPT","m",null,88.96,0]
["GT10","CODE","SONDAGEM À PERCUSSÃO: DESLOCAMENTO DE 0 A 200 METROS","und",null,770.99,0]
["GT11","CODE","SONDAGEM À PERCUSSÃO: DESLOCAMENTO DE 201 A 500 METROS","und",null,1146.5999999999999,0]
["GT12","CODE","SONDAGEM À PERCUSSÃO: DESLOCAMENTO ACIMA DE 500 METROS","und",null,1522.21,0]
["GT14","CODE","SONDAGEM A TRADO (4\")","m",null,76.849999999999994,0]
["GT16","CODE","Ensaio: UMIDADE NATURAL ","und",null,83.56,0]
["GT17","CODE","Ensaio: DENSIDADE NATURAL ","und",null,83.56,0]
["GT18","CODE","Ensaio: LIMITE DE LIQUIDEZ ","und",null,114.68,0]
["GT19","CODE","Ensaio: LIMITE DE PLASTICIDADE ","und",null,114.68,0]
["GT20","CODE","Ensaio: GRANULOMETRIA POR PENEIRAMENTO ","und",null,131.27000000000001,0]
["GT21","CODE","Ensaio: GRANULOMETRIA POR SEDIMENTAÇÃO ","und",null,395.54,0]
["GT22","CODE","Ensaio: ENSAIO COMPACTAÇÃO PROCTOR NORMAL ","und",null,167.53,0]
["GT23","CODE","Ensaio: MASSA ESPECIFICA REAL DOS GRÃOS ","und",null,113.72,0]
["GT28","CODE","Ensaio: GRANULOMETRIA COMPARATIVA ","und",null,238.25,0]
["GT29","CODE","Ensaio: CRUMB TEST ","und",null,88.31,0]
["GT30","CODE","Ensaio: INFILTRAÇÃO ","und",null,238.25,0]
["GT31","CODE","Ensaio: ENSAIO DE PERDA D'AGUA ( ESTÁGIOS) ","und",null,376.26,0]
["GT32","CODE","Ensaio: ANÁLISE QUÍMICA DA AREIA ","und",null,478.89,0]
["GT33","CODE","Ensaio: MINERALOGIA DA AREIA ","und",null,550.79999999999995,0]
["GT34","CODE","Ensaio: MINERALOGIA ","und",null,550.79999999999995,0]
["GT37","CODE","Ensaio: PERMEABILIDADE VERTICAL DE CARGA VARIAVEL ","und",null,677.49,0]
["GT39","CODE","Ensaio: PERMEABILIDADE \"IN SITU\" ","und",null,531.73,0]
{"$rows_empty":7}
["TOTAL SERVIÇOS GEOTÉCNICOS",{"$nulls":5},{"$f":"SUM(G9:G38)","v":0}]
["LEGENDA:"]
["Uni - unidade de medição do insumo;"]
["Qde - Quantidade do Insumo (não pode ocorrer alteração pela Licitante)"]
["PU - Preço Unitário (composições padrão da Codevasf, já incluso o FatorK)"]
["PT - Preço Total (incluído encargos, taxas e impostos) - PT = Qde x PU"]
["* atualizado com base na variação do índice setorial publicado na revista “Conjuntura Econômica” da Fundação Getúlio Vargas, correspondente à coluna 39 (Custo Nacional da Construção Civil) - Serviços de Consultoria; Data inicial: Jan/19 - Data final: mai/24."]

{"sheet":"PFP1.3_Amb","index":3,"n_rows":35,"n_cols":14,"rows_kept":35,"cut":false,"hidden":true,"merged":[[34,0,34,6],[33,0,33,6],[0,0,1,5],[2,0,2,6],[3,0,3,6],[4,0,4,3],[4,4,4,5],[5,0,5,3],[5,4,5,5],[28,0,28,5],[29,0,29,6],[30,0,30,6],[31,0,31,6],[32,0,32,6]]}
["SERVIÇOS ANÁLISE AMBIENTAL - QUALIDADE DA ÁGUA DO MANANCIAL",{"$nulls":5},"CODIGO:"]
[{"$nulls":6},"PFP-1.3"]
["NOME DA EMPRESA:"]
[{"$nulls":11},"Coluna 39 – Consultoria (Supervisão e Projetos)"]
["PROJETO:",null,null,null,"CONTRATANTE:",null,{"$f":"PFP!J7","v":"BASE:"},{"$nulls":4},"2021-07-01","2023-07-01"]
[{"$f":"PFP!A8","v":"ADAPTAÇÃO DO PROJETO EXECUTIVO DO SISTEMA ADUTOR DE MARCOLÂNDIA-PI E DISTRITO DE SERRÂNIA (ARARIPINA-PE)"},null,null,null,"CODEVASF 7ª/SR",null,{"$f":"PFP!J8","v":"SICRO: abr/24\nCODE: out/24*\n"},{"$nulls":4},251.077,287.45999999999998,{"$f":"ROUND(M6/L6,4)","v":1.1449}]
["Cod.","Base","Insumos","Uni","Qde","Preço Unitário (PU)","Preço Total (PT)",{"$nulls":4},"Preço Unitário (PU)","Preço Unitário (PU)"]
["AM01","PROP","Alcalinidade Total","un",2,47.5,{"$f":"ROUND(E8*F8,2)","v":95},{"$nulls":4},41.49,{"$f":"ROUND(L8*$N$6,2)","v":47.5}]
["AM02","PROP","Condutividade","un",2,48.29,{"$f":"ROUND(E9*F9,2)","v":96.58},{"$nulls":4},42.18,{"$f":"ROUND(L9*$N$6,2)","v":48.29}]
["AM03","PROP","DBO","un",2,46.56,93.12,{"$nulls":4},40.67,46.56]
["AM04","PROP","DQO","un",2,56.73,113.46,{"$nulls":4},49.55,56.73]
["AM05","PROP","Salinidade","un",2,53.46,106.92,{"$nulls":4},46.69,53.46]
["AM06","PROP","Sólidos Dissolvidos Totais","un",2,39.51,79.02,{"$nulls":4},34.51,39.51]
["AM07","PROP","Sólidos Suspensos","un",2,43.13,86.26,{"$nulls":4},37.67,43.13]
["AM08","PROP","Sólidos Totais","un",2,39.51,79.02,{"$nulls":4},34.51,39.51]
["AM09","PROP","Turbidez","un",2,29.42,58.84,{"$nulls":4},25.7,29.42]
["AM10","PROP","Oxigênio Dissolvido","un",2,46.57,93.14,{"$nulls":4},40.68,46.57]
["AM11","PROP","pH","un",2,27.4,54.8,{"$nulls":4},23.93,27.4]
["AM12","PROP","Temperatura","un",2,27.25,54.5,{"$nulls":4},23.8,27.25]
["AM13","PROP","Fósforo Total","un",2,52.63,105.26,{"$nulls":4},45.97,52.63]
["AM14","PROP","Nitrogênio Amoniacal","un",2,55.83,111.66,{"$nulls":4},48.76,55.83]
["AM15","PROP","Nitrogênio Nitrato","un",2,41.51,83.02,{"$nulls":4},36.26,41.51]
["AM16","PROP","Nitrogênio Total","un",2,48.73,97.46,{"$nulls":4},42.56,48.73]
["AM17","PROP","Clorofila A","un",2,138.9,277.8,{"$nulls":4},121.32,138.9]
["AM18","PROP","Coliformes Termotolerantes","un",2,39.08,78.16,{"$nulls":4},34.130000000000003,39.08]
["AM19","PROP","Metais Pesados","un",2,194.48,388.96,{"$nulls":4},169.87,194.48]
["AM20","PROP","Organoclorados","un",2,103.69,207.38,{"$nulls":4},90.57,103.69]
["AM21","PROP","Organofosforado","un",2,91.89,183.78,{"$nulls":4},80.260000000000005,91.89]
["TOTAL SERVIÇOS GEOTÉCNICOS",{"$nulls":5},{"$f":"SUM(G8:G27)","v":2360.36}]
["LEGENDA:"]
["Uni - unidade de medição do insumo;"]
["Qde - Quantidade do Insumo (não pode ocorrer alteração pela Licitante)"]
["PU - Preço Unitário (composições padrão da Codevasf, já incluso o FatorK)"]
["PT - Preço Total (incluído encargos, taxas e impostos) - PT = Qde x PU"]
["* atualizado com base na variação do índice setorial publicado na revista “Conjuntura Econômica” da Fundação Getúlio Vargas, correspondente à coluna 39 (Custo Nacional da Construção Civil) - Serviços de Consultoria; Data inicial: Jul/21 - Data final: jul/23."]

{"sheet":"PFP2.1_FatorKa","index":4,"n_rows":45,"n_cols":6,"rows_kept":45,"cut":false,"hidden":false,"merged":[[7,1,7,3],[36,1,36,3],[38,1,38,3],[39,1,39,3],[21,1,21,3],[22,1,22,3],[23,1,23,3],[24,1,24,3],[27,1,27,3],[28,1,28,3],[8,1,8,3],[18,1,18,3],[9,1,9,3],[14,1,14,3],[15,1,15,3],[16,1,16,3],[0,0,1,4],[3,0,3,5],[6,0,6,1],[6,2,6,4],[5,2,5,4],[4,0,4,5],[2,0,2,5],[17,1,17,3],[10,1,10,3],[11,1,11,3],[12,1,12,3],[13,1,13,3],[19,1,19,3],[20,1,20,3],[25,1,25,3],[44,0,44,5],[43,0,43,5],[42,0,42,5],[41,0,41,5],[26,1,26,3],[33,1,33,3],[34,1,34,3],[32,1,32,3],[29,1,29,3],[30,1,30,3],[31,1,31,3],[37,1,37,3],[35,1,35,3]]}
["DETALHAMENTO DOS ENCARGOS SOCIAIS: Ka",{"$nulls":4},"CODIGO:"]
[{"$nulls":5},"PFP-2.1"]
[{"$f":"PFP!A3","v":"ADAPTAÇÃO DO PROJETO EXECUTIVO DO SISTEMA ADUTOR DE MARCOLÂNDIA-PI E DISTRITO DE SERRÂNIA (ARARIPINA-PE)"}]
["NOME DA CONSULTORA:"]
[]
["PROJETO:",null,"CONTRATANTE:",null,null,{"$f":"PFP!J7","v":"BASE:"}]
[{"$f":"PFP!A8","v":"ADAPTAÇÃO DO PROJETO EXECUTIVO DO SISTEMA ADUTOR DE MARCOLÂNDIA-PI E DISTRITO DE SERRÂNIA (ARARIPINA-PE)"},null,{"$f":"PFP!F8","v":"CODEVASF (7SR)"},null,null,{"$f":"CONCATENATE(PFP!J8,\"E.S. = SINAPI - PI\")","v":"SICRO: abr/24\nCODE: out/24*\nE.S. = SINAPI - PI"}]
["Cod","DESCRIÇÃO",null,null,"%","R$"]
["A","ENCARGOS SOCIAIS BÁSICOS",null,null,{"$f":"ROUND(SUM(E10:E18),4)","v":0.36799999999999999},{"$f":"ROUND(E9*SUMIF(PFP!$B$10:$B$18,\"MO1\",PFP!$J$10:$J$18),2)","v":14916.08}]
["A1","INSS",null,null,0.2,{"$f":"ROUND(E10*SUMIF(PFP!$B$10:$B$18,\"MO1\",PFP!$J$10:$J$18),2)","v":8106.57}]
["A2","SESI",null,null,1.4999999999999999E-2,{"$f":"ROUND(E11*SUMIF(PFP!$B$10:$B$18,\"MO1\",PFP!$J$10:$J$18),2)","v":607.99}]
["A3","SENAI",null,null,0.01,{"$f":"ROUND(E12*SUMIF(PFP!$B$10:$B$18,\"MO1\",PFP!$J$10:$J$18),2)","v":405.33}]
["A4","INCRA",null,null,2E-3,{"$f":"ROUND(E13*SUMIF(PFP!$B$10:$B$18,\"MO1\",PFP!$J$10:$J$18),2)","v":81.069999999999993}]
["A5","SEBRAE",null,null,6.0000000000000001E-3,{"$f":"ROUND(E14*SUMIF(PFP!$B$10:$B$18,\"MO1\",PFP!$J$10:$J$18),2)","v":243.2}]
["A6","Salário Educação",null,null,2.5000000000000001E-2,{"$f":"ROUND(E15*SUMIF(PFP!$B$10:$B$18,\"MO1\",PFP!$J$10:$J$18),2)","v":1013.32}]
["A7","Seguro Contra Acidentes de Trabalho",null,null,0.03,{"$f":"ROUND(E16*SUMIF(PFP!$B$10:$B$18,\"MO1\",PFP!$J$10:$J$18),2)","v":1215.98}]
["A8","FGTS",null,null,0.08,{"$f":"ROUND(E17*SUMIF(PFP!$B$10:$B$18,\"MO1\",PFP!$J$10:$J$18),2)","v":3242.63}]
["A9","SECONCI",null,null,0,{"$f":"ROUND(E18*SUMIF(PFP!$B$10:$B$18,\"MO1\",PFP!$J$10:$J$18),2)","v":0}]
["B"," ENCARGOS SOCIAIS QUE RECEBEM INCIDÊNCIA DE \"A\"",null,null,{"$f":"ROUND(SUM(E22:E29),4)","v":0.20019999999999999},{"$f":"ROUND(E19*SUMIF(PFP!$B$10:$B$18,\"MO1\",PFP!$J$10:$J$18),2)","v":8114.67}]
["B1","Repouso Semanal Remunerado",null,null,0,{"$f":"ROUND(E20*SUMIF(PFP!$B$10:$B$18,\"MO1\",PFP!$J$10:$J$18),2)","v":0}]
["B2","Feriados",null,null,0,{"$f":"ROUND(E21*SUMIF(PFP!$B$10:$B$18,\"MO1\",PFP!$J$10:$J$18),2)","v":0}]
["B3","Auxílio Enfermidade",null,null,6.4000000000000003E-3,{"$f":"ROUND(E22*SUMIF(PFP!$B$10:$B$18,\"MO1\",PFP!$J$10:$J$18),2)","v":259.41000000000003}]
["B4","13º Salário",null,null,8.3299999999999999E-2,{"$f":"ROUND(E23*SUMIF(PFP!$B$10:$B$18,\"MO1\",PFP!$J$10:$J$18),2)","v":3376.38}]
["B5","Licença Paternidade",null,null,4.0000000000000002E-4,{"$f":"ROUND(E24*SUMIF(PFP!$B$10:$B$18,\"MO1\",PFP!$J$10:$J$18),2)","v":16.21}]
["B6","Faltas Justificadas",null,null,5.5999999999999999E-3,{"$f":"ROUND(E25*SUMIF(PFP!$B$10:$B$18,\"MO1\",PFP!$J$10:$J$18),2)","v":226.98}]
["B7","Dias de Chuva",null,null,0,{"$f":"ROUND(E26*SUMIF(PFP!$B$10:$B$18,\"MO1\",PFP!$J$10:$J$18),2)","v":0}]
["B8","Auxílio Acidente de Trabalho",null,null,8.0000000000000004E-4,{"$f":"ROUND(E27*SUMIF(PFP!$B$10:$B$18,\"MO1\",PFP!$J$10:$J$18),2)","v":32.43}]
["B9","Férias Gozadas",null,null,0.10340000000000001,{"$f":"ROUND(E28*SUMIF(PFP!$B$10:$B$18,\"MO1\",PFP!$J$10:$J$18),2)","v":4191.09}]
["B10","Salário Maternidade",null,null,2.9999999999999997E-4,{"$f":"ROUND(E29*SUMIF(PFP!$B$10:$B$18,\"MO1\",PFP!$J$10:$J$18),2)","v":12.16}]
["C"," ENCARGOS SOCIAIS QUE NÃO RECEBEM INCIDÊNCIA DE \"A\"",null,null,{"$f":"ROUND(SUM(E31:E35),4)","v":7.0699999999999999E-2},{"$f":"ROUND(E30*SUMIF(PFP!$B$10:$B$18,\"MO1\",PFP!$J$10:$J$18),2)","v":2865.67}]
["C1","Aviso Prévio Indenizado",null,null,4.0300000000000002E-2,{"$f":"ROUND(E31*SUMIF(PFP!$B$10:$B$18,\"MO1\",PFP!$J$10:$J$18),2)","v":1633.47}]
["C2","Aviso Prévio Trabalhado",null,null,8.9999999999999998E-4,{"$f":"ROUND(E32*SUMIF(PFP!$B$10:$B$18,\"MO1\",PFP!$J$10:$J$18),2)","v":36.479999999999997}]
["C3","Férias Indenizadas",null,null,7.1999999999999998E-3,{"$f":"ROUND(E33*SUMIF(PFP!$B$10:$B$18,\"MO1\",PFP!$J$10:$J$18),2)","v":291.83999999999997}]
["C4","Depósito Rescisão Sem Justa Causa",null,null,1.89E-2,{"$f":"ROUND(E34*SUMIF(PFP!$B$10:$B$18,\"MO1\",PFP!$J$10:$J$18),2)","v":766.07}]
["C5","Indenização Adicional",null,null,3.3999999999999998E-3,{"$f":"ROUND(E35*SUMIF(PFP!$B$10:$B$18,\"MO1\",PFP!$J$10:$J$18),2)","v":137.81}]
["D"," REINCIDÊNCIAS",null,null,{"$f":"ROUND(SUM(E37:E38),4)","v":7.7299999999999994E-2},{"$f":"ROUND(E36*SUMIF(PFP!$B$10:$B$18,\"MO1\",PFP!$J$10:$J$18),2)","v":3133.19}]
["D1","Reincidência de \"A\" sobre \"B\"",null,null,{"$f":"ROUND(E9*E19,4)","v":7.3700000000000002E-2},{"$f":"ROUND(E37*SUMIF(PFP!$B$10:$B$18,\"MO1\",PFP!$J$10:$J$18),2)","v":2987.27}]
["D2","Reincidência de \"A\" sobre Aviso Prévio Trabalhado e reincidência do FGTS sobre Aviso Prévio Indenizado",null,null,{"$f":"ROUND((E32*E9)+(E31*E17),4)","v":3.5999999999999999E-3},{"$f":"ROUND(E38*SUMIF(PFP!$B$10:$B$18,\"MO1\",PFP!$J$10:$J$18),2)","v":145.91999999999999}]
["K1","ENCARGOS SOCIAIS",null,null,{"$f":"ROUND(E9+E19+E30+E36,4)","v":0.71619999999999995},{"$f":"ROUND(E39*SUMIF(PFP!$B$10:$B$18,\"MO1\",PFP!$J$10:$J$18),2)","v":29029.61}]
["Ka","TAXA DE RESSARCIMENTO DE DESPESAS E ENCARGOS SOBRE MO1",null,null,{"$f":"ROUND((1+E39+PFP3_FatorKd!E14)*(1+PFP3_FatorKd!E13)*(1+PFP3_FatorKd!E9),4)","v":2.3435000000000001}]
["OBSERVAÇÃO:"]
["1 - DISCRIMINAR OS ENCARGOS SOCIAIS COM SEUS RESPECTIVOS PERCENTUAS TOTALIZANDO OS MESMOS. "]
["2 - APLICAR O  % TOTAL P/ CALCULAR OS E. SOCIAIS INCIDENTES NA MÃO-DE-OBRA COM VÍNCULO PERMANENTE"]
["Ka - Taxa de Ressarcimento de Despesas e Encargos sobre a Mão de Obra COM VINCULO (incide apenas no Insumo Codigo MO1)"]
["Ka = (1 + K1 + K2) x (1 + K3) x (1 + K4)"]

{"sheet":"PFP2.2_FatorKb","index":5,"n_rows":45,"n_cols":6,"rows_kept":45,"cut":false,"hidden":false,"merged":[[22,1,22,3],[0,0,1,4],[3,0,3,5],[4,0,4,5],[5,2,5,4],[6,0,6,1],[6,2,6,4],[8,1,8,3],[18,1,18,3],[21,1,21,3],[9,1,9,3],[10,1,10,3],[11,1,11,3],[17,1,17,3],[7,1,7,3],[13,1,13,3],[44,0,44,5],[41,0,41,5],[42,0,42,5],[43,0,43,5],[36,1,36,3],[37,1,37,3],[38,1,38,3],[39,1,39,3],[35,1,35,3],[23,1,23,3],[24,1,24,3],[26,1,26,3],[27,1,27,3],[28,1,28,3],[29,1,29,3],[30,1,30,3],[31,1,31,3],[32,1,32,3],[33,1,33,3],[34,1,34,3],[25,1,25,3],[19,1,19,3],[20,1,20,3],[2,0,2,5],[14,1,14,3],[15,1,15,3],[16,1,16,3],[12,1,12,3]]}
["DETALHAMENTO DOS ENCARGOS SOCIAIS: Kb",{"$nulls":4},"CODIGO:"]
[{"$nulls":5},"PFP-2.2"]
[{"$f":"PFP!A3","v":"ADAPTAÇÃO DO PROJETO EXECUTIVO DO SISTEMA ADUTOR DE MARCOLÂNDIA-PI E DISTRITO DE SERRÂNIA (ARARIPINA-PE)"}]
["NOME DA CONSULTORA:"]
[]
["PROJETO:",null,"CONTRATANTE:",null,null,{"$f":"PFP!J7","v":"BASE:"}]
[{"$f":"PFP!A8","v":"ADAPTAÇÃO DO PROJETO EXECUTIVO DO SISTEMA ADUTOR DE MARCOLÂNDIA-PI E DISTRITO DE SERRÂNIA (ARARIPINA-PE)"},null,{"$f":"PFP!F8","v":"CODEVASF (7SR)"},null,null,{"$f":"'PFP2.1_FatorKa'!F7","v":"SICRO: abr/24\nCODE: out/24*\nE.S. = SINAPI - PI"}]
["Cod","DESCRIÇÃO",null,null,"%","R$"]
["A","ENCARGOS SOCIAIS BÁSICOS",null,null,{"$f":"ROUND(SUM(E10:E18),4)","v":0.2},{"$f":"ROUND(E9*SUMIF(PFP!$B$10:$B$18,\"MO2\",PFP!$J$10:$J$18),2)","v":2490.33}]
["A1","INSS",null,null,0.2,{"$f":"ROUND(E10*SUMIF(PFP!$B$10:$B$18,\"MO2\",PFP!$J$10:$J$18),2)","v":2490.33}]
["A2","SESI",null,null,0,{"$f":"ROUND(E11*SUMIF(PFP!$B$10:$B$18,\"MO2\",PFP!$J$10:$J$18),2)","v":0}]
["A3","SENAI",null,null,0,{"$f":"ROUND(E12*SUMIF(PFP!$B$10:$B$18,\"MO2\",PFP!$J$10:$J$18),2)","v":0}]
["A4","INCRA",null,null,0,{"$f":"ROUND(E13*SUMIF(PFP!$B$10:$B$18,\"MO2\",PFP!$J$10:$J$18),2)","v":0}]
["A5","SEBRAE",null,null,0,{"$f":"ROUND(E14*SUMIF(PFP!$B$10:$B$18,\"MO2\",PFP!$J$10:$J$18),2)","v":0}]
["A6","Salário Educação",null,null,0,{"$f":"ROUND(E15*SUMIF(PFP!$B$10:$B$18,\"MO2\",PFP!$J$10:$J$18),2)","v":0}]
["A7","Seguro Contra Acidentes de Trabalho",null,null,0,{"$f":"ROUND(E16*SUMIF(PFP!$B$10:$B$18,\"MO2\",PFP!$J$10:$J$18),2)","v":0}]
["A8","FGTS",null,null,0,{"$f":"ROUND(E17*SUMIF(PFP!$B$10:$B$18,\"MO2\",PFP!$J$10:$J$18),2)","v":0}]
["A9","SECONCI",null,null,0,{"$f":"ROUND(E18*SUMIF(PFP!$B$10:$B$18,\"MO2\",PFP!$J$10:$J$18),2)","v":0}]
["B"," ENCARGOS SOCIAIS QUE RECEBEM INCIDÊNCIA DE \"A\"",null,null,{"$f":"ROUND(SUM(E20:E29),4)","v":0},{"$f":"ROUND(E19*SUMIF(PFP!$B$10:$B$18,\"MO2\",PFP!$J$10:$J$18),2)","v":0}]
["B1","Repouso Semanal Remunerado",null,null,0,{"$f":"ROUND(E20*SUMIF(PFP!$B$10:$B$18,\"MO2\",PFP!$J$10:$J$18),2)","v":0}]
["B2","Feriados",null,null,0,{"$f":"ROUND(E21*SUMIF(PFP!$B$10:$B$18,\"MO2\",PFP!$J$10:$J$18),2)","v":0}]
["B3","Auxílio Enfermidade",null,null,0,{"$f":"ROUND(E22*SUMIF(PFP!$B$10:$B$18,\"MO2\",PFP!$J$10:$J$18),2)","v":0}]
["B4","13º Salário",null,null,0,{"$f":"ROUND(E23*SUMIF(PFP!$B$10:$B$18,\"MO2\",PFP!$J$10:$J$18),2)","v":0}]
["B5","Licença Paternidade",null,null,0,{"$f":"ROUND(E24*SUMIF(PFP!$B$10:$B$18,\"MO2\",PFP!$J$10:$J$18),2)","v":0}]
["B6","Faltas Justificadas",null,null,0,{"$f":"ROUND(E25*SUMIF(PFP!$B$10:$B$18,\"MO2\",PFP!$J$10:$J$18),2)","v":0}]
["B7","Dias de Chuva",null,null,0,{"$f":"ROUND(E26*SUMIF(PFP!$B$10:$B$18,\"MO2\",PFP!$J$10:$J$18),2)","v":0}]
["B8","Auxílio Acidente de Trabalho",null,null,0,{"$f":"ROUND(E27*SUMIF(PFP!$B$10:$B$18,\"MO2\",PFP!$J$10:$J$18),2)","v":0}]
["B9","Férias Gozadas",null,null,0,{"$f":"ROUND(E28*SUMIF(PFP!$B$10:$B$18,\"MO2\",PFP!$J$10:$J$18),2)","v":0}]
["B10","Salário Maternidade",null,null,0,{"$f":"ROUND(E29*SUMIF(PFP!$B$10:$B$18,\"MO2\",PFP!$J$10:$J$18),2)","v":0}]
["C"," ENCARGOS SOCIAIS QUE NÃO RECEBEM INCIDÊNCIA DE \"A\"",null,null,{"$f":"ROUND(SUM(E31:E35),4)","v":0},{"$f":"ROUND(E30*SUMIF(PFP!$B$10:$B$18,\"MO2\",PFP!$J$10:$J$18),2)","v":0}]
["C1","Aviso Prévio Indenizado",null,null,0,{"$f":"ROUND(E31*SUMIF(PFP!$B$10:$B$18,\"MO2\",PFP!$J$10:$J$18),2)","v":0}]
["C2","Aviso Prévio Trabalhado",null,null,0,{"$f":"ROUND(E32*SUMIF(PFP!$B$10:$B$18,\"MO2\",PFP!$J$10:$J$18),2)","v":0}]
["C3","Férias Indenizadas",null,null,0,{"$f":"ROUND(E33*SUMIF(PFP!$B$10:$B$18,\"MO2\",PFP!$J$10:$J$18),2)","v":0}]
["C4","Depósito Rescisão Sem Justa Causa",null,null,0,{"$f":"ROUND(E34*SUMIF(PFP!$B$10:$B$18,\"MO2\",PFP!$J$10:$J$18),2)","v":0}]
["C5","Indenização Adicional",null,null,0,{"$f":"ROUND(E35*SUMIF(PFP!$B$10:$B$18,\"MO2\",PFP!$J$10:$J$18),2)","v":0}]
["D"," REINCIDÊNCIAS",null,null,{"$f":"ROUND(SUM(E37:E38),4)","v":0},{"$f":"ROUND(E36*SUMIF(PFP!$B$10:$B$18,\"MO2\",PFP!$J$10:$J$18),2)","v":0}]
["D1","Reincidência de \"A\" sobre \"B\"",null,null,{"$f":"ROUND(E9*E19,4)","v":0},{"$f":"ROUND(E37*SUMIF(PFP!$B$10:$B$18,\"MO2\",PFP!$J$10:$J$18),2)","v":0}]
["D2","Reincidência de \"A\" sobre Aviso Prévio Trabalhado e reincidência do FGTS sobre Aviso Prévio Indenizado",null,null,{"$f":"ROUND(E9*E32,4)+ROUND(E31*E12,4)","v":0},{"$f":"ROUND(E38*SUMIF(PFP!$B$10:$B$18,\"MO2\",PFP!$J$10:$J$18),2)","v":0}]
["K1","ENCARGOS SOCIAIS",null,null,{"$f":"ROUND(E9+E19+E30+E36,4)","v":0.2},{"$f":"ROUND(E39*SUMIF(PFP!$B$10:$B$18,\"MO2\",PFP!$J$10:$J$18),2)","v":2490.33}]
["Kb","TAXA DE RESSARCIMENTO DE DESPESAS E ENCARGOS SOBRE MO2",null,null,{"$f":"ROUND((1+E39+PFP3_FatorKd!E14)*(1+PFP3_FatorKd!E13)*(1+PFP3_FatorKd!E9),4)","v":1.6953}]
["OBSERVAÇÃO:"]
["1 - DISCRIMINAR OS ENCARGOS SOCIAIS COM SEUS RESPECTIVOS PERCENTUAS TOTALIZANDO OS MESMOS. "]
["2 - APLICAR O % TOTAL P/ CALCULAR OS E. SOCIAIS INCIDENTES NA MÃO-DE-OBRA SEM VÍNCULO PERMANENTE"]
["Kb - Taxa de Ressarcimento de Despesas e Encargos sobre a Mão de Obra SEM VINCULO (incide apenas no Insumo Codigo MO2)"]
["Kb = (1 + K1 + K2) x (1 + K3) x (1 + K4)"]

{"sheet":"PFP2.3_FatorKc","index":6,"n_rows":45,"n_cols":6,"rows_kept":45,"cut":false,"hidden":false,"merged":[[43,0,43,5],[44,0,44,5],[34,1,34,3],[35,1,35,3],[36,1,36,3],[37,1,37,3],[38,1,38,3],[39,1,39,3],[41,0,41,5],[42,0,42,5],[33,1,33,3],[21,1,21,3],[22,1,22,3],[23,1,23,3],[24,1,24,3],[26,1,26,3],[27,1,27,3],[28,1,28,3],[29,1,29,3],[30,1,30,3],[31,1,31,3],[32,1,32,3],[12,1,12,3],[13,1,13,3],[19,1,19,3],[20,1,20,3],[25,1,25,3],[14,1,14,3],[15,1,15,3],[16,1,16,3],[17,1,17,3],[18,1,18,3],[7,1,7,3],[8,1,8,3],[9,1,9,3],[10,1,10,3],[11,1,11,3],[0,0,1,4],[3,0,3,5],[4,0,4,5],[5,2,5,4],[6,0,6,1],[6,2,6,4],[2,0,2,5]]}
["DETALHAMENTO DOS ENCARGOS SOCIAIS: Kc",{"$nulls":4},"CODIGO:"]
[{"$nulls":5},"PFP-2.3"]
[{"$f":"PFP!A3","v":"ADAPTAÇÃO DO PROJETO EXECUTIVO DO SISTEMA ADUTOR DE MARCOLÂNDIA-PI E DISTRITO DE SERRÂNIA (ARARIPINA-PE)"}]
["NOME DA CONSULTORA:"]
[]
["PROJETO:",null,"CONTRATANTE:",null,null,{"$f":"PFP!J7","v":"BASE:"}]
[{"$f":"PFP!A8","v":"ADAPTAÇÃO DO PROJETO EXECUTIVO DO SISTEMA ADUTOR DE MARCOLÂNDIA-PI E DISTRITO DE SERRÂNIA (ARARIPINA-PE)"},null,{"$f":"PFP!F8","v":"CODEVASF (7SR)"},null,null,{"$f":"'PFP2.1_FatorKa'!F7","v":"SICRO: abr/24\nCODE: out/24*\nE.S. = SINAPI - PI"}]
["Cod","DESCRIÇÃO",null,null,"%","R$"]
["A","ENCARGOS SOCIAIS BÁSICOS",null,null,{"$f":"ROUND(SUM(E10:E18),4)","v":0},{"$f":"ROUND(E9*SUMIF(PFP!$B$10:$B$18,\"MO3\",PFP!$J$10:$J$18),2)","v":0}]
["A1","INSS",null,null,0,{"$f":"ROUND(E10*SUMIF(PFP!$B$10:$B$18,\"MO3\",PFP!$J$10:$J$18),2)","v":0}]
["A2","SESI",null,null,0,{"$f":"ROUND(E11*SUMIF(PFP!$B$10:$B$18,\"MO3\",PFP!$J$10:$J$18),2)","v":0}]
["A3","SENAI",null,null,0,{"$f":"ROUND(E12*SUMIF(PFP!$B$10:$B$18,\"MO3\",PFP!$J$10:$J$18),2)","v":0}]
["A4","INCRA",null,null,0,{"$f":"ROUND(E13*SUMIF(PFP!$B$10:$B$18,\"MO3\",PFP!$J$10:$J$18),2)","v":0}]
["A5","SEBRAE",null,null,0,{"$f":"ROUND(E14*SUMIF(PFP!$B$10:$B$18,\"MO3\",PFP!$J$10:$J$18),2)","v":0}]
["A6","Salário Educação",null,null,0,{"$f":"ROUND(E15*SUMIF(PFP!$B$10:$B$18,\"MO3\",PFP!$J$10:$J$18),2)","v":0}]
["A7","Seguro Contra Acidentes de Trabalho",null,null,0,{"$f":"ROUND(E16*SUMIF(PFP!$B$10:$B$18,\"MO3\",PFP!$J$10:$J$18),2)","v":0}]
["A8","FGTS",null,null,0,{"$f":"ROUND(E17*SUMIF(PFP!$B$10:$B$18,\"MO3\",PFP!$J$10:$J$18),2)","v":0}]
["A9","SECONCI",null,null,0,{"$f":"ROUND(E18*SUMIF(PFP!$B$10:$B$18,\"MO3\",PFP!$J$10:$J$18),2)","v":0}]
["B"," ENCARGOS SOCIAIS QUE RECEBEM INCIDÊNCIA DE \"A\"",null,null,{"$f":"ROUND(SUM(E20:E29),4)","v":0},{"$f":"ROUND(E19*SUMIF(PFP!$B$10:$B$18,\"MO3\",PFP!$J$10:$J$18),2)","v":0}]
["B1","Repouso Semanal Remunerado",null,null,0,{"$f":"ROUND(E20*SUMIF(PFP!$B$10:$B$18,\"MO3\",PFP!$J$10:$J$18),2)","v":0}]
["B2","Feriados",null,null,0,{"$f":"ROUND(E21*SUMIF(PFP!$B$10:$B$18,\"MO3\",PFP!$J$10:$J$18),2)","v":0}]
["B3","Auxílio Enfermidade",null,null,0,{"$f":"ROUND(E22*SUMIF(PFP!$B$10:$B$18,\"MO3\",PFP!$J$10:$J$18),2)","v":0}]
["B4","13º Salário",null,null,0,{"$f":"ROUND(E23*SUMIF(PFP!$B$10:$B$18,\"MO3\",PFP!$J$10:$J$18),2)","v":0}]
["B5","Licença Paternidade",null,null,0,{"$f":"ROUND(E24*SUMIF(PFP!$B$10:$B$18,\"MO3\",PFP!$J$10:$J$18),2)","v":0}]
["B6","Faltas Justificadas",null,null,0,{"$f":"ROUND(E25*SUMIF(PFP!$B$10:$B$18,\"MO3\",PFP!$J$10:$J$18),2)","v":0}]
["B7","Dias de Chuva",null,null,0,{"$f":"ROUND(E26*SUMIF(PFP!$B$10:$B$18,\"MO3\",PFP!$J$10:$J$18),2)","v":0}]
["B8","Auxílio Acidente de Trabalho",null,null,0,{"$f":"ROUND(E27*SUMIF(PFP!$B$10:$B$18,\"MO3\",PFP!$J$10:$J$18),2)","v":0}]
["B9","Férias Gozadas",null,null,0,{"$f":"ROUND(E28*SUMIF(PFP!$B$10:$B$18,\"MO3\",PFP!$J$10:$J$18),2)","v":0}]
["B10","Salário Maternidade",null,null,0,{"$f":"ROUND(E29*SUMIF(PFP!$B$10:$B$18,\"MO3\",PFP!$J$10:$J$18),2)","v":0}]
["C"," ENCARGOS SOCIAIS QUE NÃO RECEBEM INCIDÊNCIA DE \"A\"",null,null,{"$f":"ROUND(SUM(E31:E35),4)","v":0},{"$f":"ROUND(E30*SUMIF(PFP!$B$10:$B$18,\"MO3\",PFP!$J$10:$J$18),2)","v":0}]
["C1","Aviso Prévio Indenizado",null,null,0,{"$f":"ROUND(E31*SUMIF(PFP!$B$10:$B$18,\"MO3\",PFP!$J$10:$J$18),2)","v":0}]
["C2","Aviso Prévio Trabalhado",null,null,0,{"$f":"ROUND(E32*SUMIF(PFP!$B$10:$B$18,\"MO3\",PFP!$J$10:$J$18),2)","v":0}]
["C3","Férias Indenizadas",null,null,0,{"$f":"ROUND(E33*SUMIF(PFP!$B$10:$B$18,\"MO3\",PFP!$J$10:$J$18),2)","v":0}]
["C4","Depósito Rescisão Sem Justa Causa",null,null,0,{"$f":"ROUND(E34*SUMIF(PFP!$B$10:$B$18,\"MO3\",PFP!$J$10:$J$18),2)","v":0}]
["C5","Indenização Adicional",null,null,0,{"$f":"ROUND(E35*SUMIF(PFP!$B$10:$B$18,\"MO3\",PFP!$J$10:$J$18),2)","v":0}]
["D"," REINCIDÊNCIAS",null,null,{"$f":"ROUND(SUM(E37:E38),4)","v":0},{"$f":"ROUND(E36*SUMIF(PFP!$B$10:$B$18,\"MO3\",PFP!$J$10:$J$18),2)","v":0}]
["D1","Reincidência de \"A\" sobre \"B\"",null,null,{"$f":"ROUND(E9*E19,4)","v":0},{"$f":"ROUND(E37*SUMIF(PFP!$B$10:$B$18,\"MO3\",PFP!$J$10:$J$18),2)","v":0}]
["D2","Reincidência de \"A\" sobre Aviso Prévio Trabalhado e reincidência do FGTS sobre Aviso Prévio Indenizado",null,null,{"$f":"ROUND(E9*E32,4)+ROUND(E31*E12,4)","v":0},{"$f":"ROUND(E38*SUMIF(PFP!$B$10:$B$18,\"MO3\",PFP!$J$10:$J$18),2)","v":0}]
["K1","ENCARGOS SOCIAIS",null,null,{"$f":"ROUND(E9+E19+E30+E36,4)","v":0},{"$f":"ROUND(E39*SUMIF(PFP!$B$10:$B$18,\"MO3\",PFP!$J$10:$J$18),2)","v":0}]
["Kc","TAXA DE RESSARCIMENTO DE DESPESAS E ENCARGOS SOBRE MO2",null,null,{"$f":"ROUND((1+E39+PFP3_FatorKd!E14)*(1+PFP3_FatorKd!E13)*(1+PFP3_FatorKd!E9),4)","v":1.4440999999999999}]
["OBSERVAÇÃO:"]
["1 - DISCRIMINAR OS ENCARGOS SOCIAIS COM SEUS RESPECTIVOS PERCENTUAS TOTALIZANDO OS MESMOS. "]
["2 - APLICAR O % TOTAL P/ CALCULAR OS E. SOCIAIS INCIDENTES NA MÃO-DE-OBRA DE SOCIETÁRIOS"]
["Kc - Taxa de Ressarcimento de Despesas e Encargos sobre a Mão de Obra SOCIETÁRIA (incide apenas no Insumo Codigo MO3)"]
["Kc = (1 + K1 + K2) x (1 + K3) x (1 + K4)"]

{"sheet":"PFP3_FatorKd","index":7,"n_rows":36,"n_cols":6,"rows_kept":36,"cut":false,"hidden":false,"merged":[[34,0,34,5],[35,0,35,5],[17,1,17,3],[14,1,14,3],[15,1,15,3],[16,1,16,3],[22,0,22,5],[27,0,27,5],[28,0,28,5],[23,0,23,5],[24,0,24,5],[25,0,25,5],[29,0,29,5],[30,0,30,5],[31,0,31,5],[32,0,32,5],[8,1,8,2],[26,0,26,5],[7,1,7,2],[0,0,1,4],[3,0,3,5],[6,0,6,1],[6,2,6,4],[5,2,5,4],[4,0,4,5],[2,0,2,5],[33,0,33,5],[13,1,13,3],[12,1,12,3],[9,1,9,2],[10,1,10,2],[11,1,11,2]]}
["DESPESAS FISCAIS E CUSTOS DIVERSOS: Kd",{"$nulls":4},"CODIGO:"]
[{"$nulls":5},"PFP-3"]
[{"$f":"PFP!A3","v":"ADAPTAÇÃO DO PROJETO EXECUTIVO DO SISTEMA ADUTOR DE MARCOLÂNDIA-PI E DISTRITO DE SERRÂNIA (ARARIPINA-PE)"}]
["NOME DA CONSULTORA:"]
[]
["PROJETO:",null,"CONTRATANTE:",null,null,{"$f":"PFP!J7","v":"BASE:"}]
[{"$f":"PFP!A8","v":"ADAPTAÇÃO DO PROJETO EXECUTIVO DO SISTEMA ADUTOR DE MARCOLÂNDIA-PI E DISTRITO DE SERRÂNIA (ARARIPINA-PE)"},null,"CODEVASF (SEDE)",null,null,{"$f":"PFP!J8","v":"SICRO: abr/24\nCODE: out/24*\n"}]
["Cod","DESCRIÇÃO1",null,"% preço2","% custo4","R$"]
["K4","TAXAS E IMPOSTOS",null,{"$f":"ROUND(D10+D11+D12,4)","v":0.124},{"$f":"ROUND(E10+E11+E12,4)","v":0.1416},{"$f":"E9*SUM(SUMIF(PFP!$B$10:$B$18,\"MO1\",PFP!$J$10:$J$18)*(1+'PFP2.1_FatorKa'!$E$39)+SUMIF(PFP!$B$10:$B$18,\"MO2\",PFP!$J$10:$J$18)*(1+'PFP2.2_FatorKb'!$E$39)+SUMIF(PFP!$B$10:$B$18,\"<>MO*\",PFP!$J$10:$J$18)+$F$14+$F$13)","v":15171.590786652958}]
["K4.1","ISS",null,0.05,{"$f":"ROUND((1/(1-$D$9))*D10,4)","v":5.7099999999999998E-2},{"$f":"E10*SUM(SUMIF(PFP!$B$10:$B$18,\"MO1\",PFP!$J$10:$J$18)*(1+'PFP2.1_FatorKa'!$E$39)+SUMIF(PFP!$B$10:$B$18,\"MO2\",PFP!$J$10:$J$18)*(1+'PFP2.2_FatorKb'!$E$39)+SUMIF(PFP!$B$10:$B$18,\"<>MO*\",PFP!$J$10:$J$18)+$F$14+$F$13)","v":6117.9225559172592}]
["K4.2","PIS3 - aliquota efetiva com percentual-desconto",null,{"$f":"ROUND(1.65%*0.8,4)","v":1.32E-2},{"$f":"ROUND((1/(1-$D$9))*D11,4)","v":1.5100000000000001E-2},{"$f":"E11*SUM(SUMIF(PFP!$B$10:$B$18,\"MO1\",PFP!$J$10:$J$18)*(1+'PFP2.1_FatorKa'!$E$39)+SUMIF(PFP!$B$10:$B$18,\"MO2\",PFP!$J$10:$J$18)*(1+'PFP2.2_FatorKb'!$E$39)+SUMIF(PFP!$B$10:$B$18,\"<>MO*\",PFP!$J$10:$J$18)+$F$14+$F$13)","v":1617.8744412320598}]
["K4.3","COFINS3 - aliquota efetiva com percentual-desconto",null,{"$f":"ROUND(7.6%*0.8,4)","v":6.08E-2},{"$f":"ROUND((1/(1-$D$9))*D12,4)","v":6.9400000000000003E-2},{"$f":"E12*SUM(SUMIF(PFP!$B$10:$B$18,\"MO1\",PFP!$J$10:$J$18)*(1+'PFP2.1_FatorKa'!$E$39)+SUMIF(PFP!$B$10:$B$18,\"MO2\",PFP!$J$10:$J$18)*(1+'PFP2.2_FatorKb'!$E$39)+SUMIF(PFP!$B$10:$B$18,\"<>MO*\",PFP!$J$10:$J$18)+$F$14+$F$13)","v":7435.7937895036393}]
["K3","REMUNERAÇÃO DA EMPRESA (LUCRO)",null,null,0.1,{"$f":"E13*SUM(SUMIF(PFP!$B$10:$B$18,\"MO1\",PFP!$J$10:$J$18)*(1+'PFP2.1_FatorKa'!$E$39)+SUMIF(PFP!$B$10:$B$18,\"MO2\",PFP!$J$10:$J$18)*(1+'PFP2.2_FatorKb'!$E$39)+SUMIF(PFP!$B$10:$B$18,\"<>MO*\",PFP!$J$10:$J$18)+$F$14)","v":9740.3638845999994}]
["K2","CUSTOS DA ADMINISTRAÇÃO CENTRAL",null,null,{"$f":"ROUND(SUM(E15:E17),4)","v":0.15},{"$f":"ROUND(E14*SUMIF(PFP!$B$10:$B$18,\"MO*\",PFP!$J$10:$J$18),2)","v":8590.8700000000008}]
["K2.1","Custos da administração central da empresa (diretoria, pessoal técnico de apoio e pessoal administrativo não diretamente vinculado à prestação dos serviços)",null,null,0.1,{"$f":"ROUND(E15*SUMIF(PFP!$B$10:$B$18,\"MO*\",PFP!$J$10:$J$18),2)","v":5727.25}]
["K2.2","Outras despesas que afetam o custo de produção como treinamento, biblioteca, programa de qualidade, programa de benefícios, auditoria interna e externa",null,null,0.03,{"$f":"ROUND(E16*SUMIF(PFP!$B$10:$B$18,\"MO*\",PFP!$J$10:$J$18),2)","v":1718.17}]
["K2.3","Despesas fixas e variaveis com patrimônio, aluguéis, comunicação, manutenção e transporte não diretamente relacionados com o custo direto dos serviços",null,null,0.02,{"$f":"ROUND(E17*SUMIF(PFP!$B$10:$B$18,\"MO*\",PFP!$J$10:$J$18),2)","v":1145.45}]
["Kd","TAXA RESSARCIMENTO DE DESPESAS SOBRE CUSTOS DIVERSOS",null,null,{"$f":"ROUND((1+E13)*(1+E9),4)","v":1.2558}]
["NOME DO INFORMANTE:",null,null,null,"QUALIFICAÇÃO:"]
[]
["ASSINATURA:",null,null,null,"DATA:"]
[]
["Observação:"]
["1 - RELACIONAR OS CUSTOS DE ADMINISTRAÇÃO COM RESPECTIVOS PERCENTUAIS INCIDENTES NA MÃO -DE-OBRA"]
["1 - DISCRIMINAR OS TRIBUTOS QUE INCIDEM SOBRE OS CUSTOS DA PRESTAÇÃO DOS SERVIÇOS"]
["2 - K4 = INDICAR % DE CADA TRIBUTO E A SOMA DOS MESMOS (ex: ISS 5% + PIS 1,65% + COFINS 7,60% = 14,25%)"]
["3 - PIS e COFINS, Regime de Incidencia Acumulativa (0,65% e 3,00% - sem percentual de desconto) ou em Regime de Incidencia Não Acumulativa (1,65% e 7,60% - aplicável percentual de desconto) de acordo com a forma de apuração do lucro no IRPJ. APRESENTAR COMPROVANTES de aproveitamento de créditos tributários dos últimos 12 meses em caso de aplicação de \"percentual de desconto\"."]
["4 - AS DESPESAS FISCAIS (K4) INCIDEM SOBRE O TOTAL DA FATURA E NÃO SOBRE OS CUSTOS INCORRIDOS, "]
["     DEVENDO SER CALCULADO O K4' APLICANDO-SE A SEGUINTE FÓRMULA:"]
["     K4' = { [ 1 / ( 1 - K4) ] - 1 } x 100"]
["     K4' = { [ 1 / ( 1 - 0,124 ) ] - 1 } x 100"]
["Kd - Taxa de Ressarcimento de Despesas sobre Custos Diversos (incide sobre os Insumos Codigo DP e EM)"]
["Kd = (1 + K3) x (1 + K4)"]
["K2 - Incide sobre o Custo Total (CT) da Mão de Obra (MO* = MO1 + MO2)"]
["K3 - Incide sobre o Custo Total (CT) Mão de Obra com encargos (MO1 x Ka ou MO2 x Kb), demais Custos (DP e EM), e Custos da Administração Central (K2)"]
["K4 -  Incide sobre o Custo Total (CT) Mão de Obra com encargos (MO1 x Ka ou MO2 x Kb), demais Custos (DP e EM), e Custos da Administração Central (K2) e Lucro (K3)"]

{"sheet":"CRO1_Ins-Pro","index":8,"n_rows":19,"n_cols":19,"rows_kept":19,"cut":false,"hidden":false,"merged":[[30,6,30,18],[25,6,25,18],[26,6,26,18],[27,6,27,18],[28,6,28,18],[29,6,29,18],[20,6,20,18],[21,6,21,18],[22,6,22,18],[23,6,23,18],[24,6,24,18],[0,14,0,18],[1,14,1,18],[15,0,16,0],[15,1,16,1],[17,0,18,0],[0,0,1,13],[2,0,2,13],[14,12,14,18],[14,7,14,11],[3,7,3,18]]}
["INSUMOS POR ETAPA/PRODUTO",{"$nulls":13},"CODIGO:"]
[{"$nulls":14},"CRO-1"]
[{"$f":"PFP!A3","v":"ADAPTAÇÃO DO PROJETO EXECUTIVO DO SISTEMA ADUTOR DE MARCOLÂNDIA-PI E DISTRITO DE SERRÂNIA (ARARIPINA-PE)"}]
["Cod.","Categoria / Insumo","Uni","Qde","CUD","PU","FatorK","Meses"]
[{"$nulls":7},1,2,3,4,5,6,7,8,9,10,11,12]
["C",{"$f":"VLOOKUP(A6,PFP!$C$9:$K$18,2,FALSE)","v":"Engenheiro consultor especial - P8060"},{"$f":"VLOOKUP(A6,PFP!$C$9:$K$18,3,FALSE)","v":"mês"},{"$f":"SUM(H6:S6)","v":0.2},{"$f":"VLOOKUP(A6,PFP!$C$9:$K$18,5,FALSE)","v":21440.03},{"$f":"VLOOKUP(A6,PFP!$C$9:$K$18,6,FALSE)","v":30961.55},{"$f":"VLOOKUP(A6,PFP!$C$9:$K$18,7,FALSE)","v":1.4440999999999999},{"$nulls":5},0.1,0.1]
["P0",{"$f":"VLOOKUP(A7,PFP!$C$9:$K$18,2,FALSE)","v":"Engenheiro de projetos sênior - P8067"},{"$f":"VLOOKUP(A7,PFP!$C$9:$K$18,3,FALSE)","v":"mês"},{"$f":"SUM(H7:S7)","v":0.8},{"$f":"VLOOKUP(A7,PFP!$C$9:$K$18,5,FALSE)","v":15564.54},{"$f":"VLOOKUP(A7,PFP!$C$9:$K$18,6,FALSE)","v":26386.560000000001},{"$f":"VLOOKUP(A7,PFP!$C$9:$K$18,7,FALSE)","v":1.6953},{"$nulls":5},0.15,0.15,0.1,0.1,0.15,0.15]
["P1",{"$f":"VLOOKUP(A8,PFP!$C$9:$K$18,2,FALSE)","v":"Engenheiro de projetos pleno - P8066"},{"$f":"VLOOKUP(A8,PFP!$C$9:$K$18,3,FALSE)","v":"mês"},1.6999999999999997,{"$f":"VLOOKUP(A8,PFP!$C$9:$K$18,5,FALSE)","v":12379.96},{"$f":"VLOOKUP(A8,PFP!$C$9:$K$18,6,FALSE)","v":29012.44},{"$f":"VLOOKUP(A8,PFP!$C$9:$K$18,7,FALSE)","v":2.3435000000000001},0.1,0.1,0.1,0.1,0.1,0.2,0.2,0.15,0.15,0.2,0.2,0.1]
["P3",{"$f":"VLOOKUP(A9,PFP!$C$9:$K$18,2,FALSE)","v":"Engenheiro de projetos júnior - P8065"},{"$f":"VLOOKUP(A9,PFP!$C$9:$K$18,3,FALSE)","v":"mês"},1.4,{"$f":"VLOOKUP(A9,PFP!$C$9:$K$18,5,FALSE)","v":12002},{"$f":"VLOOKUP(A9,PFP!$C$9:$K$18,6,FALSE)","v":28126.69},{"$f":"VLOOKUP(A9,PFP!$C$9:$K$18,7,FALSE)","v":2.3435000000000001},0.1,0.1,0.1,0.1,0.1,0.15,0.15,0.1,0.1,0.15,0.15,0.1]
["T2",{"$f":"VLOOKUP(A10,PFP!$C$9:$K$18,2,FALSE)","v":"Técnico de obras - P8147"},{"$f":"VLOOKUP(A10,PFP!$C$9:$K$18,3,FALSE)","v":"mês"},0.64999999999999991,{"$f":"VLOOKUP(A10,PFP!$C$9:$K$18,5,FALSE)","v":3167.62},{"$f":"VLOOKUP(A10,PFP!$C$9:$K$18,6,FALSE)","v":7423.32},{"$f":"VLOOKUP(A10,PFP!$C$9:$K$18,7,FALSE)","v":2.3435000000000001},null,null,0.15,null,null,0.1,0.1,0.05,0.05,0.1,0.1]
["A0",{"$f":"VLOOKUP(A11,PFP!$C$9:$K$18,2,FALSE)","v":"Secretária - P8135"},{"$f":"VLOOKUP(A11,PFP!$C$9:$K$18,3,FALSE)","v":"mês"},0.23999999999999996,{"$f":"VLOOKUP(A11,PFP!$C$9:$K$18,5,FALSE)","v":2604.7800000000002},{"$f":"VLOOKUP(A11,PFP!$C$9:$K$18,6,FALSE)","v":6104.3},{"$f":"VLOOKUP(A11,PFP!$C$9:$K$18,7,FALSE)","v":2.3435000000000001},0.02,0.02,0.02,0.02,0.02,0.02,0.02,0.02,0.02,0.02,0.02,0.02]
["V1",{"$f":"VLOOKUP(A12,PFP!$C$9:$K$18,2,FALSE)","v":"Diárias"},{"$f":"VLOOKUP(A12,PFP!$C$9:$K$18,3,FALSE)","v":"dia"},4,{"$f":"VLOOKUP(A12,PFP!$C$9:$K$18,5,FALSE)","v":353.39},{"$f":"VLOOKUP(A12,PFP!$C$9:$K$18,6,FALSE)","v":443.79},{"$f":"VLOOKUP(A12,PFP!$C$9:$K$18,7,FALSE)","v":1.2558},null,null,4]
["V3",{"$f":"VLOOKUP(A13,PFP!$C$9:$K$18,2,FALSE)","v":"Aluguel de mini Pick-up"},{"$f":"VLOOKUP(A13,PFP!$C$9:$K$18,3,FALSE)","v":"dia"},3,{"$f":"VLOOKUP(A13,PFP!$C$9:$K$18,5,FALSE)","v":427.04},{"$f":"VLOOKUP(A13,PFP!$C$9:$K$18,6,FALSE)","v":536.28},{"$f":"VLOOKUP(A13,PFP!$C$9:$K$18,7,FALSE)","v":1.2558},null,null,3]
["V4",{"$f":"VLOOKUP(A14,PFP!$C$9:$K$18,2,FALSE)","v":"Passagens Aéreas (ida e volta)"},{"$f":"VLOOKUP(A14,PFP!$C$9:$K$18,3,FALSE)","v":"un"},1,{"$f":"VLOOKUP(A14,PFP!$C$9:$K$18,5,FALSE)","v":1613.69},{"$f":"VLOOKUP(A14,PFP!$C$9:$K$18,6,FALSE)","v":2026.47},{"$f":"VLOOKUP(A14,PFP!$C$9:$K$18,7,FALSE)","v":1.2558},null,null,1]
[{"$nulls":6},"ETAPA:","Diagnóstico/Estudos Alternativas",{"$nulls":4},"Projeto Executivo de Engenharia"]
["TOTAL","VALOR TOTAL POR PRODUTO","R$",{"$f":"SUM(H16:S16)","v":127700.732},null,null,null,{"$f":"SUMPRODUCT($F$6:$F$14,H6:H14)","v":5835.9990000000007},5835.9990000000007,12359.967000000001,5835.9990000000007,5835.9990000000007,17940.048499999997,17940.048499999997,10296.442999999999,10296.442999999999,14843.8935,14843.8935,5835.9990000000007]
[null,null,"%",1.0000100000000001,null,null,null,{"$f":"ROUND(H16/$D$16,5)","v":4.5699999999999998E-2},{"$f":"ROUND(I16/$D$16,5)","v":4.5699999999999998E-2},9.6790000000000001E-2,4.5699999999999998E-2,4.5699999999999998E-2,0.14049,0.14049,8.0629999999999993E-2,8.0629999999999993E-2,0.11624,0.11624,4.5699999999999998E-2]
["TOTAL","VALOR DOS SUBPRODUTOS","R$",102160.58559999998,null,null,null,{"$f":"H16*0.8","v":4668.7992000000004},{"$f":"I16*0.8","v":4668.7992000000004},9887.9736000000012,4668.7992000000004,4668.7992000000004,14352.038799999998,{"$f":"N16*0.8","v":14352.038799999998},8237.1543999999994,8237.1543999999994,11875.114800000001,11875.114800000001,4668.7992000000004]
[null,"VALOR DO PRODUTO CONSOLIDADO","R$",25540.146399999994,null,null,null,{"$f":"H16*0.2","v":1167.1998000000001},{"$f":"I16*0.2","v":1167.1998000000001},2471.9934000000003,1167.1998000000001,1167.1998000000001,3588.0096999999996,{"$f":"N16*0.2","v":3588.0096999999996},2059.2885999999999,2059.2885999999999,2968.7787000000003,2968.7787000000003,1167.1998000000001]

{"sheet":"CRO2_Pro-Mes","index":9,"n_rows":14,"n_cols":15,"rows_kept":14,"cut":false,"hidden":false,"merged":[[0,0,0,14],[1,0,1,14]]}
["CRONOGRAMA SIMPLIFICADO - CRO"]
[{"$f":"PFP!A3","v":"ADAPTAÇÃO DO PROJETO EXECUTIVO DO SISTEMA ADUTOR DE MARCOLÂNDIA-PI E DISTRITO DE SERRÂNIA (ARARIPINA-PE)"}]
["Cod.","Produto/ Mês","Soma",1,2,3,4,5,6,7,8,9,10,11,12]
["E-1.1","Estudos Preliminares",{"$f":"COUNTA(D4:O4)","v":2},"x","x"]
["E-1.2","Estudos de Diagnóstico",{"$f":"COUNTA(D5:O5)","v":1},null,null,"x"]
["E-1.3","Estudos Populacionais e de Demanda Hídrica",1,null,null,null,"x"]
["E-1.4","Relatório Final do Diagnóstico e Estudo de Alternativas ",1,{"$nulls":4},"x"]
["E-2.1","Projetos Técnicos: hidromecânicos",2,{"$nulls":5},"x","x"]
["E-2.2","Projetos Técnicos: complementares",2,{"$nulls":5},"x","x"]
["E-2.3","Memoriais de cálculo",1,{"$nulls":7},"x"]
["E-2.4","Memorial Descritivo e Especificações Técnicas",2,{"$nulls":7},"x","x"]
["E-2.5","Orçamentos",3,{"$nulls":8},"x","x","x"]
["E-2.6","Estudos ambientais",2,{"$nulls":9},"x","x"]
["E-2.7","Relatório final do projeto executivo de engenharia",1,{"$nulls":11},"x"]