{"text_format":"2","workbook":"xlsx","n_sheets":14,"sheets":["PFP","PFP1.1_Topo","PFP1.2_Geo","PFP2.1_FatorKa","PFP2.2_FatorKb","PFP2.3_FatorKc","PFP3_FatorKd","CRO1_Ins-Pro","CRO2_Ins-Mes","COT. VANT","Planilha de Medição","Cronograma Físico-Financeiro","CPU VEICULO_PickUp","Consultiva atualizada"],"not_rendered":{"charts":0,"images":13,"macros":0,"external_links":34,"defined_names":4318,"comments":0,"pivot_tables":0},"unopened":[],"bounds":{"document_bytes":16777216,"sheet_cells":100000,"run_cost":"one","rows_first":2000,"rows_last":500,"rows_between":2000,"halvings":0,"cell_chars":16384,"cell_head_chars":4096},"cells_cut":0,"cells_raw":0,"read":"whole","date_system":"1900"}

{"sheet":"PFP","index":0,"n_rows":42,"n_cols":12,"rows_kept":42,"cut":false,"hidden":false,"merged":[[23,0,23,6],[23,7,23,10],[26,0,26,10],[25,0,25,10],[13,1,13,2],[14,1,14,2],[15,1,15,2],[16,1,16,2],[22,7,22,10],[22,0,22,6],[21,7,21,10],[21,0,21,6],[37,0,37,10],[30,0,30,10],[32,0,32,10],[24,0,24,10],[31,0,31,10],[27,0,27,10],[33,0,33,10],[34,0,34,10],[35,0,35,10],[36,0,36,10],[28,0,28,10],[29,0,29,10],[0,0,1,8],[4,5,4,8],[0,9,0,10],[1,9,1,10],[4,9,4,10],[2,0,2,10],[3,0,3,10],[4,0,4,4],[5,9,5,10],[5,5,5,8],[20,0,20,6],[20,7,20,10],[5,0,5,4],[19,0,19,6],[19,7,19,10],[6,1,6,2],[7,1,7,2],[8,1,8,2],[9,1,9,2],[10,1,10,2],[11,1,11,2],[17,1,17,2],[18,1,18,2],[12,1,12,2]]}
["PROPOSTA FINANCEIRA DO PROJETO",{"$nulls":8},"CODIGO:"]
[{"$nulls":9},"PFP"]
["NOME DA CONSULTORA:"]
[]
["PROJETO:",{"$nulls":4},"CONTRATANTE:",null,null,null,"BASE:"]
["ELABORAÇÃO DE ESTUDO DE VIABILIDADE TÉCNICA, ECONÔMICA E AMBIENTAL, ESTUDOS BÁSICOS, PROJETO BÁSICO E PROJETO EXECUTIVO PARA PARA CONSTRUÇÃO DA INFRAESTRUTURA RODOVIÁRIA DA ESTRADA PARQUE LINHA DO EQUADOR, NO ESTADO DO AMAPÁ",{"$nulls":4},"CODEVASF (SEDE)",null,null,null,"2024-03-01"]
["Base","Código",null,"Categoria / Insumo","Uni","Qde","CUD","PU","FatorK","CT","PT","Encargos COMP E ADICIONAIS"]
["SICRO","P8061",null,"Engenheiro coordenador (P8061)","mês",{"$f":"'CRO1_Ins-Pro'!D5","v":1.05},{"$f":"VLOOKUP(B8,'Consultiva atualizada'!A:Y,4,FALSE)","v":17866.689999999999},{"$f":"ROUND(I8*G8,2)","v":23042.67},{"$f":"'PFP2.3_FatorKc'!E35","v":1.2897000000000001},{"$f":"ROUND(F8*G8,2)","v":18760.02},{"$f":"ROUND(F8*H8,2)","v":24194.799999999999},{"$f":"14633.42-13607.04","v":1026.3799999999992}]
["SICRO","P8066",null,"Engenheiro pleno (P8066)","mês",{"$f":"'CRO1_Ins-Pro'!D6","v":4.5},{"$f":"VLOOKUP(B9,'Consultiva atualizada'!A:Y,4,FALSE)","v":12379.96},{"$f":"ROUND(I9*G9,2)","v":26364.36},{"$f":"'PFP2.1_FatorKa'!E36","v":2.1295999999999999},{"$f":"ROUND(F9*G9,2)","v":55709.82},{"$f":"ROUND(F9*H9,2)","v":118639.62},{"$f":"10299.82-9271.29","v":1028.5299999999988}]
["SICRO","P8065",null,"Engenheiro júnior (P8065)","mês",{"$f":"'CRO1_Ins-Pro'!D7","v":6},{"$f":"VLOOKUP(B10,'Consultiva atualizada'!A:Y,4,FALSE)","v":12002},{"$f":"ROUND(I10*G10,2)","v":25559.46},{"$f":"'PFP2.1_FatorKa'!E36","v":2.1295999999999999},{"$f":"ROUND(F10*G10,2)","v":72012},153356.76,{"$f":"9942.82-8914.29","v":1028.5299999999988}]
{"$rows_left_out":33}
{"sheet":"PFP1.1_Topo","index":1,"n_rows":27,"n_cols":8,"rows_kept":27,"cut":false,"hidden":false,"merged":[[26,0,26,7],[0,0,1,6],[2,0,2,7],[3,0,3,7],[4,0,4,4],[4,5,4,6],[5,0,5,4],[5,5,5,6],[21,0,21,6],[22,0,22,7],[23,0,23,7],[24,0,24,7],[25,0,25,7]]}
["SERVIÇOS TOPOGRÁFICOS/CARTOGRÁFICOS",{"$nulls":6},"CODIGO:"]
[{"$nulls":7},"PFP-1.1"]
["NOME DA EMPRESA:"]
[]
["PROJETO:",{"$nulls":4},"CONTRATANTE:",null,{"$f":"PFP!J5","v":"BASE:"}]
[{"$f":"PFP!A6","v":"ELABORAÇÃO DE ESTUDO DE VIABILIDADE TÉCNICA, ECONÔMICA E AMBIENTAL, ESTUDOS BÁSICOS, PROJETO BÁSICO E PROJETO EXECUTIVO PARA PARA CONSTRUÇÃO DA INFRAESTRUTURA RODOVIÁRIA DA ESTRADA PARQUE LINHA DO EQUADOR, NO ESTADO DO AMAPÁ"},{"$nulls":4},"CODEVASF (SEDE)",null,{"$f":"PFP!J6","v":"2024-03-01"}]
["Cod.","Referência","Código","Insumos","Uni","Qde","Preço Unitário (PU)","Preço Total (PT)"]
["TP01","Engenharia Consultiva Codevasf ","CODE","Nivelamento Geométrico dos Eixos classe IIN","km",1.5,1143.76,{"$f":"ROUND(G8*F8,2)","v":1715.64}]
["TP02","Engenharia Consultiva Codevasf ","CODE","Seções Tranversais","km",7,394.36,{"$f":"ROUND(G9*F9,2)","v":2760.52}]
["TP03","EMOP/COMPOSIÇÃO","01.016.0035-0","Poligonal Classe IIP","km",1.5,1366.27,{"$f":"ROUND(G10*F10,2)","v":2049.41}]
{"$rows_left_out":18}
{"sheet":"PFP1.2_Geo","index":2,"n_rows":46,"n_cols":8,"rows_kept":46,"cut":false,"hidden":false,"merged":[[5,0,5,4],[5,5,5,6],[0,0,1,6],[2,0,2,7],[3,0,3,7],[4,0,4,4],[4,5,4,6],[44,0,44,7],[45,0,45,7],[40,0,40,6],[41,0,41,7],[42,0,42,7],[43,0,43,7]]}
["SERVIÇOS GEOLÓGICOS/GEOTÉCNICOS",{"$nulls":6},"CODIGO:"]
[{"$nulls":7},"PFP-1.2"]
["NOME DA EMPRESA:"]
[]
["PROJETO: ",{"$nulls":4},"CONTRATANTE:",null,{"$f":"PFP!J5","v":"BASE:"}]
[{"$f":"PFP!A6","v":"ELABORAÇÃO DE ESTUDO DE VIABILIDADE TÉCNICA, ECONÔMICA E AMBIENTAL, ESTUDOS BÁSICOS, PROJETO BÁSICO E PROJETO EXECUTIVO PARA PARA CONSTRUÇÃO DA INFRAESTRUTURA RODOVIÁRIA DA ESTRADA PARQUE LINHA DO EQUADOR, NO ESTADO DO AMAPÁ"},{"$nulls":4},"CODEVASF (SEDE)",null,{"$f":"PFP!J6","v":"2024-03-01"}]
["Cod.","Referência","Código","Insumos","Uni","Qde","Preço Unitário (PU)","Preço Total (PT)"]
["GT 1","CODE",null,"Sondagem a Percussão SPT"]
["GT1.1","SUDECAP/INSUMO","95.01.01","Sondagem Percussão: (Des)Mobilização por equipe","un",1,1500,{"$f":"F9*G9","v":1500}]
["GT1.2","AGETOP Civil/GO",2460,"Sondagem Percursão: com SPT - Terrestre","m",180,66.94,{"$f":"F10*G10","v":12049.199999999999}]
{"$rows_left_out":37}
{"sheet":"PFP2.1_FatorKa","index":3,"n_rows":41,"n_cols":6,"rows_kept":41,"cut":false,"hidden":false,"merged":[[35,1,35,3],[6,1,6,3],[40,0,40,5],[39,0,39,5],[38,0,38,5],[37,0,37,5],[22,1,22,3],[29,1,29,3],[30,1,30,3],[28,1,28,3],[25,1,25,3],[26,1,26,3],[27,1,27,3],[33,1,33,3],[31,1,31,3],[32,1,32,3],[34,1,34,3],[0,0,1,4],[2,0,2,5],[5,0,5,1],[5,2,5,4],[4,2,4,4],[3,0,3,5],[24,1,24,3],[7,1,7,3],[17,1,17,3],[8,1,8,3],[13,1,13,3],[14,1,14,3],[15,1,15,3],[18,1,18,3],[19,1,19,3],[20,1,20,3],[21,1,21,3],[23,1,23,3],[9,1,9,3],[10,1,10,3],[11,1,11,3],[12,1,12,3]]}
["DETALHAMENTO DOS ENCARGOS SOCIAIS: Ka",{"$nulls":4},"CODIGO:"]
[{"$nulls":5},"PFP-2.1"]
["NOME DA CONSULTORA:"]
[]
["PROJETO:",null,"CONTRATANTE:",null,null,{"$f":"PFP!J5","v":"BASE:"}]
[{"$f":"PFP!A6","v":"ELABORAÇÃO DE ESTUDO DE VIABILIDADE TÉCNICA, ECONÔMICA E AMBIENTAL, ESTUDOS BÁSICOS, PROJETO BÁSICO E PROJETO EXECUTIVO PARA PARA CONSTRUÇÃO DA INFRAESTRUTURA RODOVIÁRIA DA ESTRADA PARQUE LINHA DO EQUADOR, NO ESTADO DO AMAPÁ"},null,"CODEVASF (SEDE)",null,null,"SINAPI/AP"]
["Cod","DESCRIÇÃO",null,null,"%","R$"]
["A","ENCARGOS SOCIAIS BÁSICOS",null,null,{"$f":"ROUND(SUM(E9:E17),4)","v":0.36799999999999999},{"$f":"ROUND(E8*SUMIF(PFP!$B$8:$B$19,\"MO1\",PFP!$J$8:$J$19),2)","v":0}]
["A1","INSS",null,null,0.2,{"$f":"ROUND(E9*SUMIF(PFP!$B$8:$B$19,\"MO1\",PFP!$J$8:$J$19),2)","v":0}]
["A2","SESI",null,null,1.4999999999999999E-2,{"$f":"ROUND(E10*SUMIF(PFP!$B$8:$B$19,\"MO1\",PFP!$J$8:$J$19),2)","v":0}]
{"$rows_left_out":32}
{"sheet":"PFP2.2_FatorKb","index":4,"n_rows":40,"n_cols":6,"rows_kept":40,"cut":false,"hidden":false,"merged":[[27,1,27,3],[28,1,28,3],[29,1,29,3],[22,1,22,3],[23,1,23,3],[24,1,24,3],[25,1,25,3],[26,1,26,3],[6,1,6,3],[12,1,12,3],[13,1,13,3],[39,0,39,5],[36,0,36,5],[37,0,37,5],[38,0,38,5],[31,1,31,3],[32,1,32,3],[33,1,33,3],[34,1,34,3],[18,1,18,3],[30,1,30,3],[19,1,19,3],[20,1,20,3],[21,1,21,3],[0,0,1,4],[2,0,2,5],[3,0,3,5],[4,2,4,4],[5,0,5,1],[5,2,5,4],[7,1,7,3],[16,1,16,3],[17,1,17,3],[8,1,8,3],[9,1,9,3],[10,1,10,3],[14,1,14,3],[15,1,15,3],[11,1,11,3]]}
["DETALHAMENTO DOS ENCARGOS SOCIAIS: Kb",{"$nulls":4},"CODIGO:"]
[{"$nulls":5},"PFP-2.2"]
["NOME DA CONSULTORA:"]
[]
["PROJETO:",null,"CONTRATANTE:",null,null,{"$f":"'PFP2.1_FatorKa'!F5","v":"BASE:"}]
[{"$f":"PFP!A6","v":"ELABORAÇÃO DE ESTUDO DE VIABILIDADE TÉCNICA, ECONÔMICA E AMBIENTAL, ESTUDOS BÁSICOS, PROJETO BÁSICO E PROJETO EXECUTIVO PARA PARA CONSTRUÇÃO DA INFRAESTRUTURA RODOVIÁRIA DA ESTRADA PARQUE LINHA DO EQUADOR, NO ESTADO DO AMAPÁ"},null,"CODEVASF (SEDE)",null,null,{"$f":"'PFP2.1_FatorKa'!F6","v":"SINAPI/AP"}]
["Cod","DESCRIÇÃO",null,null,"%","R$"]
["A","ENCARGOS SOCIAIS BÁSICOS",null,null,{"$f":"ROUND(SUM(E9:E16),4)","v":0.2},{"$f":"ROUND(E8*SUMIF(PFP!$B$8:$B$19,\"MO2\",PFP!$J$8:$J$19),2)","v":0}]
["A1","INSS",null,null,0.2,{"$f":"ROUND(E9*SUMIF(PFP!$B$8:$B$19,\"MO2\",PFP!$J$8:$J$19),2)","v":0}]
["A2","SESI",null,null,0,{"$f":"ROUND(E10*SUMIF(PFP!$B$8:$B$19,\"MO2\",PFP!$J$8:$J$19),2)","v":0}]
{"$rows_left_out":31}
{"sheet":"PFP2.3_FatorKc","index":5,"n_rows":40,"n_cols":6,"rows_kept":40,"cut":false,"hidden":false,"merged":[[0,0,1,4],[2,0,2,5],[3,0,3,5],[4,2,4,4],[5,0,5,1],[5,2,5,4],[16,1,16,3],[6,1,6,3],[7,1,7,3],[8,1,8,3],[9,1,9,3],[10,1,10,3],[11,1,11,3],[12,1,12,3],[13,1,13,3],[14,1,14,3],[15,1,15,3],[28,1,28,3],[17,1,17,3],[18,1,18,3],[19,1,19,3],[20,1,20,3],[21,1,21,3],[22,1,22,3],[23,1,23,3],[24,1,24,3],[25,1,25,3],[26,1,26,3],[27,1,27,3],[36,0,36,5],[37,0,37,5],[38,0,38,5],[39,0,39,5],[29,1,29,3],[30,1,30,3],[31,1,31,3],[32,1,32,3],[33,1,33,3],[34,1,34,3]]}
["DETALHAMENTO DOS ENCARGOS SOCIAIS: Kc",{"$nulls":4},"CODIGO:"]
[{"$nulls":5},"PFP-2.3"]
["NOME DA CONSULTORA:"]
[]
["PROJETO:",null,"CONTRATANTE:",null,null,{"$f":"'PFP2.2_FatorKb'!F5","v":"BASE:"}]
[{"$f":"PFP!A6","v":"ELABORAÇÃO DE ESTUDO DE VIABILIDADE TÉCNICA, ECONÔMICA E AMBIENTAL, ESTUDOS BÁSICOS, PROJETO BÁSICO E PROJETO EXECUTIVO PARA PARA CONSTRUÇÃO DA INFRAESTRUTURA RODOVIÁRIA DA ESTRADA PARQUE LINHA DO EQUADOR, NO ESTADO DO AMAPÁ"},null,"CODEVASF (SEDE)",null,null,{"$f":"'PFP2.2_FatorKb'!F6","v":"SINAPI/AP"}]
["Cod","DESCRIÇÃO",null,null,"%","R$"]
["A","ENCARGOS SOCIAIS BÁSICOS",null,null,{"$f":"SUM(E9:E16)","v":0},{"$f":"ROUND(E8*SUMIF(PFP!$B$8:$B$19,\"MO3\",PFP!$J$8:$J$19),2)","v":0}]
["A1","INSS",null,null,0,{"$f":"ROUND(E9*SUMIF(PFP!$B$8:$B$19,\"MO3\",PFP!$J$8:$J$19),2)","v":0}]
["A2","SESI",null,null,0,{"$f":"ROUND(E10*SUMIF(PFP!$B$8:$B$19,\"MO3\",PFP!$J$8:$J$19),2)","v":0}]
{"$rows_left_out":31}
{"sheet":"PFP3_FatorKd","index":6,"n_rows":35,"n_cols":6,"rows_kept":35,"cut":false,"hidden":false,"merged":[[32,0,32,5],[12,1,12,3],[11,1,11,3],[8,1,8,2],[9,1,9,2],[10,1,10,2],[7,1,7,2],[25,0,25,5],[6,1,6,2],[0,0,1,4],[2,0,2,5],[5,0,5,1],[5,2,5,4],[4,2,4,4],[3,0,3,5],[33,0,33,5],[34,0,34,5],[16,1,16,3],[13,1,13,3],[14,1,14,3],[15,1,15,3],[21,0,21,5],[26,0,26,5],[27,0,27,5],[22,0,22,5],[23,0,23,5],[24,0,24,5],[28,0,28,5],[29,0,29,5],[30,0,30,5],[31,0,31,5]]}
["DESPESAS FISCAIS E CUSTOS DIVERSOS: Kc",{"$nulls":4},"CODIGO:"]
[{"$nulls":5},"PFP-3"]
["NOME DA CONSULTORA:"]
[]
["PROJETO:",null,"CONTRATANTE:",null,null,{"$f":"'PFP2.3_FatorKc'!F5","v":"BASE:"}]
[{"$f":"PFP!A6","v":"ELABORAÇÃO DE ESTUDO DE VIABILIDADE TÉCNICA, ECONÔMICA E AMBIENTAL, ESTUDOS BÁSICOS, PROJETO BÁSICO E PROJETO EXECUTIVO PARA PARA CONSTRUÇÃO DA INFRAESTRUTURA RODOVIÁRIA DA ESTRADA PARQUE LINHA DO EQUADOR, NO ESTADO DO AMAPÁ"},null,"CODEVASF (SEDE)",null,null,{"$f":"'PFP2.3_FatorKc'!F6","v":"SINAPI/AP"}]
["Cod","DESCRIÇÃO1",null,"% preço2","% custo4","R$"]
["K4","TRIBUTOS",null,0.104,{"$f":"ROUND(E9+E10+E11,4)","v":0.11609999999999999}]
["K4.1","ISS",null,0.03,3.3500000000000002E-2]
["K4.2","PIS3 - aliquota efetiva aplicavel percentual-desconto",null,1.32E-2,1.47E-2]
{"$rows_left_out":26}
{"sheet":"CRO1_Ins-Pro","index":7,"n_rows":85,"n_cols":11,"rows_kept":85,"cut":false,"hidden":false,"merged":[[83,0,83,7],[82,0,82,10],[0,0,1,7],[34,7,34,10],[16,0,18,0],[2,0,3,0],[2,1,3,1],[2,2,3,2],[2,3,3,3],[2,4,3,4],[2,5,3,5],[16,1,17,1]]}
["INSUMOS POR ETAPA/PRODUTO",{"$nulls":9},"CÓDIGO:"]
[{"$nulls":10},"CRO-1"]
["Cod.","Categoria / Insumo","Uni","Qde","CUD","PU","FatorK","E1. EB","E2. EVTEA ","E3. PB","E4. PE"]
[{"$nulls":6},"Meses"]
[{"$f":"PFP!B8","v":"P8061"},{"$f":"PFP!D8","v":"Engenheiro coordenador (P8061)"},"mês",{"$f":"SUM(H5:K5)","v":1.05},{"$f":"PFP!G8","v":17866.689999999999},{"$f":"PFP!H8","v":23042.67},{"$f":"PFP!I8","v":1.2897000000000001},{"$f":"'CRO2_Ins-Mes'!E5","v":0.15000000000000002},{"$f":"'CRO2_Ins-Mes'!E13","v":0.15000000000000002},{"$f":"'CRO2_Ins-Mes'!E21","v":0.25},{"$f":"'CRO2_Ins-Mes'!E29","v":0.5}]
[{"$f":"PFP!B9","v":"P8066"},{"$f":"PFP!D9","v":"Engenheiro pleno (P8066)"},"mês",4.5,{"$f":"PFP!G9","v":12379.96},{"$f":"PFP!H9","v":26364.36},{"$f":"PFP!I9","v":2.1295999999999999},{"$f":"'CRO2_Ins-Mes'!E6","v":0},{"$f":"'CRO2_Ins-Mes'!E14","v":1},{"$f":"'CRO2_Ins-Mes'!E22","v":2.5},{"$f":"'CRO2_Ins-Mes'!E30","v":1}]
[{"$f":"PFP!B10","v":"P8065"},{"$f":"PFP!D10","v":"Engenheiro júnior (P8065)"},"mês",6,{"$f":"PFP!G10","v":12002},{"$f":"PFP!H10","v":25559.46},{"$f":"PFP!I10","v":2.1295999999999999},{"$f":"'CRO2_Ins-Mes'!E7","v":0},{"$f":"'CRO2_Ins-Mes'!E15","v":2.5},{"$f":"'CRO2_Ins-Mes'!E23","v":2.5},{"$f":"'CRO2_Ins-Mes'!E31","v":1}]
[{"$f":"PFP!B11","v":40807},{"$f":"PFP!D11","v":"Desenhista (40807)"},"mês",10,{"$f":"PFP!G11","v":2799.33},{"$f":"PFP!H11","v":5961.45},{"$f":"PFP!I11","v":2.1295999999999999},{"$f":"'CRO2_Ins-Mes'!E8","v":1.5},{"$f":"'CRO2_Ins-Mes'!E16","v":1.5},{"$f":"'CRO2_Ins-Mes'!E24","v":5},{"$f":"'CRO2_Ins-Mes'!E32","v":2}]
[{"$f":"PFP!B12","v":"P8147"},"Técnico de projetos/obra (P8147)","mês",5.5,{"$f":"PFP!G12","v":3167.62},{"$f":"PFP!H12","v":6745.76},{"$f":"PFP!I12","v":2.1295999999999999},{"$f":"'CRO2_Ins-Mes'!E9","v":1.5},{"$f":"'CRO2_Ins-Mes'!E17","v":1.5},{"$f":"'CRO2_Ins-Mes'!E25","v":2.5},{"$f":"'CRO2_Ins-Mes'!E33","v":0}]
["-",{"$f":"PFP!D13","v":"Encargos Comp. e Adicionais"},"mês",{"$f":"SUM(D5:D9)","v":27.05},{"$f":"PFP!G13","v":1053.5652125693157},{"$f":"PFP!H13","v":1267.02},{"$f":"PFP!I13","v":1.2025999999999999},{"$f":"SUM(H5:H9)","v":3.15},{"$f":"SUM(I5:I9)","v":6.65},{"$f":"SUM(J5:J9)","v":12.75},{"$f":"SUM(K5:K9)","v":4.5}]
{"$rows_left_out":15}
{"sheet":"CRO2_Ins-Mes","index":8,"n_rows":37,"n_cols":15,"rows_kept":37,"cut":false,"hidden":false,"merged":[[60,5,60,14],[0,0,1,14]]}
["CRONOGRAMA SIMPLIFICADO"]
[]
["Cod1","Cod2","Produtos","Uni","Qde",1,2,3,4,5,6,7,8,9,10]
["Cod1","Cod2","Insumos","Uni","Qde",1,2,3,4,5,6,7,8,9,10]
[1,"1.1",{"$f":"PFP!D8","v":"Engenheiro coordenador (P8061)"},{"$f":"PFP!E8","v":"mês"},{"$f":"SUM(F5:O5)","v":0.15000000000000002},0.05,0.05,0.05]
[1,"1.2",{"$f":"PFP!D9","v":"Engenheiro pleno (P8066)"},{"$f":"PFP!E9","v":"mês"},{"$f":"SUM(F6:O6)","v":0}]
[1,"1.3",{"$f":"PFP!D10","v":"Engenheiro júnior (P8065)"},{"$f":"PFP!E10","v":"mês"},0]
[1,"1.4",{"$f":"PFP!D11","v":"Desenhista (40807)"},{"$f":"PFP!E11","v":"mês"},1.5,0.5,0.5,0.5]
[1,"1.5",{"$f":"PFP!D12","v":"Técnico de projetos/obra (P8147)"},"mês",1.5,0.5,0.5,0.5]
[1,"1.6",{"$f":"PFP!D16","v":"Relatório Parcial"},{"$f":"PFP!E16","v":"un"},0]
{"$rows_left_out":28}
{"sheet":"COT. VANT","index":9,"n_rows":17,"n_cols":10,"rows_kept":17,"cut":false,"hidden":true,"merged":[[1,0,1,9],[7,0,9,0],[7,1,7,5],[8,1,8,5],[9,1,9,5]]}
[]
["COTAÇÃO ORÇAMENTÁRIA DE LEVANTAMENTO PLANIALTIMÉTRICO POR MEIO DE VANT PARA ÁREA NA CIDADE DE PINDARÉ-MIRIM-MA"]
["MÊS/ANO DE REFERÊNCIA ","ÁREA DO PROJETO [ha]","EMPRESA","LOCALIDADE","WEBSITE","CONTATO","AVALIAÇÃO TÉCNICA DA PROPOSTA","PREÇO","PREÇO UNITÁRIO","RELAÇÃO CUSTO-BENEFÍCIO"]
["2022-09-01",50,"DRONES SOLUTION","SALVADOR-BA","http://www.dronessolution.com.br/","contato@dronessolution.com.br","SATISFATÓRIA",9800,{"$f":"(H4/B4)","v":196},"A"]
["2022-09-01",50,"ERG","BELO HORIZONTE-MG","http://www.ergbh.com.br/","comercial@ergbh.com.br","SATISFATÓRIA",13240.5,{"$f":"(H5/B5)","v":264.81},"B"]
["2022-09-01",50,"CEPEMAR","VITÓRIA-ES","http://www.cepemar.com.br/","comercial@cepemar.com.br","SATISFATÓRIA",63000,1260,"C"]
[]
["Observações","  1. Na cotação acima já estão iclusos: Planejamento Aerotogramétrico, Voo Aerotoforamétrico, Apoio de Campo, Aerotriangulação, Restituição, MDT, MDS, Ortofotos, Edição/Revisão e Entrega Final.",{"$nulls":4},"CV com todos valores:",{"$f":"STDEVA(H4:H6)/AVERAGE(H4:H6)","v":1.0380549324194583}]
[null,"  2. INCONCLUSIVA: não apresentou o orçamento de forma detalhada.",{"$nulls":4},"CV tirando o maior valor:",{"$f":"STDEVA(H4:H5)/AVERAGE(H4:H5)","v":0.21117604918923782}]
[null,"  3. SATISFATÓRIA: apresentou, no mínimo, os requisitos básicos de um orçamento.",{"$nulls":4},"Média tirando o maior valor:",{"$f":"AVERAGE(H4:H5)","v":11520.25},"Valor para a área de 65ha"]
{"$rows_left_out":8}
{"sheet":"Planilha de Medição","index":10,"n_rows":27,"n_cols":9,"rows_kept":27,"cut":false,"hidden":false,"merged":[[4,1,4,2],[0,1,2,8]]}
[null,"PLANILHA DE MEDIÇÃO"]
[]
[]
[]
[null,"#",null,"DESCRIÇÃO","P. PARCIAL (80%)","P. GLOBAL","P. UNITÁRIO","P. TOTAL","% PRODUTO"]
[null,1,1,"Estudos Básicos (EB)",null,null,null,{"$f":"'CRO1_Ins-Pro'!H17","v":193029.6},{"$f":"H6/$H$27","v":0.32223332949884392}]
[null,1,"1.1","Serviços Topográficos/Cartográficos",{"$f":"H7*0.8","v":36337.184000000001},null,{"$f":"H7","v":45421.48},{"$f":"'CRO1_Ins-Pro'!F15","v":45421.48},{"$f":"H7/H6","v":0.23530836721414747}]
[null,1,"1.2","Serviços Geológicos/Geotécnicos",{"$f":"H8*0.8","v":95457.112000000008},null,{"$f":"H8","v":119321.39},{"$f":"'CRO1_Ins-Pro'!F16","v":119321.39},{"$f":"H8/H6","v":0.618150739575692}]
[null,1,"1.3","Estudos Hidrológicos e Hidrogeológicos",{"$f":"H9*0.8","v":5868.0998399999999},{"$f":"H9","v":7335.1247999999996},null,{"$f":"I9*H6","v":7335.1247999999996},3.7999999999999999E-2]
[null,1,"1.4","Relatório de Avaliação Fundiária",{"$f":"H10*0.8","v":4848.9035519999998},{"$f":"H10","v":6061.1294399999997},null,{"$f":"I10*H6","v":6061.1294399999997},3.1399999999999997E-2]
{"$rows_left_out":18}
{"sheet":"Cronograma Físico-Financeiro","index":11,"n_rows":19,"n_cols":14,"rows_kept":19,"cut":false,"hidden":false,"merged":[[13,1,14,2],[17,1,18,2],[10,1,11,1],[10,2,11,2],[0,1,1,4],[4,1,5,1],[4,2,5,2],[6,1,7,1],[6,2,7,2],[8,1,9,1],[8,2,9,2],[15,2,16,2]]}
[null,"CRONOGRAMA FÍSICO-FINANCEIRO"]
[]
[]
[null,null,null,"Mês 1","Mês 2","Mês 3","Mês 4","Mês 5","Mês 6","Mês 7","Mês 8","Mês 9","Mês 10"]
[null,"Estudos Básicos (EB)",{"$f":"'CRO1_Ins-Pro'!H17","v":193029.6},{"$f":"D6*$C$5","v":30884.736000000001},77211.840000000011,27024.144000000004,0,57908.88,0,0,0,0,0,{"$f":"SUM(D5:M5)","v":193029.60000000003}]
[null,null,null,0.16,0.4,0.14000000000000001,null,0.3,{"$nulls":5},1]
[null,"Estudo de Viabilidade Técnica, Econômica e Ambiental (EVTEA)",{"$f":"'CRO1_Ins-Pro'!I17","v":122984.31},{"$f":"D8*$C$7","v":36895.292999999998},49193.724000000002,36895.292999999998,0,0,0,0,0,0,0,122984.31]
[null,null,null,0.3,0.4,0.3,{"$nulls":7},1]
[null,"Projeto Básico (PB)",{"$f":"'CRO1_Ins-Pro'!J17","v":200174.77},{"$f":"D10*$C$9","v":0},0,0,20017.476999999999,40034.953999999998,50043.692499999997,50043.692499999997,40034.953999999998,0,0,200174.77]
[{"$nulls":6},0.1,0.2,0.25,0.25,0.2,0,null,1]
{"$rows_left_out":10}
{"sheet":"CPU VEICULO_PickUp","index":12,"n_rows":61,"n_cols":33,"rows_kept":61,"cut":false,"hidden":false,"merged":[[52,8,52,18],[52,19,52,26],[4,0,4,2],[6,0,6,2],[7,0,7,1],[7,4,7,7],[8,0,8,2]]}
[]
[]
[]
[]
["Composição de Preços de Locação de Veículo tipo pick-up"]
[null,"Data de atualização:","2024-01-22",null,"CV","Média","Mediana",null,null,null,"CV","Média","Mediana",{"$nulls":8},"CV","Média","Mediana"]
["CODEVASF ",null,null,null,{"$f":"_xlfn.STDEV.S(E10:H10)/AVERAGE(E10:H10)","v":9.2667922664402616E-2},{"$f":"AVERAGE(E10:H10)","v":179935.5},{"$f":"MEDIAN(E10:H10)","v":184702},null,null,null,{"$f":"_xlfn.STDEV.S(L9:S9)/AVERAGE(L9:S9)","v":0.20952494145854728},{"$f":"AVERAGE(L9:S9)","v":31.095714285714287},{"$f":"MEDIAN(L9:S9)","v":30.16},{"$nulls":8},{"$f":"_xlfn.STDEV.S(W9:AD9)/AVERAGE(W9:AD9)","v":0.13240988535259646},{"$f":"AVERAGE(W9:AD9)","v":430.60093749999999},{"$f":"MEDIAN(W9:AD9)","v":437.31624999999997}]
["OBS:               Preço sem BDI e sem motorista                                                                   BDI=",null,null,null,"Preço FIPE ",{"$nulls":4},"PRODUTO ","MENOR (MÉDIA, MEDIANA)","COT. 1","COT. 2","COT. 3","COT. 4","COT. 5","COT. 6","COT. 7","COT. 8",null,"PRODUTO","MENOR (MÉDIA, MEDIANA)","COT. 1","COT. 2","COT. 3","COT. 4","COT. 5","COT. 6","COT. 7","COT. 8"]
["Veículo tipo pick-up, cabine dupla - 2.0 16V 4x4 diesel Aut.",null,null,null,"Toro Ultra 2.0 16V 4x4 TB Diesel Aut.","Toro Freedom 2.0 16V 4x4 TB Diesel Aut.","Toro Volcano 2.0 16V 4x4 TB Diesel Aut."," Toro Ranch 2.0 16V 4x4 TB Diesel Aut.\n",null,"LUBRIFICANTE 5W30",{"$f":"SMALL(L7:M7,1)","v":30.16},32.270000000000003,28.9,30.16,37.700000000000003,39.99,20.25,28.4,null,null,"Pneu 225/65 R17",{"$f":"SMALL(W7:X7,1)","v":430.60093749999999},{"$f":"1661.85/4","v":415.46249999999998},{"$f":"1940.9/4","v":485.22500000000002},399.88,330.46,479.6,386.23,459.17,488.78]
[null,"Custo Mensal (R$):",{"$f":"C51","v":7163.7901683616183},null,193030,157308,177450,191954]
{"$rows_left_out":52}
{"sheet":"Consultiva atualizada","index":13,"n_rows":113,"n_cols":25,"rows_kept":113,"cut":false,"hidden":false,"merged":[[0,16,0,21],[0,22,0,23],[0,5,0,15],[1,5,1,6],[1,7,1,8],[1,9,1,10],[1,11,1,12],[1,13,1,14]]}
["Código","Categoria","Unid.","Salário","Encargos Sociais","Encargos Complementares",{"$nulls":10},"Encargos Adicionais",{"$nulls":5},"Encargos Totais",null,"Valor Total"]
[{"$nulls":5},"Alimentação",null,"EPI",null,"Ferramenta",null,"Transporte",null,"Exame Ocupacional",null,null,"Cesta Básica",null,"Assistência Médica",null,"Seguro de Vida"]
[null,null,null,"R$","%","R$","%","R$","%","R$","%","R$","%","R$","%","R$","%","R$","%","R$","%","R$","%","R$","R$"]
["Profissionais mensalistas"]
["P8001","Advogado júnior","mês",4530.07,0.79290000000000005,3591.89,0.1552,702.89,5.4999999999999997E-3,24.99,0,0,0,0,5.9999999999999995E-4,2.83,0,0,6.3899999999999998E-2,289.39,2.2000000000000001E-3,9.98,1.0203,4621.9799999999996,9152.0499999999993]
["P8002","Advogado pleno","mês",6040.1,0.79290000000000005,4789.1899999999996,0.1164,702.89,4.1000000000000003E-3,24.99,0,0,0,0,5.0000000000000001E-4,2.83,0,0,4.7899999999999998E-2,289.39,1.6999999999999999E-3,9.98,0.96340000000000003,5819.27,11859.37]
["P8003","Advogado sênior","mês",11150.15,0.79290000000000005,8840.9500000000007,6.3E-2,702.89,2.2000000000000001E-3,24.99,0,0,0,0,2.9999999999999997E-4,2.83,0,0,2.5999999999999999E-2,289.39,8.9999999999999998E-4,9.98,0.88529999999999998,9871.0300000000007,21021.18]
["P8007","Analista de desenvolvimento de sistemas júnior","mês",4761.5,0.79600000000000004,3790.16,0.14760000000000001,702.89,0,0,0,0,0,0,8.0000000000000004E-4,3.69,0,0,6.08E-2,289.39,2.0999999999999999E-3,9.98,1.0073000000000001,4796.1099999999997,9557.61]
["P8008","Analista de desenvolvimento de sistemas pleno","mês",5587.15,0.79600000000000004,4447.37,0.1258,702.89,0,0,0,0,0,0,6.9999999999999999E-4,3.69,0,0,5.1799999999999999E-2,289.39,1.8E-3,9.98,0.97599999999999998,5453.33,11040.48]
["P8009","Analista de desenvolvimento de sistemas sênior","mês",9769.36,0.79600000000000004,7776.41,7.1900000000000006E-2,702.89,0,0,0,0,0,0,4.0000000000000002E-4,3.69,0,0,2.9600000000000001E-2,289.39,1E-3,9.98,0.89900000000000002,8782.3700000000008,18551.73]
{"$rows_left_out":103}