{"text_format":"2","workbook":"xlsx","n_sheets":15,"sheets":["PFP","PFP1.1_Topo","PFP1.2_Geo","PFP2.1_FatorKa","PFP2.2_FatorKb","PFP2.3_FatorKc","PFP3_FatorKd","CRO1_Ins-Pro","CRO2_Ins-Mes","CRO3_Fis-Finan","MDO_DNIT","CPU HOSPEDAGEM","CPU-VEICULO_PickUp","Cotação Voos","COT. VANT"],"not_rendered":{"charts":0,"images":21,"macros":0,"external_links":49,"defined_names":19579,"comments":1,"pivot_tables":0},"unopened":[],"bounds":{"document_bytes":16777216,"sheet_cells":100000,"run_cost":"one","rows_first":2000,"rows_last":500,"rows_between":2000,"halvings":0,"cell_chars":16384,"cell_head_chars":4096},"cells_cut":0,"cells_raw":0,"read":"whole","date_system":"1900"}

{"sheet":"PFP","index":0,"n_rows":45,"n_cols":18,"rows_kept":45,"cut":false,"hidden":false,"merged":[[27,9,27,12],[27,1,27,8],[26,9,26,12],[26,1,26,8],[34,1,34,12],[28,1,28,8],[28,9,28,12],[31,1,31,12],[30,1,30,12],[42,1,42,12],[35,1,35,12],[37,1,37,12],[29,1,29,12],[36,1,36,12],[32,1,32,12],[38,1,38,12],[39,1,39,12],[40,1,40,12],[41,1,41,12],[33,1,33,12],[0,1,1,10],[4,7,4,10],[0,11,0,12],[1,11,1,12],[4,11,4,12],[2,1,2,12],[3,1,3,12],[4,1,4,6],[5,11,5,12],[5,7,5,10],[25,1,25,8],[25,9,25,12],[5,1,5,6],[24,1,24,8],[24,9,24,12]]}
[null,"PROPOSTA FINANCEIRA DO PROJETO",{"$nulls":9},"CODIGO:"]
[{"$nulls":11},"PFP"]
[null,"NOME DA CONSULTORA:"]
[]
[null,"PROJETO:",{"$nulls":5},"CONTRATANTE:",null,null,null,"BASE:"]
[null,"Elaboração de Estudo de Viabilidade Técnica, Econômica e Ambiental da barragem de Gravatá, município de Novo Cruzeiro, no estado de Minas Gerais ",{"$nulls":5},"CODEVASF (SEDE)",null,null,null,"2024-08-01"]
[null,"Base","Cod2","Cod3","Código","Categoria / Insumo","Uni","Qde","CUD","PU","FatorK","CT","PT","Encargos COMP E ADICIONAIS","SOCIAIS","TOTAIS",null,"Encargos Comp e Adicionais"]
[null,"SICRO","MO3","P0","P8061","Engenheiro coordenador (P8061)","mês",{"$f":"'CRO1_Ins-Pro'!D5","v":5},{"$f":"VLOOKUP(E8,MDO_DNIT!$A:$Z,4,0)","v":17866.689999999999},{"$f":"ROUND(K8*I8,2)","v":22990.86},{"$f":"PFP2.3_FatorKc!E35","v":1.2867999999999999},{"$f":"ROUND(H8*I8,2)","v":89333.45},{"$f":"ROUND(H8*J8,2)","v":114954.3},{"$f":"P8-O8","v":1026.8900000000012},13451.98,14478.87,null,{"$f":"VLOOKUP(E8,MDO_DNIT!$A:$Z,26,0)","v":1029.0600000000013}]
{"$rows_left_out":38}
{"sheet":"PFP1.1_Topo","index":1,"n_rows":29,"n_cols":12,"rows_kept":29,"cut":false,"hidden":false,"merged":[[28,0,28,7],[0,0,1,5],[2,0,2,7],[3,0,3,7],[4,0,4,3],[4,4,4,5],[5,0,5,3],[5,4,5,5],[23,0,23,5],[24,0,24,7],[25,0,25,7],[26,0,26,7],[27,0,27,7],[6,9,7,11],[8,9,9,9],[8,10,9,10],[8,11,9,11],[10,9,10,11],[24,9,24,10],[25,9,25,10],[26,9,27,11],[28,9,28,10],[11,10,11,11],[16,9,16,10],[17,10,17,11],[19,9,19,10],[20,10,20,11]]}
["SERVIÇOS TOPOGRÁFICOS/CARTOGRÁFICOS",{"$nulls":6},"CODIGO:"]
[{"$nulls":7},"PFP-1.1"]
["NOME DA EMPRESA:"]
[]
["PROJETO:",null,null,null,"CONTRATANTE:",null,null,{"$f":"PFP!L5","v":"BASE:"}]
[{"$f":"PFP!B6","v":"Elaboração de Estudo de Viabilidade Técnica, Econômica e Ambiental da barragem de Gravatá, município de Novo Cruzeiro, no estado de Minas Gerais "},null,null,null,"CODEVASF (SEDE)",null,null,{"$f":"PFP!L6","v":"2024-08-01"}]
["Referência","Código","Insumos","Uni","Qde","Custo Unitário (CU)","Custo Total","Preço Total (PT)",null,"MEMÓRIA DE CALCULO DO BDI DE FORNECIMENTO"]
["EMBASA/COMPOSIÇÃO","31.90.22","Aerolevantamento com VANT/RPA categoria 3","ha ",700,34.31,{"$f":"ROUND(F8*E8,2)","v":24017},{"$f":"(G8*$L$29)+G8","v":27545.580568902446}]
{"$rows_left_out":22}
{"sheet":"PFP1.2_Geo","index":2,"n_rows":39,"n_cols":12,"rows_kept":39,"cut":false,"hidden":false,"merged":[[38,0,38,6],[5,0,5,3],[5,4,5,5],[7,2,7,6],[2,0,2,6],[3,0,3,6],[4,0,4,3],[4,4,4,5],[36,0,36,6],[37,0,37,6],[33,0,33,5],[34,0,34,6],[35,0,35,6],[26,9,26,10],[27,9,27,10],[28,9,29,11],[30,9,30,10],[0,0,1,6],[13,10,13,11],[18,9,18,10],[19,10,19,11],[21,9,21,10],[22,10,22,11],[8,9,9,11],[10,9,11,9],[10,10,11,10],[10,11,11,11],[12,9,12,11]]}
["SERVIÇOS GEOLÓGICOS/GEOTÉCNICOS",{"$nulls":6},"CODIGO:"]
[{"$nulls":7},"PFP-1.2"]
["NOME DA EMPRESA:"]
[]
["PROJETO: ",null,null,null,"CONTRATANTE:",null,{"$f":"PFP!L5","v":"BASE:"}]
[{"$f":"PFP!B6","v":"Elaboração de Estudo de Viabilidade Técnica, Econômica e Ambiental da barragem de Gravatá, município de Novo Cruzeiro, no estado de Minas Gerais "},null,null,null,"CODEVASF (SEDE)",null,{"$f":"PFP!L6","v":"2024-08-01"}]
["Cod.","Base","Insumos","Uni","Qde","Custo Unitário (CU)","Custo Total","Preço Total (PT)"]
["GT 1",null,"Sondagem mista"]
{"$rows_left_out":32}
{"sheet":"PFP2.1_FatorKa","index":3,"n_rows":41,"n_cols":6,"rows_kept":41,"cut":false,"hidden":false,"merged":[[35,1,35,3],[6,1,6,3],[40,0,40,5],[39,0,39,5],[38,0,38,5],[37,0,37,5],[22,1,22,3],[29,1,29,3],[30,1,30,3],[28,1,28,3],[25,1,25,3],[26,1,26,3],[27,1,27,3],[33,1,33,3],[31,1,31,3],[32,1,32,3],[34,1,34,3],[0,0,1,4],[2,0,2,5],[5,0,5,1],[5,2,5,4],[4,2,4,4],[3,0,3,5],[24,1,24,3],[7,1,7,3],[17,1,17,3],[8,1,8,3],[13,1,13,3],[14,1,14,3],[15,1,15,3],[18,1,18,3],[19,1,19,3],[20,1,20,3],[21,1,21,3],[23,1,23,3],[9,1,9,3],[10,1,10,3],[11,1,11,3],[12,1,12,3]]}
["DETALHAMENTO DOS ENCARGOS SOCIAIS: Ka",{"$nulls":4},"CODIGO:"]
[{"$nulls":5},"PFP-2.1"]
["NOME DA CONSULTORA:"]
[]
["PROJETO:",null,"CONTRATANTE:",null,null,{"$f":"PFP!L5","v":"BASE:"}]
[{"$f":"PFP!B6","v":"Elaboração de Estudo de Viabilidade Técnica, Econômica e Ambiental da barragem de Gravatá, município de Novo Cruzeiro, no estado de Minas Gerais "},null,"CODEVASF (SEDE)",null,null,"SINAPI/MG"]
["Cod","DESCRIÇÃO",null,null,"%","R$"]
["A","ENCARGOS SOCIAIS BÁSICOS",null,null,{"$f":"ROUND(SUM(E9:E17),4)","v":0.38},{"$f":"ROUND(E8*SUMIF(PFP!$C$8:$C$24,\"MO1\",PFP!$L$8:$L$24),2)","v":140817.85999999999}]
{"$rows_left_out":34}
{"sheet":"PFP2.2_FatorKb","index":4,"n_rows":40,"n_cols":6,"rows_kept":40,"cut":false,"hidden":false,"merged":[[27,1,27,3],[28,1,28,3],[29,1,29,3],[22,1,22,3],[23,1,23,3],[24,1,24,3],[25,1,25,3],[26,1,26,3],[6,1,6,3],[12,1,12,3],[13,1,13,3],[39,0,39,5],[36,0,36,5],[37,0,37,5],[38,0,38,5],[31,1,31,3],[32,1,32,3],[33,1,33,3],[34,1,34,3],[18,1,18,3],[30,1,30,3],[19,1,19,3],[20,1,20,3],[21,1,21,3],[0,0,1,4],[2,0,2,5],[3,0,3,5],[4,2,4,4],[5,0,5,1],[5,2,5,4],[7,1,7,3],[16,1,16,3],[17,1,17,3],[8,1,8,3],[9,1,9,3],[10,1,10,3],[14,1,14,3],[15,1,15,3],[11,1,11,3]]}
["DETALHAMENTO DOS ENCARGOS SOCIAIS: Kb",{"$nulls":4},"CODIGO:"]
[{"$nulls":5},"PFP-2.2"]
["NOME DA CONSULTORA:"]
[]
["PROJETO:",null,"CONTRATANTE:",null,null,{"$f":"PFP2.1_FatorKa!F5","v":"BASE:"}]
[{"$f":"PFP!B6","v":"Elaboração de Estudo de Viabilidade Técnica, Econômica e Ambiental da barragem de Gravatá, município de Novo Cruzeiro, no estado de Minas Gerais "},null,"CODEVASF (SEDE)",null,null,{"$f":"PFP2.1_FatorKa!F6","v":"SINAPI/MG"}]
["Cod","DESCRIÇÃO",null,null,"%","R$"]
["A","ENCARGOS SOCIAIS BÁSICOS",null,null,{"$f":"ROUND(SUM(E9:E16),4)","v":0.2},{"$f":"ROUND(E8*SUMIF(PFP!$C$8:$C$24,\"MO2\",PFP!$L$8:$L$24),2)","v":71596.88}]
{"$rows_left_out":33}
{"sheet":"PFP2.3_FatorKc","index":5,"n_rows":40,"n_cols":6,"rows_kept":40,"cut":false,"hidden":false,"merged":[[0,0,1,4],[2,0,2,5],[3,0,3,5],[4,2,4,4],[5,0,5,1],[5,2,5,4],[16,1,16,3],[6,1,6,3],[7,1,7,3],[8,1,8,3],[9,1,9,3],[10,1,10,3],[11,1,11,3],[12,1,12,3],[13,1,13,3],[14,1,14,3],[15,1,15,3],[28,1,28,3],[17,1,17,3],[18,1,18,3],[19,1,19,3],[20,1,20,3],[21,1,21,3],[22,1,22,3],[23,1,23,3],[24,1,24,3],[25,1,25,3],[26,1,26,3],[27,1,27,3],[36,0,36,5],[37,0,37,5],[38,0,38,5],[39,0,39,5],[29,1,29,3],[30,1,30,3],[31,1,31,3],[32,1,32,3],[33,1,33,3],[34,1,34,3]]}
["DETALHAMENTO DOS ENCARGOS SOCIAIS: Kc",{"$nulls":4},"CODIGO:"]
[{"$nulls":5},"PFP-2.3"]
["NOME DA CONSULTORA:"]
[]
["PROJETO:",null,"CONTRATANTE:",null,null,{"$f":"PFP2.2_FatorKb!F5","v":"BASE:"}]
[{"$f":"PFP!B6","v":"Elaboração de Estudo de Viabilidade Técnica, Econômica e Ambiental da barragem de Gravatá, município de Novo Cruzeiro, no estado de Minas Gerais "},null,"CODEVASF (SEDE)",null,null,{"$f":"PFP2.2_FatorKb!F6","v":"SINAPI/MG"}]
["Cod","DESCRIÇÃO",null,null,"%","R$"]
["A","ENCARGOS SOCIAIS BÁSICOS",null,null,{"$f":"SUM(E9:E16)","v":0},{"$f":"ROUND(E8*SUMIF(PFP!$C$8:$C$24,\"MO3\",PFP!$L$8:$L$24),2)","v":0}]
{"$rows_left_out":33}
{"sheet":"PFP3_FatorKd","index":6,"n_rows":35,"n_cols":6,"rows_kept":35,"cut":false,"hidden":false,"merged":[[32,0,32,5],[12,1,12,3],[11,1,11,3],[8,1,8,2],[9,1,9,2],[10,1,10,2],[7,1,7,2],[25,0,25,5],[6,1,6,2],[0,0,1,4],[2,0,2,5],[5,0,5,1],[5,2,5,4],[4,2,4,4],[3,0,3,5],[33,0,33,5],[34,0,34,5],[16,1,16,3],[13,1,13,3],[14,1,14,3],[15,1,15,3],[21,0,21,5],[26,0,26,5],[27,0,27,5],[22,0,22,5],[23,0,23,5],[24,0,24,5],[28,0,28,5],[29,0,29,5],[30,0,30,5],[31,0,31,5]]}
["DESPESAS FISCAIS E CUSTOS DIVERSOS: Kc",{"$nulls":4},"CODIGO:"]
[{"$nulls":5},"PFP-3"]
["NOME DA CONSULTORA:"]
[]
["PROJETO:",null,"CONTRATANTE:",null,null,{"$f":"PFP2.3_FatorKc!F5","v":"BASE:"}]
[{"$f":"PFP!B6","v":"Elaboração de Estudo de Viabilidade Técnica, Econômica e Ambiental da barragem de Gravatá, município de Novo Cruzeiro, no estado de Minas Gerais "},null,"CODEVASF (SEDE)",null,null,{"$f":"PFP2.3_FatorKc!F6","v":"SINAPI/MG"}]
["Cod","DESCRIÇÃO1",null,"% preço2","% custo4","R$"]
["K4","TRIBUTOS",null,{"$f":"ROUND(D9+D10+D11,4)","v":0.104},{"$f":"ROUND(E9+E10+E11,4)","v":0.11609999999999999},{"$f":"E8*SUM(SUMIF(PFP!$C$8:$C$24,\"MO1\",PFP!$L$8:$L$24)*(1+PFP2.1_FatorKa!$E$35)+SUMIF(PFP!$C$8:$C$24,\"MO2\",PFP!$L$8:$L$24)*(1+PFP2.2_FatorKb!$E$34)+SUMIF(PFP!$C$8:$C$24,\"<>MO*\",PFP!$L$8:$L$24)+$F$13+$F$12)","v":167429.63652465047}]
{"$rows_left_out":28}
{"sheet":"CRO1_Ins-Pro","index":7,"n_rows":89,"n_cols":19,"rows_kept":89,"cut":false,"hidden":false,"merged":[[87,0,87,7],[86,0,86,8],[21,0,22,0],[21,1,22,1],[2,0,3,0],[2,1,3,1],[2,2,3,2],[2,3,3,3],[2,4,3,4],[2,5,3,5],[2,7,2,17]]}
["INSUMOS POR ETAPA/PRODUTO",{"$nulls":16},"CÓDIGO:"]
[{"$nulls":17},"CRO-1"]
["Cod.","Categoria / Insumo","Uni","Qde","CUD","PU","FatorK","E1.EVTEA"]
[{"$nulls":6},"Meses","EVTEA","P 1.1","P 1.2","P 1.3","P 1.4","P 1.5","P 1.6","P 1.7","P 1.8","P 1.9","P 1.10"]
[{"$f":"PFP!D8","v":"P0"},{"$f":"PFP!F8","v":"Engenheiro coordenador (P8061)"},"mês",{"$f":"SUM(H5:H5)","v":5},{"$f":"PFP!I8","v":17866.689999999999},{"$f":"PFP!J8","v":22990.86},{"$f":"PFP!K8","v":1.2867999999999999},{"$f":"'CRO2_Ins-Mes'!E17","v":5},{"$f":"'CRO2_Ins-Mes'!E34","v":1},{"$f":"'CRO2_Ins-Mes'!E50","v":0.1},{"$f":"'CRO2_Ins-Mes'!E66","v":0.22500000000000001},{"$f":"'CRO2_Ins-Mes'!E82","v":0.22500000000000001},{"$f":"'CRO2_Ins-Mes'!E98","v":0.22500000000000001},{"$f":"'CRO2_Ins-Mes'!E114","v":0.22500000000000001},{"$f":"'CRO2_Ins-Mes'!E131","v":1},{"$f":"'CRO2_Ins-Mes'!E147","v":0.66666666666666663},{"$f":"'CRO2_Ins-Mes'!E163","v":0.66666666666666663},{"$f":"'CRO2_Ins-Mes'!E179","v":0.66666666666666663}]
[{"$f":"PFP!D9","v":"P1"},{"$f":"PFP!F9","v":"Engenheiro sênior (P8067)"},"mês",{"$f":"SUM(H6:H6)","v":23},{"$f":"PFP!I9","v":15564.54},{"$f":"PFP!J9","v":23771.72},{"$f":"PFP!K9","v":1.5273000000000001},{"$f":"'CRO2_Ins-Mes'!E18","v":23},{"$f":"'CRO2_Ins-Mes'!E35","v":1},{"$f":"'CRO2_Ins-Mes'!E51","v":0.8},{"$f":"'CRO2_Ins-Mes'!E67","v":1.55},{"$f":"'CRO2_Ins-Mes'!E83","v":1.55},{"$f":"'CRO2_Ins-Mes'!E99","v":1.55},{"$f":"'CRO2_Ins-Mes'!E115","v":1.55},{"$f":"'CRO2_Ins-Mes'!E132","v":6},{"$f":"'CRO2_Ins-Mes'!E148","v":4},{"$f":"'CRO2_Ins-Mes'!E164","v":2.5},{"$f":"'CRO2_Ins-Mes'!E180","v":2.5}]
[{"$f":"PFP!D10","v":"P2"},{"$f":"PFP!F10","v":"Engenheiro pleno (P8066)"},"mês",13,{"$f":"PFP!I10","v":12379.96},{"$f":"PFP!J10","v":26022.68},{"$f":"PFP!K10","v":2.1019999999999999},{"$f":"'CRO2_Ins-Mes'!E19","v":13},{"$f":"'CRO2_Ins-Mes'!E36","v":1},{"$f":"'CRO2_Ins-Mes'!E52","v":0.4},{"$f":"'CRO2_Ins-Mes'!E68","v":0.9},{"$f":"'CRO2_Ins-Mes'!E84","v":0.9},{"$f":"'CRO2_Ins-Mes'!E100","v":0.9},{"$f":"'CRO2_Ins-Mes'!E116","v":0.9},{"$f":"'CRO2_Ins-Mes'!E133","v":4},{"$f":"'CRO2_Ins-Mes'!E149","v":1.6666666666666665},{"$f":"'CRO2_Ins-Mes'!E165","v":1.1666666666666665},{"$f":"'CRO2_Ins-Mes'!E181","v":1.1666666666666665}]
[{"$f":"PFP!D11","v":"P3"},{"$f":"PFP!F11","v":"Engenheiro júnior (P8065)"},"mês",7,{"$f":"PFP!I11","v":12002},{"$f":"PFP!J11","v":25228.2},{"$f":"PFP!K11","v":2.1019999999999999},{"$f":"'CRO2_Ins-Mes'!E20","v":7},{"$f":"'CRO2_Ins-Mes'!E37","v":0},{"$f":"'CRO2_Ins-Mes'!E53","v":0.2},{"$f":"'CRO2_Ins-Mes'!E69","v":0.45},{"$f":"'CRO2_Ins-Mes'!E85","v":0.45},{"$f":"'CRO2_Ins-Mes'!E101","v":0.45},{"$f":"'CRO2_Ins-Mes'!E117","v":0.45},{"$f":"'CRO2_Ins-Mes'!E134","v":2},{"$f":"'CRO2_Ins-Mes'!E150","v":1.3333333333333333},{"$f":"'CRO2_Ins-Mes'!E166","v":0.83333333333333326},{"$f":"'CRO2_Ins-Mes'!E182","v":0.83333333333333326}]
{"$rows_left_out":21}
{"sheet":"CRO2_Ins-Mes","index":8,"n_rows":193,"n_cols":13,"rows_kept":193,"cut":false,"hidden":false,"merged":[[0,0,1,12],[27,23,27,30]]}
["CRONOGRAMA SIMPLIFICADO"]
[]
["Cod1","Cod2","Produtos","Uni","Qde",1,2,3,4,5,6,7,8]
[1,"1.1","Detalhamento dos planos de desenvolvimnto regional","mês",{"$f":"SUM(F4:AB4)","v":1},1]
[1,"1.2","Caracterização Geográfica, Demográfica e Justificativas Iniciais","mês",{"$f":"SUM(G5:AB5)","v":1},null,1]
[1,"1.3","Estudos Topográfico","mês",2,null,1,1]
[1,"1.4","Estudos Hidrológicos","mês",2,null,1,1]
[1,"1.5","Estudos Geotécnicos","mês",2,null,1,1]
{"$rows_left_out":186}
{"sheet":"CRO3_Fis-Finan","index":9,"n_rows":30,"n_cols":13,"rows_kept":30,"cut":false,"hidden":false,"merged":[[3,1,4,1],[3,0,4,0],[3,3,4,3],[5,1,6,1],[36,23,36,30],[24,3,25,3],[26,3,27,3],[28,3,29,3],[3,2,4,2],[13,3,14,3],[11,0,12,0],[13,0,14,0],[5,0,6,0],[5,2,6,2],[5,3,6,3],[7,2,8,2],[7,3,8,3],[7,1,8,1],[7,0,8,0],[9,1,10,1],[9,0,10,0],[9,2,10,2],[9,3,10,3],[11,3,12,3],[11,1,12,1],[13,1,14,1],[13,2,14,2],[15,2,16,2],[15,1,16,1],[0,0,1,11],[15,0,16,0],[17,2,18,2],[19,2,20,2],[21,2,22,2],[17,1,18,1],[17,0,18,0],[19,1,20,1],[19,0,20,0],[21,1,22,1],[21,0,22,0],[15,3,16,3],[17,3,18,3],[19,3,20,3],[21,3,22,3],[11,2,12,2]]}
["CRONOGRAMA FÍSICO-FINANCEIRO"]
[]
["Cod1","Cod2","Produtos",null,"Mês 1","Mês 2","Mês 3","Mês 4","Mês 5","Mês 6","Mês 7","Mês 8"]
[1,"1.1","Detalhamento dos planos de desenvolvimnto regional",{"$f":"'CRO1_Ins-Pro'!I22","v":105710.32999999999},{"$f":"$D$4*E5","v":105710.32999999999},{"$f":"$D$4*F5","v":0},0,0,0,0,0,0,{"$f":"SUM(E4:L4)","v":105710.32999999999}]
[{"$nulls":4},1,0,{"$nulls":6},{"$f":"SUM(E5:L5)","v":1}]
[1,"1.2","Caracterização Geográfica, Demográfica e Justificativas Iniciais",{"$f":"'CRO1_Ins-Pro'!J22","v":56876.727000000006},{"$f":"$D$6*E7","v":0},{"$f":"$D$6*F7","v":56876.727000000006},0,0,0,0,0,0,56876.727000000006]
[{"$nulls":5},1,{"$nulls":6},1]
[1,"1.3","Estudos Topográfico",{"$f":"'CRO1_Ins-Pro'!K22+PFP1.1_Topo!H24","v":227008.29759031098},{"$f":"$D$8*E9","v":0},null,{"$f":"$D$8*(G9+F9)","v":227008.29759031098},{"$f":"$D$8*H9","v":0},0,0,0,0,227008.29759031098]
{"$rows_left_out":23}
{"sheet":"MDO_DNIT","index":10,"n_rows":113,"n_cols":26,"rows_kept":113,"cut":false,"hidden":false,"merged":[[1,20,1,21],[0,25,1,25],[0,16,0,21],[0,22,1,23],[0,24,1,24],[1,16,1,17],[1,18,1,19],[0,6,0,15],[0,0,2,0],[0,1,2,1],[0,2,2,2],[0,3,1,3],[0,4,1,5],[1,6,1,7],[1,8,1,9],[1,10,1,11],[1,12,1,13],[1,14,1,15]]}
["Código","Categoria","Unid.","Salário","Encargos Sociais",null,"Encargos Complementares",{"$nulls":9},"Encargos Adicionais",{"$nulls":5},"Encargos Totais",null,"Valor Total","Encargos Adicionais e Complementares"]
[{"$nulls":6},"Alimentação",null,"EPI",null,"Ferramenta",null,"Transporte",null,"Exame Ocupacional",null,"Cesta Básica",null,"Assistência Médica",null,"Seguro de Vida"]
[null,null,null,"R$","%","R$","%","R$","%","R$","%","R$","%","R$","%","R$","%","R$","%","R$","%","R$","%","R$","R$","R$"]
["Profissionais mensalistas"]
["P8001","Advogado júnior","mês",4530.07,0.79290000000000005,3591.89,0.1552,702.89,5.4999999999999997E-3,24.99,0,0,0,0,5.9999999999999995E-4,2.83,0,0,6.3899999999999998E-2,289.39,2.2000000000000001E-3,9.98,1.0203,4621.9799999999996,9152.0499999999993,{"$f":"Y5-F5-D5","v":1030.0900000000001}]
["P8002","Advogado pleno","mês",6040.1,0.79290000000000005,4789.1899999999996,0.1164,702.89,4.1000000000000003E-3,24.99,0,0,0,0,5.0000000000000001E-4,2.83,0,0,4.7899999999999998E-2,289.39,1.6999999999999999E-3,9.98,0.96340000000000003,5819.27,11859.37,{"$f":"Y6-F6-D6","v":1030.0800000000008}]
["P8003","Advogado sênior","mês",11150.15,0.79290000000000005,8840.9500000000007,6.3E-2,702.89,2.2000000000000001E-3,24.99,0,0,0,0,2.9999999999999997E-4,2.83,0,0,2.5999999999999999E-2,289.39,8.9999999999999998E-4,9.98,0.88529999999999998,9871.0300000000007,21021.18,1030.08]
["P8007","Analista de desenvolvimento de sistemas júnior","mês",4761.5,0.79600000000000004,3790.16,0.14760000000000001,702.89,0,0,0,0,0,0,8.0000000000000004E-4,3.69,0,0,6.08E-2,289.39,2.0999999999999999E-3,9.98,1.0073000000000001,4796.1099999999997,9557.61,1005.9500000000007]
{"$rows_left_out":106}
{"sheet":"CPU HOSPEDAGEM","index":11,"n_rows":19,"n_cols":4,"rows_kept":19,"cut":false,"hidden":false,"merged":[[2,1,2,2]]}
[]
[null,"Engenharia Consultiva da Codevasf"]
[null,"CPU - HOSPEDAGEM EQUIPE DE CAMPO (4 PESSOAS/MÊS)",null,"Código/Referencia"]
[null,"ALUGUEL ",3074.56,"F020003334/EMBASA"]
[null," Aquisição de Mobiliário",{"$f":"43.89*C16","v":175.56},"B8954/DNIT"]
[null,"Material de limpeza e diarista",{"$f":"126.93+(123*8)","v":1110.93},"10563/ORSE - E200300131/EMBASA"]
[null,"manutenção da casa alugada - Serviços Gerais/Vigia ",2706.8,"41096/SINAPI"]
[null,"Energia ",180,"10555/ORSE"]
{"$rows_left_out":12}
{"sheet":"CPU-VEICULO_PickUp","index":12,"n_rows":61,"n_cols":33,"rows_kept":61,"cut":false,"hidden":false,"merged":[[52,19,52,26],[4,0,4,2],[6,0,6,2],[7,0,7,1],[7,4,7,7],[8,0,8,2],[52,8,52,18]]}
[]
[]
[]
[]
["Composição de Preços de Locação de Veículo tipo pick-up"]
[null,"Data de atualização:","2024-01-22",null,"CV","Média","Mediana",null,null,null,"CV","Média","Mediana",{"$nulls":8},"CV","Média","Mediana"]
["CODEVASF ",null,null,null,{"$f":"_xlfn.STDEV.S(E10:H10)/AVERAGE(E10:H10)","v":9.2667922664402616E-2},{"$f":"AVERAGE(E10:H10)","v":179935.5},{"$f":"MEDIAN(E10:H10)","v":184702},null,null,null,{"$f":"_xlfn.STDEV.S(L9:S9)/AVERAGE(L9:S9)","v":0.20952494145854728},{"$f":"AVERAGE(L9:S9)","v":31.095714285714287},{"$f":"MEDIAN(L9:S9)","v":30.16},{"$nulls":8},{"$f":"_xlfn.STDEV.S(W9:AD9)/AVERAGE(W9:AD9)","v":0.13240988535259646},{"$f":"AVERAGE(W9:AD9)","v":430.60093749999999},{"$f":"MEDIAN(W9:AD9)","v":437.31624999999997}]
["OBS:               Preço sem BDI e sem motorista                                                                   BDI=",null,null,null,"Preço FIPE ",{"$nulls":4},"PRODUTO ","MENOR (MÉDIA, MEDIANA)","COT. 1","COT. 2","COT. 3","COT. 4","COT. 5","COT. 6","COT. 7","COT. 8",null,"PRODUTO","MENOR (MÉDIA, MEDIANA)","COT. 1","COT. 2","COT. 3","COT. 4","COT. 5","COT. 6","COT. 7","COT. 8"]
{"$rows_left_out":54}
{"sheet":"Cotação Voos","index":13,"n_rows":104,"n_cols":5,"rows_kept":104,"cut":false,"hidden":false,"merged":[]}
["COTAÇÕES - IDA DIA 04/011/2024 E VOLTA DIA 08/011/2024"]
[]
["BSB - Montes Claros","Cia 1","Cia 2","Cia 3","Média"]
[null,886,979,2105,{"$f":"AVERAGE(B4:D4)","v":1323.3333333333333}]
{"$rows_empty":24}
["SP - Montes Claros","Cia 1","Cia 2","Cia 3","Média"]
[null,683,744,743,{"$f":"AVERAGE(B30:D30)","v":723.33333333333337}]
{"$rows_empty":24}
{"$rows_left_out":8}
{"sheet":"COT. VANT","index":14,"n_rows":17,"n_cols":10,"rows_kept":17,"cut":false,"hidden":true,"merged":[[1,0,1,9],[7,0,9,0],[7,1,7,5],[8,1,8,5],[9,1,9,5]]}
[]
["COTAÇÃO ORÇAMENTÁRIA DE LEVANTAMENTO PLANIALTIMÉTRICO POR MEIO DE VANT PARA ÁREA NA CIDADE DE PINDARÉ-MIRIM-MA"]
["MÊS/ANO DE REFERÊNCIA ","ÁREA DO PROJETO [ha]","EMPRESA","LOCALIDADE","WEBSITE","CONTATO","AVALIAÇÃO TÉCNICA DA PROPOSTA","PREÇO","PREÇO UNITÁRIO","RELAÇÃO CUSTO-BENEFÍCIO"]
["2022-09-01",50,"DRONES SOLUTION","SALVADOR-BA","http://www.dronessolution.com.br/","contato@dronessolution.com.br","SATISFATÓRIA",9800,{"$f":"(H4/B4)","v":196},"A"]
["2022-09-01",50,"ERG","BELO HORIZONTE-MG","http://www.ergbh.com.br/","comercial@ergbh.com.br","SATISFATÓRIA",13240.5,{"$f":"(H5/B5)","v":264.81},"B"]
["2022-09-01",50,"CEPEMAR","VITÓRIA-ES","http://www.cepemar.com.br/","comercial@cepemar.com.br","SATISFATÓRIA",63000,{"$f":"(H6/B6)","v":1260},"C"]
[]
["Observações","  1. Na cotação acima já estão iclusos: Planejamento Aerotogramétrico, Voo Aerotoforamétrico, Apoio de Campo, Aerotriangulação, Restituição, MDT, MDS, Ortofotos, Edição/Revisão e Entrega Final.",{"$nulls":4},"CV com todos valores:",{"$f":"STDEVA(H4:H6)/AVERAGE(H4:H6)","v":1.0380549324194583}]
{"$rows_left_out":9}