{"text_format":"2","workbook":"xlsx","n_sheets":16,"sheets":["PFP","PFP1.1_Topo","PFP1.2_Geo","PFP1.3_Amb","PFP2.1_FatorKa","PFP2.2_FatorKb","PFP2.3_FatorKc","PFP3_FatorKd","CRO1_Ins-Pro","CRO2_Ins-Mes","CPU PICK-UP","MDO_DNIT","CPU HOSPEDAGEM","Cotação Voos","Serv Graficos","COT. VANT"],"not_rendered":{"charts":0,"images":22,"macros":0,"external_links":49,"defined_names":13503,"comments":1,"pivot_tables":0},"unopened":[],"bounds":{"document_bytes":16777216,"sheet_cells":100000,"run_cost":"one","rows_first":2000,"rows_last":500,"rows_between":2000,"halvings":0,"cell_chars":16384,"cell_head_chars":4096},"cells_cut":0,"cells_raw":0,"read":"whole","date_system":"1900"}

{"sheet":"PFP","index":0,"n_rows":44,"n_cols":17,"rows_kept":44,"cut":false,"hidden":false,"merged":[[28,8,28,11],[28,0,28,7],[27,8,27,11],[27,0,27,7],[35,0,35,11],[29,0,29,7],[29,8,29,11],[32,0,32,11],[31,0,31,11],[43,0,43,11],[36,0,36,11],[38,0,38,11],[30,0,30,11],[37,0,37,11],[33,0,33,11],[39,0,39,11],[40,0,40,11],[41,0,41,11],[42,0,42,11],[34,0,34,11],[0,0,1,9],[4,6,4,9],[0,10,0,11],[1,10,1,11],[4,10,4,11],[2,0,2,11],[3,0,3,11],[4,0,4,5],[5,10,5,11],[5,6,5,9],[26,0,26,7],[26,8,26,11],[5,0,5,5],[25,0,25,7],[25,8,25,11]]}
["PROPOSTA FINANCEIRA DO PROJETO",{"$nulls":9},"CODIGO:"]
[{"$nulls":10},"PFP"]
["NOME DA CONSULTORA:"]
[]
["PROJETO:",{"$nulls":5},"CONTRATANTE:",null,null,null,"BASE:"]
["Elaboração de Projeto Executivo da Adutora Agreste Potiguar, no Estado do Rio Grande do Norte ",{"$nulls":5},"CODEVASF (SEDE)",null,null,null,"2024-09-01"]
["Base","Cod2","Cod3","Código","Categoria / Insumo","Uni","Qde","CUD","PU","FatorK","CT","PT","Encargos COMP E ADICIONAIS","SOCIAIS","TOTAIS",null,"Encargos Comp e Adicionais"]
["SICRO","MO3","P0","P8061","Engenheiro coordenador (P8061)","mês",{"$f":"'CRO1_Ins-Pro'!D5","v":8},{"$f":"VLOOKUP(D8,MDO_DNIT!$A:$Z,4,0)","v":17866.689999999999},{"$f":"ROUND(J8*H8,2)","v":23133.79},{"$f":"'PFP2.3_FatorKc'!E35","v":1.2948},{"$f":"ROUND(G8*H8,2)","v":142933.51999999999},{"$f":"ROUND(G8*I8,2)","v":185070.32},{"$f":"O8-N8","v":1026.7399999999998},13812.22,14838.96,null,{"$f":"VLOOKUP(D8,MDO_DNIT!$A:$Z,26,0)","v":1029.0600000000013}]
{"$rows_left_out":37}
{"sheet":"PFP1.1_Topo","index":1,"n_rows":29,"n_cols":13,"rows_kept":29,"cut":false,"hidden":false,"merged":[[7,10,7,12],[26,10,27,12],[28,10,28,11],[27,0,27,8],[0,0,1,6],[2,0,2,8],[3,0,3,8],[4,0,4,4],[4,5,4,6],[5,0,5,4],[5,5,5,6],[22,0,22,6],[23,0,23,8],[24,0,24,8],[25,0,25,8],[26,0,26,8]]}
["SERVIÇOS TOPOGRÁFICOS/CARTOGRÁFICOS",{"$nulls":7},"CODIGO:"]
[{"$nulls":8},"PFP-1.1"]
["NOME DA EMPRESA:"]
[]
["PROJETO:",{"$nulls":4},"CONTRATANTE:",null,null,{"$f":"PFP!K5","v":"BASE:"}]
[{"$f":"PFP!A6","v":"Elaboração de Projeto Executivo da Adutora Agreste Potiguar, no Estado do Rio Grande do Norte "},{"$nulls":4},"CODEVASF (SEDE)",null,null,{"$f":"PFP!K6","v":"2024-09-01"}]
["Cod.","Base","Código","Insumos","Uni","Qde","Custo Unitário (CU)","Custo Total","Preço Total (PT)"]
["TP01","CODE","-","Nivelamento Geométrico dos Eixos classe IIN","km",50,843.75,{"$f":"ROUND(G8*F8,2)","v":42187.5},{"$f":"(H8*$M$29)+H8","v":48385.692644817085},null,"MEMÓRIA DE CALCULO DO BDI DE FORNECIMENTO"]
{"$rows_left_out":22}
{"sheet":"PFP1.2_Geo","index":2,"n_rows":45,"n_cols":14,"rows_kept":45,"cut":false,"hidden":false,"merged":[[5,0,5,4],[5,5,5,6],[7,3,7,8],[0,0,1,6],[2,0,2,8],[3,0,3,8],[4,0,4,4],[4,5,4,6],[6,11,6,13],[25,11,26,13],[27,11,27,12],[43,0,43,8],[44,0,44,8],[39,0,39,6],[40,0,40,8],[41,0,41,8],[42,0,42,8]]}
["SERVIÇOS GEOLÓGICOS/GEOTÉCNICOS",{"$nulls":7},"CODIGO:"]
[{"$nulls":8},"PFP-1.2"]
["NOME DA EMPRESA:"]
[]
["PROJETO: ",{"$nulls":4},"CONTRATANTE:",null,null,{"$f":"PFP!K5","v":"BASE:"}]
[{"$f":"PFP!A6","v":"Elaboração de Projeto Executivo da Adutora Agreste Potiguar, no Estado do Rio Grande do Norte "},{"$nulls":4},"CODEVASF (SEDE)",null,null,{"$f":"PFP!K6","v":"2024-09-01"}]
["Cod.","Código","Referência","Insumos","Uni","Qde","Custo Unitário (CU)","Custo Total","Preço Total (PT)",null,null,"MEMÓRIA DE CALCULO DO BDI DE FORNECIMENTO"]
["GT 1",null,null,"Sondagem mista",{"$nulls":7},"ITEM","DISCRIMINAÇÃO","PERC.    (%)"]
{"$rows_left_out":38}
{"sheet":"PFP1.3_Amb","index":3,"n_rows":35,"n_cols":14,"rows_kept":35,"cut":false,"hidden":false,"merged":[[6,11,6,13],[25,11,26,13],[27,11,27,12],[34,0,34,8],[0,0,1,6],[2,0,2,8],[3,0,3,8],[4,0,4,4],[4,5,4,6],[5,0,5,4],[5,5,5,6],[28,0,28,6],[29,0,29,8],[31,0,31,8],[32,0,32,8],[33,0,33,8],[30,0,30,8]]}
["SERVIÇOS ANÁLISE AMBIENTAL",{"$nulls":7},"CODIGO:"]
[{"$nulls":8},"PFP-1.3"]
["NOME DA EMPRESA:"]
[]
["PROJETO:",{"$nulls":4},"CONTRATANTE:",null,null,"BASE"]
[{"$f":"PFP!A6","v":"Elaboração de Projeto Executivo da Adutora Agreste Potiguar, no Estado do Rio Grande do Norte "},{"$nulls":4},"CODEVASF (SEDE)",null,null,{"$f":"PFP!K6","v":"2024-09-01"}]
["Cod.","CÓDIGO","Base","Insumos","Uni","Qde","Custo Unitário (CU)","Custo Total","Preço Total (PT)",null,null,"MEMÓRIA DE CALCULO DO BDI DE FORNECIMENTO"]
["AM01","33.01.02","EMBASA/COMPOSIÇÃO","Alcalinidade Total","un",10,30,{"$f":"ROUND(G8*F8,2)","v":300},{"$f":"(H8*$N$28)+H8","v":344.0760365853659},null,null,"ITEM","DISCRIMINAÇÃO","PERC.    (%)"]
{"$rows_left_out":28}
{"sheet":"PFP2.1_FatorKa","index":4,"n_rows":41,"n_cols":6,"rows_kept":41,"cut":false,"hidden":false,"merged":[[35,1,35,3],[6,1,6,3],[40,0,40,5],[39,0,39,5],[38,0,38,5],[37,0,37,5],[22,1,22,3],[29,1,29,3],[30,1,30,3],[28,1,28,3],[25,1,25,3],[26,1,26,3],[27,1,27,3],[33,1,33,3],[31,1,31,3],[32,1,32,3],[34,1,34,3],[0,0,1,4],[2,0,2,5],[5,0,5,1],[5,2,5,4],[4,2,4,4],[3,0,3,5],[24,1,24,3],[7,1,7,3],[17,1,17,3],[8,1,8,3],[13,1,13,3],[14,1,14,3],[15,1,15,3],[18,1,18,3],[19,1,19,3],[20,1,20,3],[21,1,21,3],[23,1,23,3],[9,1,9,3],[10,1,10,3],[11,1,11,3],[12,1,12,3]]}
["DETALHAMENTO DOS ENCARGOS SOCIAIS: Ka",{"$nulls":4},"CODIGO:"]
[{"$nulls":5},"PFP-2.1"]
["NOME DA CONSULTORA:"]
[]
["PROJETO:",null,"CONTRATANTE:",null,null,{"$f":"PFP!K5","v":"BASE:"}]
[{"$f":"PFP!A6","v":"Elaboração de Projeto Executivo da Adutora Agreste Potiguar, no Estado do Rio Grande do Norte "},null,"CODEVASF (SEDE)",null,null,"SINAPI/RN"]
["Cod","DESCRIÇÃO",null,null,"%","R$"]
["A","ENCARGOS SOCIAIS BÁSICOS",null,null,{"$f":"ROUND(SUM(E9:E17),4)","v":0.36799999999999999},{"$f":"ROUND(E8*SUMIF(PFP!$B$8:$B$24,\"MO1\",PFP!$K$8:$K$24),2)","v":529979.46}]
{"$rows_left_out":34}
{"sheet":"PFP2.2_FatorKb","index":5,"n_rows":40,"n_cols":6,"rows_kept":40,"cut":false,"hidden":false,"merged":[[27,1,27,3],[28,1,28,3],[29,1,29,3],[22,1,22,3],[23,1,23,3],[24,1,24,3],[25,1,25,3],[26,1,26,3],[6,1,6,3],[12,1,12,3],[13,1,13,3],[39,0,39,5],[36,0,36,5],[37,0,37,5],[38,0,38,5],[31,1,31,3],[32,1,32,3],[33,1,33,3],[34,1,34,3],[18,1,18,3],[30,1,30,3],[19,1,19,3],[20,1,20,3],[21,1,21,3],[0,0,1,4],[2,0,2,5],[3,0,3,5],[4,2,4,4],[5,0,5,1],[5,2,5,4],[7,1,7,3],[16,1,16,3],[17,1,17,3],[8,1,8,3],[9,1,9,3],[10,1,10,3],[14,1,14,3],[15,1,15,3],[11,1,11,3]]}
["DETALHAMENTO DOS ENCARGOS SOCIAIS: Kb",{"$nulls":4},"CODIGO:"]
[{"$nulls":5},"PFP-2.2"]
["NOME DA CONSULTORA:"]
[]
["PROJETO:",null,"CONTRATANTE:",null,null,{"$f":"'PFP2.1_FatorKa'!F5","v":"BASE:"}]
[{"$f":"PFP!A6","v":"Elaboração de Projeto Executivo da Adutora Agreste Potiguar, no Estado do Rio Grande do Norte "},null,"CODEVASF (SEDE)",null,null,{"$f":"'PFP2.1_FatorKa'!F6","v":"SINAPI/RN"}]
["Cod","DESCRIÇÃO",null,null,"%","R$"]
["A","ENCARGOS SOCIAIS BÁSICOS",null,null,{"$f":"ROUND(SUM(E9:E16),4)","v":0.2},{"$f":"ROUND(E8*SUMIF(PFP!$B$8:$B$24,\"MO2\",PFP!$K$8:$K$24),2)","v":121403.41}]
{"$rows_left_out":33}
{"sheet":"PFP2.3_FatorKc","index":6,"n_rows":40,"n_cols":6,"rows_kept":40,"cut":false,"hidden":false,"merged":[[0,0,1,4],[2,0,2,5],[3,0,3,5],[4,2,4,4],[5,0,5,1],[5,2,5,4],[16,1,16,3],[6,1,6,3],[7,1,7,3],[8,1,8,3],[9,1,9,3],[10,1,10,3],[11,1,11,3],[12,1,12,3],[13,1,13,3],[14,1,14,3],[15,1,15,3],[28,1,28,3],[17,1,17,3],[18,1,18,3],[19,1,19,3],[20,1,20,3],[21,1,21,3],[22,1,22,3],[23,1,23,3],[24,1,24,3],[25,1,25,3],[26,1,26,3],[27,1,27,3],[36,0,36,5],[37,0,37,5],[38,0,38,5],[39,0,39,5],[29,1,29,3],[30,1,30,3],[31,1,31,3],[32,1,32,3],[33,1,33,3],[34,1,34,3]]}
["DETALHAMENTO DOS ENCARGOS SOCIAIS: Kc",{"$nulls":4},"CODIGO:"]
[{"$nulls":5},"PFP-2.3"]
["NOME DA CONSULTORA:"]
[]
["PROJETO:",null,"CONTRATANTE:",null,null,{"$f":"'PFP2.2_FatorKb'!F5","v":"BASE:"}]
[{"$f":"PFP!A6","v":"Elaboração de Projeto Executivo da Adutora Agreste Potiguar, no Estado do Rio Grande do Norte "},null,"CODEVASF (SEDE)",null,null,{"$f":"'PFP2.2_FatorKb'!F6","v":"SINAPI/RN"}]
["Cod","DESCRIÇÃO",null,null,"%","R$"]
["A","ENCARGOS SOCIAIS BÁSICOS",null,null,{"$f":"SUM(E9:E16)","v":0},{"$f":"ROUND(E8*SUMIF(PFP!$B$8:$B$24,\"MO3\",PFP!$K$8:$K$24),2)","v":0}]
{"$rows_left_out":33}
{"sheet":"PFP3_FatorKd","index":7,"n_rows":35,"n_cols":6,"rows_kept":35,"cut":false,"hidden":false,"merged":[[32,0,32,5],[12,1,12,3],[11,1,11,3],[8,1,8,2],[9,1,9,2],[10,1,10,2],[7,1,7,2],[25,0,25,5],[6,1,6,2],[0,0,1,4],[2,0,2,5],[5,0,5,1],[5,2,5,4],[4,2,4,4],[3,0,3,5],[33,0,33,5],[34,0,34,5],[16,1,16,3],[13,1,13,3],[14,1,14,3],[15,1,15,3],[21,0,21,5],[26,0,26,5],[27,0,27,5],[22,0,22,5],[23,0,23,5],[24,0,24,5],[28,0,28,5],[29,0,29,5],[30,0,30,5],[31,0,31,5]]}
["DESPESAS FISCAIS E CUSTOS DIVERSOS: Kc",{"$nulls":4},"CODIGO:"]
[{"$nulls":5},"PFP-3"]
["NOME DA CONSULTORA:"]
[]
["PROJETO:",null,"CONTRATANTE:",null,null,{"$f":"'PFP2.3_FatorKc'!F5","v":"BASE:"}]
[{"$f":"PFP!A6","v":"Elaboração de Projeto Executivo da Adutora Agreste Potiguar, no Estado do Rio Grande do Norte "},null,"CODEVASF (SEDE)",null,null,{"$f":"'PFP2.3_FatorKc'!F6","v":"SINAPI/RN"}]
["Cod","DESCRIÇÃO1",null,"% preço2","% custo4","R$"]
["K4","TRIBUTOS",null,{"$f":"ROUND(D9+D10+D11,4)","v":0.124},{"$f":"ROUND(E9+E10+E11,4)","v":0.1416},{"$f":"E8*SUM(SUMIF(PFP!$B$8:$B$24,\"MO1\",PFP!$K$8:$K$24)*(1+'PFP2.1_FatorKa'!$E$35)+SUMIF(PFP!$B$8:$B$24,\"MO2\",PFP!$K$8:$K$24)*(1+'PFP2.2_FatorKb'!$E$34)+SUMIF(PFP!$B$8:$B$24,\"<>MO*\",PFP!$K$8:$K$24)+$F$13+$F$12)","v":559524.05819817458}]
{"$rows_left_out":28}
{"sheet":"CRO1_Ins-Pro","index":8,"n_rows":90,"n_cols":17,"rows_kept":90,"cut":false,"hidden":false,"merged":[[2,5,3,5],[0,0,1,15],[2,0,3,0],[2,1,3,1],[2,2,3,2],[2,3,3,3],[2,4,3,4],[88,0,88,8],[87,0,87,11],[39,8,39,11],[22,0,23,0],[22,1,23,1]]}
["INSUMOS POR ETAPA/PRODUTO",{"$nulls":15},"CÓDIGO:"]
[{"$nulls":16},"CRO-1"]
["Cod.","Categoria / Insumo","Uni","Qde","CUD","PU","FatorK","E1.AC","E2. EB","E3. PE T1","E3 PE T2","E3. PE T3","E3. PE T4","E3. PE T5","E3. PE T6","E3. PE T7","E3. PE T8"]
[{"$nulls":6},"Meses",{"$f":"'CRO2_Ins-Mes'!E5","v":1},{"$f":"'CRO2_Ins-Mes'!E8","v":2},{"$f":"'CRO2_Ins-Mes'!$E15/8","v":0.875},{"$f":"'CRO2_Ins-Mes'!$E15/8","v":0.875},{"$f":"'CRO2_Ins-Mes'!$E15/8","v":0.875},{"$f":"'CRO2_Ins-Mes'!$E15/8","v":0.875},{"$f":"'CRO2_Ins-Mes'!$E15/8","v":0.875},{"$f":"'CRO2_Ins-Mes'!$E15/8","v":0.875},{"$f":"'CRO2_Ins-Mes'!$E15/8","v":0.875},{"$f":"'CRO2_Ins-Mes'!$E15/8","v":0.875}]
[{"$f":"PFP!C8","v":"P0"},{"$f":"PFP!E8","v":"Engenheiro coordenador (P8061)"},"mês",{"$f":"SUM(H5:Q5)","v":8},{"$f":"PFP!H8","v":17866.689999999999},{"$f":"PFP!I8","v":23133.79},{"$f":"PFP!J8","v":1.2948},{"$f":"'CRO2_Ins-Mes'!E18","v":1},{"$f":"'CRO2_Ins-Mes'!E30","v":0},{"$f":"'CRO2_Ins-Mes'!$E44/8","v":0.875},{"$f":"'CRO2_Ins-Mes'!$E44/8","v":0.875},{"$f":"'CRO2_Ins-Mes'!$E44/8","v":0.875},{"$f":"'CRO2_Ins-Mes'!$E44/8","v":0.875},{"$f":"'CRO2_Ins-Mes'!$E44/8","v":0.875},{"$f":"'CRO2_Ins-Mes'!$E44/8","v":0.875},{"$f":"'CRO2_Ins-Mes'!$E44/8","v":0.875},{"$f":"'CRO2_Ins-Mes'!$E44/8","v":0.875}]
[{"$f":"PFP!C9","v":"P1"},{"$f":"PFP!E9","v":"Engenheiro sênior (P8067)"},"mês",{"$f":"SUM(H6:Q6)","v":39},{"$f":"PFP!H9","v":15564.54},{"$f":"PFP!I9","v":23919.59},{"$f":"PFP!J9","v":1.5367999999999999},{"$f":"'CRO2_Ins-Mes'!E19","v":4},{"$f":"'CRO2_Ins-Mes'!E31","v":0},{"$f":"'CRO2_Ins-Mes'!$E45/8","v":4.375},{"$f":"'CRO2_Ins-Mes'!$E45/8","v":4.375},{"$f":"'CRO2_Ins-Mes'!$E45/8","v":4.375},{"$f":"'CRO2_Ins-Mes'!$E45/8","v":4.375},{"$f":"'CRO2_Ins-Mes'!$E45/8","v":4.375},{"$f":"'CRO2_Ins-Mes'!$E45/8","v":4.375},{"$f":"'CRO2_Ins-Mes'!$E45/8","v":4.375},{"$f":"'CRO2_Ins-Mes'!$E45/8","v":4.375}]
[{"$f":"PFP!C10","v":"P2"},{"$f":"PFP!E10","v":"Engenheiro pleno (P8066)"},"mês",53,{"$f":"PFP!H10","v":12379.96},{"$f":"PFP!I10","v":26738.240000000002},{"$f":"PFP!J10","v":2.1598000000000002},{"$f":"'CRO2_Ins-Mes'!E20","v":4},{"$f":"'CRO2_Ins-Mes'!E32","v":0},{"$f":"'CRO2_Ins-Mes'!$E46/8","v":6.125},{"$f":"'CRO2_Ins-Mes'!$E46/8","v":6.125},{"$f":"'CRO2_Ins-Mes'!$E46/8","v":6.125},{"$f":"'CRO2_Ins-Mes'!$E46/8","v":6.125},{"$f":"'CRO2_Ins-Mes'!$E46/8","v":6.125},{"$f":"'CRO2_Ins-Mes'!$E46/8","v":6.125},{"$f":"'CRO2_Ins-Mes'!$E46/8","v":6.125},{"$f":"'CRO2_Ins-Mes'!$E46/8","v":6.125}]
[{"$f":"PFP!C11","v":"P3"},{"$f":"PFP!E11","v":"Engenheiro júnior (P8065)"},"mês",39,{"$f":"PFP!H11","v":12002},{"$f":"PFP!I11","v":25921.919999999998},{"$f":"PFP!J11","v":2.1598000000000002},{"$f":"'CRO2_Ins-Mes'!E21","v":4},{"$f":"'CRO2_Ins-Mes'!E33","v":0},{"$f":"'CRO2_Ins-Mes'!$E47/8","v":4.375},{"$f":"'CRO2_Ins-Mes'!$E47/8","v":4.375},{"$f":"'CRO2_Ins-Mes'!$E47/8","v":4.375},{"$f":"'CRO2_Ins-Mes'!$E47/8","v":4.375},{"$f":"'CRO2_Ins-Mes'!$E47/8","v":4.375},{"$f":"'CRO2_Ins-Mes'!$E47/8","v":4.375},{"$f":"'CRO2_Ins-Mes'!$E47/8","v":4.375},{"$f":"'CRO2_Ins-Mes'!$E47/8","v":4.375}]
{"$rows_left_out":22}
{"sheet":"CRO2_Ins-Mes","index":9,"n_rows":56,"n_cols":15,"rows_kept":56,"cut":false,"hidden":false,"merged":[[78,5,78,11],[0,0,1,14]]}
["CRONOGRAMA SIMPLIFICADO"]
[]
["Cod1","Cod2","Produtos","Uni","Qde",1,2,3,4,5,6,7,8,9,10]
[1,"1.1","Análise Crítica do Projeto Básico (AC)","mês",{"$f":"SUM(F4:L4)","v":1},1]
[1,1,"Análise Crítica do Projeto Básico (AC)","mês",1,{"$f":"SUBTOTAL(4,F4:F4)","v":1},0,0,0,0,0,0]
[2,"2.1","Serviços Topográficos/Cartográficos","mês",2,null,1,1]
[2,"2.2","Serviços Geológicos/Geotécnicos","mês",2,null,1,1]
[2,2,"Estudos Básicos (EB)","mês",2,{"$f":"SUBTOTAL(4,F6:F7)","v":0},1,1,0,0,0,0]
{"$rows_left_out":49}
{"sheet":"CPU PICK-UP","index":10,"n_rows":61,"n_cols":33,"rows_kept":61,"cut":false,"hidden":false,"merged":[[52,19,52,26],[4,0,4,2],[6,0,6,2],[7,0,7,1],[7,4,7,7],[8,0,8,2],[52,8,52,18]]}
[]
[]
[]
[]
["Composição de Preços de Locação de Veículo tipo pick-up"]
[null,"Data de atualização:","2024-01-22",null,"CV","Média","Mediana",null,null,null,"CV","Média","Mediana",{"$nulls":8},"CV","Média","Mediana"]
["CODEVASF ",null,null,null,{"$f":"_xlfn.STDEV.S(E10:H10)/AVERAGE(E10:H10)","v":9.2667922664402616E-2},{"$f":"AVERAGE(E10:H10)","v":179935.5},{"$f":"MEDIAN(E10:H10)","v":184702},null,null,null,{"$f":"_xlfn.STDEV.S(L9:S9)/AVERAGE(L9:S9)","v":0.20952494145854728},{"$f":"AVERAGE(L9:S9)","v":31.095714285714287},{"$f":"MEDIAN(L9:S9)","v":30.16},{"$nulls":8},{"$f":"_xlfn.STDEV.S(W9:AD9)/AVERAGE(W9:AD9)","v":0.13240988535259646},{"$f":"AVERAGE(W9:AD9)","v":430.60093749999999},{"$f":"MEDIAN(W9:AD9)","v":437.31624999999997}]
["OBS:               Preço sem BDI e sem motorista                                                                   BDI=",null,null,null,"Preço FIPE ",{"$nulls":4},"PRODUTO ","MENOR (MÉDIA, MEDIANA)","COT. 1","COT. 2","COT. 3","COT. 4","COT. 5","COT. 6","COT. 7","COT. 8",null,"PRODUTO","MENOR (MÉDIA, MEDIANA)","COT. 1","COT. 2","COT. 3","COT. 4","COT. 5","COT. 6","COT. 7","COT. 8"]
{"$rows_left_out":54}
{"sheet":"MDO_DNIT","index":11,"n_rows":113,"n_cols":26,"rows_kept":113,"cut":false,"hidden":false,"merged":[[0,25,1,25],[1,6,1,7],[1,8,1,9],[1,10,1,11],[1,12,1,13],[1,14,1,15],[1,16,1,17],[0,6,0,15],[1,18,1,19],[1,20,1,21],[0,16,0,21],[0,22,1,23],[0,24,1,24],[0,0,2,0],[0,1,2,1],[0,2,2,2],[0,3,1,3],[0,4,1,5]]}
["Código","Categoria","Unid.","Salário","Encargos Sociais",null,"Encargos Complementares",{"$nulls":9},"Encargos Adicionais",{"$nulls":5},"Encargos Totais",null,"Valor Total","Encargos Adicionais e Complementares"]
[{"$nulls":6},"Alimentação",null,"EPI",null,"Ferramenta",null,"Transporte",null,"Exame Ocupacional",null,"Cesta Básica",null,"Assistência Médica",null,"Seguro de Vida"]
[null,null,null,"R$","%","R$","%","R$","%","R$","%","R$","%","R$","%","R$","%","R$","%","R$","%","R$","%","R$","R$","R$"]
["Profissionais mensalistas"]
["P8001","Advogado júnior","mês",4530.07,0.79290000000000005,3591.89,0.1552,702.89,5.4999999999999997E-3,24.99,0,0,0,0,5.9999999999999995E-4,2.83,0,0,6.3899999999999998E-2,289.39,2.2000000000000001E-3,9.98,1.0203,4621.9799999999996,9152.0499999999993,{"$f":"Y5-F5-D5","v":1030.0900000000001}]
["P8002","Advogado pleno","mês",6040.1,0.79290000000000005,4789.1899999999996,0.1164,702.89,4.1000000000000003E-3,24.99,0,0,0,0,5.0000000000000001E-4,2.83,0,0,4.7899999999999998E-2,289.39,1.6999999999999999E-3,9.98,0.96340000000000003,5819.27,11859.37,{"$f":"Y6-F6-D6","v":1030.0800000000008}]
["P8003","Advogado sênior","mês",11150.15,0.79290000000000005,8840.9500000000007,6.3E-2,702.89,2.2000000000000001E-3,24.99,0,0,0,0,2.9999999999999997E-4,2.83,0,0,2.5999999999999999E-2,289.39,8.9999999999999998E-4,9.98,0.88529999999999998,9871.0300000000007,21021.18,1030.08]
["P8007","Analista de desenvolvimento de sistemas júnior","mês",4761.5,0.79600000000000004,3790.16,0.14760000000000001,702.89,0,0,0,0,0,0,8.0000000000000004E-4,3.69,0,0,6.08E-2,289.39,2.0999999999999999E-3,9.98,1.0073000000000001,4796.1099999999997,9557.61,1005.9500000000007]
{"$rows_left_out":106}
{"sheet":"CPU HOSPEDAGEM","index":12,"n_rows":19,"n_cols":4,"rows_kept":19,"cut":false,"hidden":false,"merged":[[2,1,2,2]]}
[]
[null,"Engenharia Consultiva da Codevasf"]
[null,"CPU - HOSPEDAGEM EQUIPE DE CAMPO (4 PESSOAS/MÊS)",null,"Código/Referencia"]
[null,"ALUGUEL ",3074.56,"F020003334/EMBASA"]
[null," Aquisição de Mobiliário",{"$f":"43.89*C16","v":175.56},"B8954/DNIT"]
[null,"Material de limpeza e diarista",{"$f":"126.93+(123*8)","v":1110.93},"10563/ORSE - E200300131/EMBASA"]
[null,"manutenção da casa alugada - Serviços Gerais/Vigia ",2487.0700000000002,"41096/SINAPI"]
[null,"Energia ",180,"10555/ORSE"]
{"$rows_left_out":12}
{"sheet":"Cotação Voos","index":13,"n_rows":106,"n_cols":6,"rows_kept":106,"cut":false,"hidden":false,"merged":[]}
["COTAÇÕES - IDA DIA 25/011/2024 E VOLTA DIA 29/011/2024"]
["Localidade:","Natal/RN"]
[]
["Origem","Destino"]
["BSB ",{"$f":"B2","v":"Natal/RN"},"Cia 1","Cia 2","Cia 3","Média"]
[null,null,1171,1446,1598,{"$f":"AVERAGE(C6:E6)","v":1405}]
{"$rows_empty":24}
["SP",{"$f":"B2","v":"Natal/RN"},"Cia 1","Cia 2","Cia 3","Média"]
{"$rows_left_out":10}
{"sheet":"Serv Graficos","index":14,"n_rows":42,"n_cols":9,"rows_kept":42,"cut":false,"hidden":false,"merged":[[35,0,35,4],[36,0,36,4],[37,0,37,4],[38,0,38,4],[39,0,39,4],[25,0,25,3],[2,0,2,4],[14,0,14,4],[18,0,18,3],[20,1,20,2],[21,0,21,4]]}
[]
[]
["Serviços Gráficos"]
[]
["Serviço",null,"Referencia","Código","Valor",null,null,"1 Vol Impressão Rel Final"]
["Impressão colorida",null,"SETOP/COMPOSIÇÃO","CO-2019",1.8,null,"Preto",{"$f":"C17*E7","v":91.35}]
["Impressão preta",null,"SETOP/COMPOSIÇÃO","CO-2017",0.28999999999999998,null,"Colorida",{"$f":"D17*E6","v":63}]
["Encadernação até 350 fls.",null,"EMBASA/COMPOSIÇÃO","30.02.30 / 30.02.27",{"$f":"20+7.2","v":27.2},"Foi considerado a soma de 2 composições, com encadernação de 250 e 100 folhas","Encader",{"$f":"E8","v":27.2}]
{"$rows_left_out":35}
{"sheet":"COT. VANT","index":15,"n_rows":17,"n_cols":10,"rows_kept":17,"cut":false,"hidden":true,"merged":[[1,0,1,9],[7,0,9,0],[7,1,7,5],[8,1,8,5],[9,1,9,5]]}
[]
["COTAÇÃO ORÇAMENTÁRIA DE LEVANTAMENTO PLANIALTIMÉTRICO POR MEIO DE VANT PARA ÁREA NA CIDADE DE PINDARÉ-MIRIM-MA"]
["MÊS/ANO DE REFERÊNCIA ","ÁREA DO PROJETO [ha]","EMPRESA","LOCALIDADE","WEBSITE","CONTATO","AVALIAÇÃO TÉCNICA DA PROPOSTA","PREÇO","PREÇO UNITÁRIO","RELAÇÃO CUSTO-BENEFÍCIO"]
["2022-09-01",50,"DRONES SOLUTION","SALVADOR-BA","http://www.dronessolution.com.br/","contato@dronessolution.com.br","SATISFATÓRIA",9800,{"$f":"(H4/B4)","v":196},"A"]
["2022-09-01",50,"ERG","BELO HORIZONTE-MG","http://www.ergbh.com.br/","comercial@ergbh.com.br","SATISFATÓRIA",13240.5,{"$f":"(H5/B5)","v":264.81},"B"]
["2022-09-01",50,"CEPEMAR","VITÓRIA-ES","http://www.cepemar.com.br/","comercial@cepemar.com.br","SATISFATÓRIA",63000,{"$f":"(H6/B6)","v":1260},"C"]
[]
["Observações","  1. Na cotação acima já estão iclusos: Planejamento Aerotogramétrico, Voo Aerotoforamétrico, Apoio de Campo, Aerotriangulação, Restituição, MDT, MDS, Ortofotos, Edição/Revisão e Entrega Final.",{"$nulls":4},"CV com todos valores:",{"$f":"STDEVA(H4:H6)/AVERAGE(H4:H6)","v":1.0380549324194583}]
{"$rows_left_out":9}