{"text_format":"2","workbook":"xlsx","n_sheets":13,"sheets":["PFP","PFP1.1_Topo","PFP2.1_FatorKa","PFP2.2_FatorKb","PFP2.3_FatorKc","PFP3_FatorKd","CRO1_Ins-Pro","CRO2_Ins-Mes","MDO_DNIT","CPU-VEICULO_PickUp","CPU HOSPEDAGEM","Cotação Voos","COT. VANT"],"not_rendered":{"charts":0,"images":21,"macros":0,"external_links":49,"defined_names":13260,"comments":2,"pivot_tables":0},"unopened":[],"bounds":{"document_bytes":16777216,"sheet_cells":100000,"run_cost":"one","rows_first":2000,"rows_last":500,"rows_between":2000,"halvings":0,"cell_chars":16384,"cell_head_chars":4096},"cells_cut":0,"cells_raw":0,"read":"whole","date_system":"1900"}

{"sheet":"PFP","index":0,"n_rows":42,"n_cols":17,"rows_kept":42,"cut":false,"hidden":false,"merged":[[26,8,26,11],[26,0,26,7],[25,8,25,11],[25,0,25,7],[33,0,33,11],[27,0,27,7],[27,8,27,11],[30,0,30,11],[29,0,29,11],[41,0,41,11],[34,0,34,11],[36,0,36,11],[28,0,28,11],[35,0,35,11],[31,0,31,11],[37,0,37,11],[38,0,38,11],[39,0,39,11],[40,0,40,11],[32,0,32,11],[0,0,1,9],[4,6,4,9],[0,10,0,11],[1,10,1,11],[4,10,4,11],[2,0,2,11],[3,0,3,11],[4,0,4,5],[5,10,5,11],[5,6,5,9],[24,0,24,7],[24,8,24,11],[5,0,5,5],[23,0,23,7],[23,8,23,11]]}
["PROPOSTA FINANCEIRA DO PROJETO",{"$nulls":9},"CODIGO:"]
[{"$nulls":10},"PFP"]
["NOME DA CONSULTORA:"]
[]
["PROJETO:",{"$nulls":5},"CONTRATANTE:",null,null,null,"BASE:"]
["Elaboração de Projeto Executivo do Canal Principal do PIS - Canal CP-500/2",{"$nulls":5},"CODEVASF (SEDE)",null,null,null,"2024-08-01"]
["Base","Cod2","Cod3","Código","Categoria / Insumo","Uni","Qde","CUD","PU","FatorK","CT","PT","Encargos COMP E ADICIONAIS","SOCIAIS","TOTAIS",null,"Encargos Comp e Adicionais"]
["SICRO","MO3","P0","P8061","Engenheiro coordenador (P8061)","mês",{"$f":"'CRO1_Ins-Pro'!D5","v":5},{"$f":"VLOOKUP(D8,MDO_DNIT!A5:Z115,4,0)","v":17866.689999999999},{"$f":"ROUND(J8*H8,2)","v":22990.86},{"$f":"'PFP2.3_FatorKc'!E35","v":1.2867999999999999},{"$f":"ROUND(G8*H8,2)","v":89333.45},{"$f":"ROUND(G8*I8,2)","v":114954.3},{"$f":"O8-N8","v":1026.8900000000012},13451.98,14478.87,null,{"$f":"VLOOKUP(D8,MDO_DNIT!A5:Z118,26,0)","v":1029.0600000000013}]
["SICRO","MO2","P1","P8067","Engenheiro sênior (P8067)","mês",{"$f":"'CRO1_Ins-Pro'!D6","v":21},{"$f":"VLOOKUP(D9,MDO_DNIT!A6:Z116,4,0)","v":15564.54},23771.72,{"$f":"'PFP2.2_FatorKb'!$E$35","v":1.5273000000000001},326855.34000000003,499206.12,1030.1900000000005,11533.74,12563.93,null,{"$f":"VLOOKUP(D9,MDO_DNIT!A6:Z119,26,0)","v":1031.2299999999996}]
["SICRO","MO1","P2","P8066","Engenheiro pleno (P8066)","mês",{"$f":"'CRO1_Ins-Pro'!D7","v":21},{"$f":"VLOOKUP(D10,MDO_DNIT!A7:Z117,4,0)","v":12379.96},{"$f":"ROUND(J10*H10,2)","v":26600.82},{"$f":"'PFP2.1_FatorKa'!$E$36","v":2.1486999999999998},{"$f":"ROUND(G10*H10,2)","v":259979.16},558617.22,1030.1899999999987,8980.3700000000008,10010.56,null,{"$f":"VLOOKUP(D10,MDO_DNIT!A7:Z120,26,0)","v":1031.2300000000014}]
{"$rows_left_out":33}
{"sheet":"PFP1.1_Topo","index":1,"n_rows":28,"n_cols":12,"rows_kept":28,"cut":false,"hidden":false,"merged":[[23,9,23,10],[24,9,24,10],[25,9,26,11],[27,9,27,10],[10,10,10,11],[15,9,15,10],[16,10,16,11],[18,9,18,10],[19,10,19,11],[5,9,6,11],[7,9,8,9],[7,10,8,10],[7,11,8,11],[9,9,9,11],[27,0,27,7],[0,0,1,5],[2,0,2,7],[3,0,3,7],[4,0,4,3],[4,4,4,5],[5,0,5,3],[5,4,5,5],[22,0,22,5],[23,0,23,7],[24,0,24,7],[25,0,25,7],[26,0,26,7]]}
["SERVIÇOS TOPOGRÁFICOS/CARTOGRÁFICOS",{"$nulls":6},"CODIGO:"]
[{"$nulls":7},"PFP-1.1"]
["NOME DA EMPRESA:"]
[]
["PROJETO:",null,null,null,"CONTRATANTE:",null,null,{"$f":"PFP!K5","v":"BASE:"}]
[{"$f":"PFP!A6","v":"Elaboração de Projeto Executivo do Canal Principal do PIS - Canal CP-500/2"},null,null,null,"CODEVASF (SEDE)",null,null,{"$f":"PFP!K6","v":"2024-08-01"},null,"MEMÓRIA DE CALCULO DO BDI DE FORNECIMENTO"]
["Cod.","Base","Insumos","Uni","Qde","Custo Unitário ","Custo Total","Preço Total (PT)"]
["TP01","CODE","Nivelamento Geométrico dos Eixos classe IIN","km",10,850.01,{"$f":"ROUND(F8*E8,2)","v":8500.1},{"$f":"(G8*$L$28)+G8","v":9748.9357285975639},null,"ITEM","DISCRIMINAÇÃO","PERC.    (%)"]
["EMBASA/COMPOSIÇÃO","31.90.19","Seções Tranversais","km",40,{"$f":"0.7*1000","v":700},{"$f":"ROUND(F9*E9,2)","v":28000},{"$f":"(G9*$L$28)+G9","v":32113.763414634152}]
["EMOP/COMPOSIÇÃO","01.016.0035-0","Poligonal Classe IIP","km",10,1366.27,13662.7,15670.025550182931]
{"$rows_left_out":19}
{"sheet":"PFP2.1_FatorKa","index":2,"n_rows":41,"n_cols":6,"rows_kept":41,"cut":false,"hidden":false,"merged":[[35,1,35,3],[6,1,6,3],[40,0,40,5],[39,0,39,5],[38,0,38,5],[37,0,37,5],[22,1,22,3],[29,1,29,3],[30,1,30,3],[28,1,28,3],[25,1,25,3],[26,1,26,3],[27,1,27,3],[33,1,33,3],[31,1,31,3],[32,1,32,3],[34,1,34,3],[0,0,1,4],[2,0,2,5],[5,0,5,1],[5,2,5,4],[4,2,4,4],[3,0,3,5],[24,1,24,3],[7,1,7,3],[17,1,17,3],[8,1,8,3],[13,1,13,3],[14,1,14,3],[15,1,15,3],[18,1,18,3],[19,1,19,3],[20,1,20,3],[21,1,21,3],[23,1,23,3],[9,1,9,3],[10,1,10,3],[11,1,11,3],[12,1,12,3]]}
["DETALHAMENTO DOS ENCARGOS SOCIAIS: Ka",{"$nulls":4},"CODIGO:"]
[{"$nulls":5},"PFP-2.1"]
["NOME DA CONSULTORA:"]
[]
["PROJETO:",null,"CONTRATANTE:",null,null,{"$f":"PFP!K5","v":"BASE:"}]
[{"$f":"PFP!A6","v":"Elaboração de Projeto Executivo do Canal Principal do PIS - Canal CP-500/2"},null,"CODEVASF (SEDE)",null,null,"SINAPI/BA"]
["Cod","DESCRIÇÃO",null,null,"%","R$"]
["A","ENCARGOS SOCIAIS BÁSICOS",null,null,{"$f":"ROUND(SUM(E9:E17),4)","v":0.36799999999999999},{"$f":"ROUND(E8*SUMIF(PFP!$B$8:$B$23,\"MO1\",PFP!$K$8:$K$23),2)","v":193962.1}]
["A1","INSS",null,null,0.2,{"$f":"ROUND(E9*SUMIF(PFP!$B$8:$B$23,\"MO1\",PFP!$K$8:$K$23),2)","v":105414.18}]
["A2","SESI",null,null,1.4999999999999999E-2,{"$f":"ROUND(E10*SUMIF(PFP!$B$8:$B$23,\"MO1\",PFP!$K$8:$K$23),2)","v":7906.06}]
{"$rows_left_out":32}
{"sheet":"PFP2.2_FatorKb","index":3,"n_rows":40,"n_cols":6,"rows_kept":40,"cut":false,"hidden":false,"merged":[[27,1,27,3],[28,1,28,3],[29,1,29,3],[22,1,22,3],[23,1,23,3],[24,1,24,3],[25,1,25,3],[26,1,26,3],[6,1,6,3],[12,1,12,3],[13,1,13,3],[39,0,39,5],[36,0,36,5],[37,0,37,5],[38,0,38,5],[31,1,31,3],[32,1,32,3],[33,1,33,3],[34,1,34,3],[18,1,18,3],[30,1,30,3],[19,1,19,3],[20,1,20,3],[21,1,21,3],[0,0,1,4],[2,0,2,5],[3,0,3,5],[4,2,4,4],[5,0,5,1],[5,2,5,4],[7,1,7,3],[16,1,16,3],[17,1,17,3],[8,1,8,3],[9,1,9,3],[10,1,10,3],[14,1,14,3],[15,1,15,3],[11,1,11,3]]}
["DETALHAMENTO DOS ENCARGOS SOCIAIS: Kb",{"$nulls":4},"CODIGO:"]
[{"$nulls":5},"PFP-2.2"]
["NOME DA CONSULTORA:"]
[]
["PROJETO:",null,"CONTRATANTE:",null,null,{"$f":"'PFP2.1_FatorKa'!F5","v":"BASE:"}]
[{"$f":"PFP!A6","v":"Elaboração de Projeto Executivo do Canal Principal do PIS - Canal CP-500/2"},null,"CODEVASF (SEDE)",null,null,{"$f":"'PFP2.1_FatorKa'!F6","v":"SINAPI/BA"}]
["Cod","DESCRIÇÃO",null,null,"%","R$"]
["A","ENCARGOS SOCIAIS BÁSICOS",null,null,{"$f":"ROUND(SUM(E9:E16),4)","v":0.2},{"$f":"ROUND(E8*SUMIF(PFP!$B$8:$B$23,\"MO2\",PFP!$K$8:$K$23),2)","v":65371.07}]
["A1","INSS",null,null,0.2,{"$f":"ROUND(E9*SUMIF(PFP!$B$8:$B$23,\"MO2\",PFP!$K$8:$K$23),2)","v":65371.07}]
["A2","SESI",null,null,0,{"$f":"ROUND(E10*SUMIF(PFP!$B$8:$B$23,\"MO2\",PFP!$K$8:$K$23),2)","v":0}]
{"$rows_left_out":31}
{"sheet":"PFP2.3_FatorKc","index":4,"n_rows":40,"n_cols":6,"rows_kept":40,"cut":false,"hidden":false,"merged":[[0,0,1,4],[2,0,2,5],[3,0,3,5],[4,2,4,4],[5,0,5,1],[5,2,5,4],[16,1,16,3],[6,1,6,3],[7,1,7,3],[8,1,8,3],[9,1,9,3],[10,1,10,3],[11,1,11,3],[12,1,12,3],[13,1,13,3],[14,1,14,3],[15,1,15,3],[28,1,28,3],[17,1,17,3],[18,1,18,3],[19,1,19,3],[20,1,20,3],[21,1,21,3],[22,1,22,3],[23,1,23,3],[24,1,24,3],[25,1,25,3],[26,1,26,3],[27,1,27,3],[36,0,36,5],[37,0,37,5],[38,0,38,5],[39,0,39,5],[29,1,29,3],[30,1,30,3],[31,1,31,3],[32,1,32,3],[33,1,33,3],[34,1,34,3]]}
["DETALHAMENTO DOS ENCARGOS SOCIAIS: Kc",{"$nulls":4},"CODIGO:"]
[{"$nulls":5},"PFP-2.3"]
["NOME DA CONSULTORA:"]
[]
["PROJETO:",null,"CONTRATANTE:",null,null,{"$f":"'PFP2.2_FatorKb'!F5","v":"BASE:"}]
[{"$f":"PFP!A6","v":"Elaboração de Projeto Executivo do Canal Principal do PIS - Canal CP-500/2"},null,"CODEVASF (SEDE)",null,null,{"$f":"'PFP2.2_FatorKb'!F6","v":"SINAPI/BA"}]
["Cod","DESCRIÇÃO",null,null,"%","R$"]
["A","ENCARGOS SOCIAIS BÁSICOS",null,null,{"$f":"SUM(E9:E16)","v":0},{"$f":"ROUND(E8*SUMIF(PFP!$B$8:$B$23,\"MO3\",PFP!$K$8:$K$23),2)","v":0}]
["A1","INSS",null,null,0,{"$f":"ROUND(E9*SUMIF(PFP!$B$8:$B$23,\"MO3\",PFP!$K$8:$K$23),2)","v":0}]
["A2","SESI",null,null,0,{"$f":"ROUND(E10*SUMIF(PFP!$B$8:$B$23,\"MO3\",PFP!$K$8:$K$23),2)","v":0}]
{"$rows_left_out":31}
{"sheet":"PFP3_FatorKd","index":5,"n_rows":35,"n_cols":6,"rows_kept":35,"cut":false,"hidden":false,"merged":[[32,0,32,5],[12,1,12,3],[11,1,11,3],[8,1,8,2],[9,1,9,2],[10,1,10,2],[7,1,7,2],[25,0,25,5],[6,1,6,2],[0,0,1,4],[2,0,2,5],[5,0,5,1],[5,2,5,4],[4,2,4,4],[3,0,3,5],[33,0,33,5],[34,0,34,5],[16,1,16,3],[13,1,13,3],[14,1,14,3],[15,1,15,3],[21,0,21,5],[26,0,26,5],[27,0,27,5],[22,0,22,5],[23,0,23,5],[24,0,24,5],[28,0,28,5],[29,0,29,5],[30,0,30,5],[31,0,31,5]]}
["DESPESAS FISCAIS E CUSTOS DIVERSOS: Kc",{"$nulls":4},"CODIGO:"]
[{"$nulls":5},"PFP-3"]
["NOME DA CONSULTORA:"]
[]
["PROJETO:",null,"CONTRATANTE:",null,null,{"$f":"'PFP2.3_FatorKc'!F5","v":"BASE:"}]
[{"$f":"PFP!A6","v":"Elaboração de Projeto Executivo do Canal Principal do PIS - Canal CP-500/2"},null,"CODEVASF (SEDE)",null,null,{"$f":"'PFP2.3_FatorKc'!F6","v":"SINAPI/BA"}]
["Cod","DESCRIÇÃO1",null,"% preço2","% custo4","R$"]
["K4","TRIBUTOS",null,{"$f":"ROUND(D9+D10+D11,4)","v":0.104},{"$f":"ROUND(E9+E10+E11,4)","v":0.11609999999999999},{"$f":"E8*SUM(SUMIF(PFP!$B$8:$B$23,\"MO1\",PFP!$K$8:$K$23)*(1+'PFP2.1_FatorKa'!$E$35)+SUMIF(PFP!$B$8:$B$23,\"MO2\",PFP!$K$8:$K$23)*(1+'PFP2.2_FatorKb'!$E$34)+SUMIF(PFP!$B$8:$B$23,\"<>MO*\",PFP!$K$8:$K$23)+$F$13+$F$12)","v":189802.92320309707}]
["K4.1","ISS",null,0.03,{"$f":"ROUND((1/(1-$D$8))*D9,4)","v":3.3500000000000002E-2},{"$f":"E9*SUM(SUMIF(PFP!$B$8:$B$23,\"MO1\",PFP!$K$8:$K$23)*(1+'PFP2.1_FatorKa'!$E$35)+SUMIF(PFP!$B$8:$B$23,\"MO2\",PFP!$K$8:$K$23)*(1+'PFP2.2_FatorKb'!$E$34)+SUMIF(PFP!$B$8:$B$23,\"<>MO*\",PFP!$K$8:$K$23)+$F$13+$F$12)","v":54766.562681341537}]
["K4.2","PIS3 - aliquota efetiva aplicavel percentual-desconto",null,{"$f":"ROUND(1.65%*0.8,4)","v":1.32E-2},{"$f":"ROUND((1/(1-$D$8))*D10,4)","v":1.47E-2},{"$f":"E10*SUM(SUMIF(PFP!$B$8:$B$23,\"MO1\",PFP!$K$8:$K$23)*(1+'PFP2.1_FatorKa'!$E$35)+SUMIF(PFP!$B$8:$B$23,\"MO2\",PFP!$K$8:$K$23)*(1+'PFP2.2_FatorKb'!$E$34)+SUMIF(PFP!$B$8:$B$23,\"<>MO*\",PFP!$K$8:$K$23)+$F$13+$F$12)","v":24031.894669125988}]
{"$rows_left_out":26}
{"sheet":"CRO1_Ins-Pro","index":6,"n_rows":88,"n_cols":10,"rows_kept":88,"cut":false,"hidden":false,"merged":[[86,0,86,8],[85,0,85,9],[0,0,1,8],[37,8,37,9],[20,0,21,0],[20,1,21,1],[2,0,3,0],[2,1,3,1],[2,2,3,2],[2,3,3,3],[2,4,3,4],[2,5,3,5]]}
["INSUMOS POR ETAPA/PRODUTO"]
[]
["Cod.","Categoria / Insumo","Uni","Qde","CUD","PU","FatorK","E1.AC","E2. EB","E3. PE"]
[{"$nulls":6},"Meses",null,{"$f":"'CRO2_Ins-Mes'!E7","v":1},{"$f":"'CRO2_Ins-Mes'!E41","v":4}]
[{"$f":"PFP!C8","v":"P0"},{"$f":"PFP!E8","v":"Engenheiro coordenador (P8061)"},"mês",{"$f":"SUM(H5:J5)","v":5},{"$f":"PFP!H8","v":17866.689999999999},{"$f":"PFP!I8","v":22990.86},{"$f":"PFP!J8","v":1.2867999999999999},{"$f":"'CRO2_Ins-Mes'!E17","v":1},{"$f":"'CRO2_Ins-Mes'!E29","v":0},{"$f":"'CRO2_Ins-Mes'!E41","v":4}]
[{"$f":"PFP!C9","v":"P1"},{"$f":"PFP!E9","v":"Engenheiro sênior (P8067)"},"mês",21,{"$f":"PFP!H9","v":15564.54},{"$f":"PFP!I9","v":23771.72},{"$f":"PFP!J9","v":1.5273000000000001},{"$f":"'CRO2_Ins-Mes'!E18","v":1},{"$f":"'CRO2_Ins-Mes'!E30","v":0},{"$f":"'CRO2_Ins-Mes'!E42","v":20}]
[{"$f":"PFP!C10","v":"P2"},{"$f":"PFP!E10","v":"Engenheiro pleno (P8066)"},"mês",21,{"$f":"PFP!H10","v":12379.96},{"$f":"PFP!I10","v":26600.82},{"$f":"PFP!J10","v":2.1486999999999998},{"$f":"'CRO2_Ins-Mes'!E19","v":1},{"$f":"'CRO2_Ins-Mes'!E31","v":0},{"$f":"'CRO2_Ins-Mes'!E43","v":20}]
[{"$f":"PFP!C11","v":"P3"},{"$f":"PFP!E11","v":"Engenheiro júnior (P8065)"},"mês",17,{"$f":"PFP!H11","v":12002},{"$f":"PFP!I11","v":25788.7},{"$f":"PFP!J11","v":2.1486999999999998},{"$f":"'CRO2_Ins-Mes'!E20","v":1},{"$f":"'CRO2_Ins-Mes'!E32","v":0},{"$f":"'CRO2_Ins-Mes'!E44","v":16}]
[{"$f":"PFP!C12","v":"T1"},{"$f":"PFP!E12","v":"Técnico de projetos/obra (P8147)"},"mês",13,{"$f":"PFP!H12","v":3167.62},{"$f":"PFP!I12","v":6806.27},{"$f":"PFP!J12","v":2.1486999999999998},{"$f":"'CRO2_Ins-Mes'!E21","v":1},{"$f":"'CRO2_Ins-Mes'!E33","v":0},{"$f":"'CRO2_Ins-Mes'!E45","v":12}]
[{"$f":"PFP!C13","v":"D"},{"$f":"PFP!E13","v":"Desenhista (40807)"},"mês",4,{"$f":"PFP!H13","v":4818.4799999999996},{"$f":"PFP!I13","v":5794.7},{"$f":"PFP!J13","v":1.2025999999999999},{"$f":"'CRO2_Ins-Mes'!E22","v":0},{"$f":"'CRO2_Ins-Mes'!E34","v":0},{"$f":"'CRO2_Ins-Mes'!E46","v":4}]
{"$rows_left_out":18}
{"sheet":"CRO2_Ins-Mes","index":7,"n_rows":53,"n_cols":14,"rows_kept":53,"cut":false,"hidden":false,"merged":[[76,5,76,11],[0,0,1,13]]}
["CRONOGRAMA SIMPLIFICADO"]
[]
["Cod1","Cod2","Produtos","Uni","Qde",1,2,3,4,5,6,7,8,9]
[1,"1.1","Análise Crítica do Projeto Básico (AC)","mês",{"$f":"SUM(F4:L4)","v":1},1]
[1,1,"Análise Crítica do Projeto Básico (AC)","mês",1,{"$f":"SUBTOTAL(4,F4:F4)","v":1},0,0,0,0,0,0]
[2,"2.1","Serviços Topográficos/Cartográficos","mês",1,null,1]
[2,2,"Estudos Básicos (EB)","mês",1,{"$f":"SUBTOTAL(4,F6:F6)","v":0},1,0,0,0,0,0]
[3,"3.1","Projeto Terraplanagem e Urbanização, Viário e Drenagem","mês",4,null,null,1,1,1,1]
[3,"3.2","Projeto Estrutural e Fundações","mês",4,null,null,1,1,1,1]
[3,"3.3","Projeto Edificações e Elementos Civis","mês",4,null,null,1,1,1,1]
{"$rows_left_out":44}
{"sheet":"MDO_DNIT","index":8,"n_rows":113,"n_cols":26,"rows_kept":113,"cut":false,"hidden":false,"merged":[[1,20,1,21],[0,25,1,25],[0,16,0,21],[0,22,1,23],[0,24,1,24],[1,16,1,17],[1,18,1,19],[0,6,0,15],[0,0,2,0],[0,1,2,1],[0,2,2,2],[0,3,1,3],[0,4,1,5],[1,6,1,7],[1,8,1,9],[1,10,1,11],[1,12,1,13],[1,14,1,15]]}
["Código","Categoria","Unid.","Salário","Encargos Sociais",null,"Encargos Complementares",{"$nulls":9},"Encargos Adicionais",{"$nulls":5},"Encargos Totais",null,"Valor Total","Encargos Adicionais e Complementares"]
[{"$nulls":6},"Alimentação",null,"EPI",null,"Ferramenta",null,"Transporte",null,"Exame Ocupacional",null,"Cesta Básica",null,"Assistência Médica",null,"Seguro de Vida"]
[null,null,null,"R$","%","R$","%","R$","%","R$","%","R$","%","R$","%","R$","%","R$","%","R$","%","R$","%","R$","R$","R$"]
["Profissionais mensalistas"]
["P8001","Advogado júnior","mês",4530.07,0.79290000000000005,3591.89,0.1552,702.89,5.4999999999999997E-3,24.99,0,0,0,0,5.9999999999999995E-4,2.83,0,0,6.3899999999999998E-2,289.39,2.2000000000000001E-3,9.98,1.0203,4621.9799999999996,9152.0499999999993,{"$f":"Y5-F5-D5","v":1030.0900000000001}]
["P8002","Advogado pleno","mês",6040.1,0.79290000000000005,4789.1899999999996,0.1164,702.89,4.1000000000000003E-3,24.99,0,0,0,0,5.0000000000000001E-4,2.83,0,0,4.7899999999999998E-2,289.39,1.6999999999999999E-3,9.98,0.96340000000000003,5819.27,11859.37,{"$f":"Y6-F6-D6","v":1030.0800000000008}]
["P8003","Advogado sênior","mês",11150.15,0.79290000000000005,8840.9500000000007,6.3E-2,702.89,2.2000000000000001E-3,24.99,0,0,0,0,2.9999999999999997E-4,2.83,0,0,2.5999999999999999E-2,289.39,8.9999999999999998E-4,9.98,0.88529999999999998,9871.0300000000007,21021.18,1030.08]
["P8007","Analista de desenvolvimento de sistemas júnior","mês",4761.5,0.79600000000000004,3790.16,0.14760000000000001,702.89,0,0,0,0,0,0,8.0000000000000004E-4,3.69,0,0,6.08E-2,289.39,2.0999999999999999E-3,9.98,1.0073000000000001,4796.1099999999997,9557.61,1005.9500000000007]
["P8008","Analista de desenvolvimento de sistemas pleno","mês",5587.15,0.79600000000000004,4447.37,0.1258,702.89,0,0,0,0,0,0,6.9999999999999999E-4,3.69,0,0,5.1799999999999999E-2,289.39,1.8E-3,9.98,0.97599999999999998,5453.33,11040.48,1005.96]
["P8009","Analista de desenvolvimento de sistemas sênior","mês",9769.36,0.79600000000000004,7776.41,7.1900000000000006E-2,702.89,0,0,0,0,0,0,4.0000000000000002E-4,3.69,0,0,2.9600000000000001E-2,289.39,1E-3,9.98,0.89900000000000002,8782.3700000000008,18551.73,1005.9599999999991]
{"$rows_left_out":104}
{"sheet":"CPU-VEICULO_PickUp","index":9,"n_rows":61,"n_cols":33,"rows_kept":61,"cut":false,"hidden":false,"merged":[[52,19,52,26],[4,0,4,2],[6,0,6,2],[7,0,7,1],[7,4,7,7],[8,0,8,2],[52,8,52,18]]}
[]
[]
[]
[]
["Composição de Preços de Locação de Veículo tipo pick-up"]
[null,"Data de atualização:","2024-01-22",null,"CV","Média","Mediana",null,null,null,"CV","Média","Mediana",{"$nulls":8},"CV","Média","Mediana"]
["CODEVASF ",null,null,null,{"$f":"_xlfn.STDEV.S(E10:H10)/AVERAGE(E10:H10)","v":9.2667922664402616E-2},{"$f":"AVERAGE(E10:H10)","v":179935.5},{"$f":"MEDIAN(E10:H10)","v":184702},null,null,null,{"$f":"_xlfn.STDEV.S(L9:S9)/AVERAGE(L9:S9)","v":0.20952494145854728},{"$f":"AVERAGE(L9:S9)","v":31.095714285714287},{"$f":"MEDIAN(L9:S9)","v":30.16},{"$nulls":8},{"$f":"_xlfn.STDEV.S(W9:AD9)/AVERAGE(W9:AD9)","v":0.13240988535259646},{"$f":"AVERAGE(W9:AD9)","v":430.60093749999999},{"$f":"MEDIAN(W9:AD9)","v":437.31624999999997}]
["OBS:               Preço sem BDI e sem motorista                                                                   BDI=",null,null,null,"Preço FIPE ",{"$nulls":4},"PRODUTO ","MENOR (MÉDIA, MEDIANA)","COT. 1","COT. 2","COT. 3","COT. 4","COT. 5","COT. 6","COT. 7","COT. 8",null,"PRODUTO","MENOR (MÉDIA, MEDIANA)","COT. 1","COT. 2","COT. 3","COT. 4","COT. 5","COT. 6","COT. 7","COT. 8"]
["Veículo tipo pick-up, cabine dupla - 2.0 16V 4x4 diesel Aut.",null,null,null,"Toro Ultra 2.0 16V 4x4 TB Diesel Aut.","Toro Freedom 2.0 16V 4x4 TB Diesel Aut.","Toro Volcano 2.0 16V 4x4 TB Diesel Aut."," Toro Ranch 2.0 16V 4x4 TB Diesel Aut.\n",null,"LUBRIFICANTE 5W30",{"$f":"SMALL(L7:M7,1)","v":30.16},32.270000000000003,28.9,30.16,37.700000000000003,39.99,20.25,28.4,null,null,"Pneu 225/65 R17",{"$f":"SMALL(W7:X7,1)","v":430.60093749999999},{"$f":"1661.85/4","v":415.46249999999998},{"$f":"1940.9/4","v":485.22500000000002},399.88,330.46,479.6,386.23,459.17,488.78]
[null,"Custo Mensal (R$):",{"$f":"C51","v":7163.7901683616183},null,193030,157308,177450,191954]
{"$rows_left_out":52}
{"sheet":"CPU HOSPEDAGEM","index":10,"n_rows":19,"n_cols":4,"rows_kept":19,"cut":false,"hidden":false,"merged":[[2,1,2,2]]}
[]
[null,"Engenharia Consultiva da Codevasf"]
[null,"CPU - HOSPEDAGEM EQUIPE DE CAMPO (4 PESSOAS/MÊS)",null,"Código/Referencia"]
[null,"ALUGUEL ",3074.56,"F020003334/EMBASA"]
[null," Aquisição de Mobiliário",{"$f":"43.89*C16","v":175.56},"B8954/DNIT"]
[null,"Material de limpeza e diarista",{"$f":"126.93+(123*8)","v":1110.93},"10563/ORSE - E200300131/EMBASA"]
[null,"manutenção da casa alugada - Serviços Gerais/Vigia ",2841.56,"41096/SINAPI"]
[null,"Energia ",180,"10555/ORSE"]
[null,"Água",394.99,"10554/ORSE"]
[null,"telefone/Internet",{"$f":"154.99+89","v":243.99},"10557/10558/ORSE"]
{"$rows_left_out":10}
{"sheet":"Cotação Voos","index":11,"n_rows":108,"n_cols":6,"rows_kept":108,"cut":false,"hidden":false,"merged":[]}
["COTAÇÕES - IDA DIA 04/11/2024 E VOLTA DIA 08/11/2024"]
["Localidade:","Salvador"]
[]
["Origem","Destino"]
["BSB",{"$f":"B2","v":"Salvador"},"Cia 1","Cia 2","Cia 3","Média"]
[null,null,866,914,928,{"$f":"AVERAGE(C6:E6)","v":902.66666666666663}]
{"$rows_empty":24}
["SP",{"$f":"B2","v":"Salvador"},"Cia 1","Cia 2","Cia 3","Média"]
[null,null,791,801,804,{"$f":"AVERAGE(C32:E32)","v":798.66666666666663}]
{"$rows_empty":24}
{"$rows_left_out":8}
{"sheet":"COT. VANT","index":12,"n_rows":17,"n_cols":10,"rows_kept":17,"cut":false,"hidden":true,"merged":[[1,0,1,9],[7,0,9,0],[7,1,7,5],[8,1,8,5],[9,1,9,5]]}
[]
["COTAÇÃO ORÇAMENTÁRIA DE LEVANTAMENTO PLANIALTIMÉTRICO POR MEIO DE VANT PARA ÁREA NA CIDADE DE PINDARÉ-MIRIM-MA"]
["MÊS/ANO DE REFERÊNCIA ","ÁREA DO PROJETO [ha]","EMPRESA","LOCALIDADE","WEBSITE","CONTATO","AVALIAÇÃO TÉCNICA DA PROPOSTA","PREÇO","PREÇO UNITÁRIO","RELAÇÃO CUSTO-BENEFÍCIO"]
["2022-09-01",50,"DRONES SOLUTION","SALVADOR-BA","http://www.dronessolution.com.br/","contato@dronessolution.com.br","SATISFATÓRIA",9800,{"$f":"(H4/B4)","v":196},"A"]
["2022-09-01",50,"ERG","BELO HORIZONTE-MG","http://www.ergbh.com.br/","comercial@ergbh.com.br","SATISFATÓRIA",13240.5,{"$f":"(H5/B5)","v":264.81},"B"]
["2022-09-01",50,"CEPEMAR","VITÓRIA-ES","http://www.cepemar.com.br/","comercial@cepemar.com.br","SATISFATÓRIA",63000,{"$f":"(H6/B6)","v":1260},"C"]
[]
["Observações","  1. Na cotação acima já estão iclusos: Planejamento Aerotogramétrico, Voo Aerotoforamétrico, Apoio de Campo, Aerotriangulação, Restituição, MDT, MDS, Ortofotos, Edição/Revisão e Entrega Final.",{"$nulls":4},"CV com todos valores:",{"$f":"STDEVA(H4:H6)/AVERAGE(H4:H6)","v":1.0380549324194583}]
[null,"  2. INCONCLUSIVA: não apresentou o orçamento de forma detalhada.",{"$nulls":4},"CV tirando o maior valor:",{"$f":"STDEVA(H4:H5)/AVERAGE(H4:H5)","v":0.21117604918923782}]
[null,"  3. SATISFATÓRIA: apresentou, no mínimo, os requisitos básicos de um orçamento.",{"$nulls":4},"Média tirando o maior valor:",{"$f":"AVERAGE(H4:H5)","v":11520.25},"Valor para a área de 65ha"]
{"$rows_left_out":7}