{"text_format":"2","workbook":"xlsx","n_sheets":16,"sheets":["PFP","PFP1.1_Topo","PFP1.2_Geo","PFP2.1_FatorKa","PFP2.2_FatorKb","PFP2.3_FatorKc","PFP3_FatorKd","CRO1_Ins-Pro","CRO2_Ins-Mes","CPU VEICULO_PickUp","CPU VEICULO_Leve","CPU HOSPEDAGEM","Serv Graficos","Cotação Voos","MOD_DNIT_JUL_2024","COT. VANT"],"not_rendered":{"charts":0,"images":30,"macros":0,"external_links":51,"defined_names":20487,"comments":1,"pivot_tables":0},"unopened":[],"bounds":{"document_bytes":16777216,"sheet_cells":100000,"run_cost":"one","rows_first":2000,"rows_last":500,"rows_between":2000,"halvings":0,"cell_chars":16384,"cell_head_chars":4096},"cells_cut":0,"cells_raw":0,"read":"whole","date_system":"1900"}

{"sheet":"PFP","index":0,"n_rows":48,"n_cols":16,"rows_kept":48,"cut":false,"hidden":false,"merged":[[27,8,27,11],[27,0,27,7],[26,8,26,11],[26,0,26,7],[34,0,34,11],[28,0,28,7],[28,8,28,11],[31,0,31,11],[30,0,30,11],[42,0,42,11],[35,0,35,11],[37,0,37,11],[29,0,29,11],[36,0,36,11],[32,0,32,11],[38,0,38,11],[39,0,39,11],[40,0,40,11],[41,0,41,11],[33,0,33,11],[0,0,1,9],[4,6,4,9],[0,10,0,11],[1,10,1,11],[4,10,4,11],[2,0,2,11],[3,0,3,11],[4,0,4,5],[5,10,5,11],[5,6,5,9],[25,0,25,7],[25,8,25,11],[5,0,5,5],[24,0,24,7],[24,8,24,11],[6,15,6,18],[7,15,7,18],[8,15,8,18],[9,15,9,18],[10,15,10,18],[11,15,11,18],[12,15,12,18],[13,15,13,18],[14,15,14,18],[15,15,15,18],[20,15,20,18],[21,15,21,18],[22,15,22,18],[23,15,23,18],[16,15,16,22]]}
["PROPOSTA FINANCEIRA DO PROJETO",{"$nulls":9},"CODIGO:"]
[{"$nulls":10},"PFP"]
["NOME DA CONSULTORA:"]
[]
["PROJETO:",{"$nulls":5},"CONTRATANTE:",null,null,null,"BASE:"]
["Atualização do projeto executivo da Barragem de Extrema, localizada no ribeirão Extrema, no município de São João D’Aliança-GO",{"$nulls":5},"CODEVASF (SEDE)",null,null,null,"2024-11-01"]
["Base","Cod2","Cod3","Código","Categoria / Insumo","Uni","Qde","CUD","PU","FatorK","CT","PT","Encargos COMP E ADICIONAIS","SOCIAIS","TOTAIS","Encargos COMPLEMENTARES e ADICIONAIS"]
["SICRO","MO3","P0","P8061","Engenheiro coordenador (P8061)","mês",{"$f":"'CRO1_Ins-Pro'!D5","v":4},{"$f":"VLOOKUP(D8,MOD_DNIT_JUL_2024!A:Z,4,0)","v":18189.93},{"$f":"ROUND(J8*H8,2)","v":23652.37},{"$f":"'PFP2.3_FatorKc'!E35","v":1.3003},{"$f":"ROUND(G8*H8,2)","v":72759.72},{"$f":"ROUND(G8*I8,2)","v":94609.48},{"$f":"O8-N8","v":1026.8900000000012},13451.98,14478.87,{"$f":"VLOOKUP(D8,MOD_DNIT_JUL_2024!A:Z,26,0)","v":1069.489999999998}]
{"$rows_left_out":41}
{"sheet":"PFP1.1_Topo","index":1,"n_rows":27,"n_cols":14,"rows_kept":27,"cut":false,"hidden":false,"merged":[[3,11,3,13],[22,11,23,13],[24,11,24,12],[25,0,25,9],[24,0,24,9],[5,0,5,5],[5,6,5,7],[19,0,19,7],[20,0,20,9],[21,0,21,9],[22,0,22,9],[23,0,23,9],[26,0,26,9],[0,0,1,7],[2,0,2,9],[3,0,3,9],[4,0,4,5],[4,6,4,7]]}
["SERVIÇOS TOPOGRÁFICOS/CARTOGRÁFICOS",{"$nulls":8},"CODIGO:"]
[{"$nulls":9},"PFP-1.1"]
["NOME DA EMPRESA:"]
[{"$nulls":11},"MEMÓRIA DE CALCULO DO BDI DE FORNECIMENTO"]
["PROJETO:",{"$nulls":5},"CONTRATANTE:",null,null,{"$f":"PFP!K5","v":"BASE:"},null,"ITEM","DISCRIMINAÇÃO","PERC.    (%)"]
[{"$f":"PFP!A6","v":"Atualização do projeto executivo da Barragem de Extrema, localizada no ribeirão Extrema, no município de São João D’Aliança-GO"},{"$nulls":5},"CODEVASF (SEDE)",null,null,{"$f":"PFP!K6","v":"2024-11-01"}]
["Cod.","Base","Referência","CÓDIGO","Insumos","Uni","Qde","Custo Unitário (PU)","Custo Total (CT)","Preço Total (PT)"]
["TP01","CODE","CODE","CODE","Nivelamento Geométrico dos Eixos classe IIN","km",3.5,889.16,{"$f":"G8*H8","v":3112.06},{"$f":"(I8*$N$25)+I8","v":3569.2842347195128},null,"1.00","Despesas Indiretas"]
{"$rows_left_out":20}
{"sheet":"PFP1.2_Geo","index":2,"n_rows":67,"n_cols":16,"rows_kept":67,"cut":false,"hidden":false,"merged":[[5,0,5,5],[5,6,5,7],[7,4,7,9],[0,0,1,7],[2,0,2,9],[3,0,3,9],[4,0,4,5],[4,6,4,7],[65,0,65,9],[66,0,66,9],[7,12,7,14],[26,12,27,14],[28,12,28,13],[63,0,63,9],[64,0,64,9],[59,0,59,7],[60,0,60,9],[61,0,61,9],[62,0,62,9]]}
["SERVIÇOS GEOLÓGICOS/GEOTÉCNICOS",{"$nulls":8},"CODIGO:"]
[{"$nulls":9},"PFP-1.2"]
["NOME DA EMPRESA:"]
[]
["PROJETO: ",{"$nulls":5},"CONTRATANTE:",null,null,{"$f":"PFP!K5","v":"BASE:"}]
[{"$f":"PFP!A6","v":"Atualização do projeto executivo da Barragem de Extrema, localizada no ribeirão Extrema, no município de São João D’Aliança-GO"},{"$nulls":5},"CODEVASF (SEDE)",null,null,{"$f":"PFP!K6","v":"2024-11-01"}]
["Cod.","Base","Código","Referência","Insumos","Uni","Qde","Custo Unitário (CU)","Custo Total (CT)","Preço Total (PT)"]
["GT 1","CODE",null,null,"Sondagem mista",{"$nulls":7},"MEMÓRIA DE CALCULO DO BDI DE FORNECIMENTO"]
{"$rows_left_out":60}
{"sheet":"PFP2.1_FatorKa","index":3,"n_rows":41,"n_cols":6,"rows_kept":41,"cut":false,"hidden":false,"merged":[[35,1,35,3],[6,1,6,3],[40,0,40,5],[39,0,39,5],[38,0,38,5],[37,0,37,5],[22,1,22,3],[29,1,29,3],[30,1,30,3],[28,1,28,3],[25,1,25,3],[26,1,26,3],[27,1,27,3],[33,1,33,3],[31,1,31,3],[32,1,32,3],[34,1,34,3],[0,0,1,4],[2,0,2,5],[5,0,5,1],[5,2,5,4],[4,2,4,4],[3,0,3,5],[24,1,24,3],[7,1,7,3],[17,1,17,3],[8,1,8,3],[13,1,13,3],[14,1,14,3],[15,1,15,3],[18,1,18,3],[19,1,19,3],[20,1,20,3],[21,1,21,3],[23,1,23,3],[9,1,9,3],[10,1,10,3],[11,1,11,3],[12,1,12,3]]}
["DETALHAMENTO DOS ENCARGOS SOCIAIS: Ka",{"$nulls":4},"CODIGO:"]
[{"$nulls":5},"PFP-2.1"]
["NOME DA CONSULTORA:"]
[]
["PROJETO:",null,"CONTRATANTE:",null,null,{"$f":"PFP!K5","v":"BASE:"}]
[{"$f":"PFP!A6","v":"Atualização do projeto executivo da Barragem de Extrema, localizada no ribeirão Extrema, no município de São João D’Aliança-GO"},null,"CODEVASF (SEDE)",null,null,"SINAPI/GO: 12/23"]
["Cod","DESCRIÇÃO",null,null,"%","R$"]
["A","ENCARGOS SOCIAIS BÁSICOS",null,null,{"$f":"ROUND(SUM(E9:E17),4)","v":0.378},{"$f":"ROUND(E8*SUMIF(PFP!$B$8:$B$24,\"MO1\",PFP!$K$8:$K$24),2)","v":160589.12}]
{"$rows_left_out":34}
{"sheet":"PFP2.2_FatorKb","index":4,"n_rows":40,"n_cols":6,"rows_kept":40,"cut":false,"hidden":false,"merged":[[27,1,27,3],[28,1,28,3],[29,1,29,3],[22,1,22,3],[23,1,23,3],[24,1,24,3],[25,1,25,3],[26,1,26,3],[6,1,6,3],[12,1,12,3],[13,1,13,3],[39,0,39,5],[36,0,36,5],[37,0,37,5],[38,0,38,5],[31,1,31,3],[32,1,32,3],[33,1,33,3],[34,1,34,3],[18,1,18,3],[30,1,30,3],[19,1,19,3],[20,1,20,3],[21,1,21,3],[0,0,1,4],[2,0,2,5],[3,0,3,5],[4,2,4,4],[5,0,5,1],[5,2,5,4],[7,1,7,3],[16,1,16,3],[17,1,17,3],[8,1,8,3],[9,1,9,3],[10,1,10,3],[14,1,14,3],[15,1,15,3],[11,1,11,3]]}
["DETALHAMENTO DOS ENCARGOS SOCIAIS: Kb",{"$nulls":4},"CODIGO:"]
[{"$nulls":5},"PFP-2.2"]
["NOME DA CONSULTORA:"]
[]
["PROJETO:",null,"CONTRATANTE:",null,null,{"$f":"'PFP2.1_FatorKa'!F5","v":"BASE:"}]
[{"$f":"PFP!A6","v":"Atualização do projeto executivo da Barragem de Extrema, localizada no ribeirão Extrema, no município de São João D’Aliança-GO"},null,"CODEVASF (SEDE)",null,null,{"$f":"'PFP2.1_FatorKa'!F6","v":"SINAPI/GO: 12/23"}]
["Cod","DESCRIÇÃO",null,null,"%","R$"]
["A","ENCARGOS SOCIAIS BÁSICOS",null,null,{"$f":"ROUND(SUM(E9:E16),4)","v":0.2},{"$f":"ROUND(E8*SUMIF(PFP!$B$8:$B$24,\"MO2\",PFP!$K$8:$K$24),2)","v":22228.21}]
{"$rows_left_out":33}
{"sheet":"PFP2.3_FatorKc","index":5,"n_rows":40,"n_cols":6,"rows_kept":40,"cut":false,"hidden":false,"merged":[[0,0,1,4],[2,0,2,5],[3,0,3,5],[4,2,4,4],[5,0,5,1],[5,2,5,4],[16,1,16,3],[6,1,6,3],[7,1,7,3],[8,1,8,3],[9,1,9,3],[10,1,10,3],[11,1,11,3],[12,1,12,3],[13,1,13,3],[14,1,14,3],[15,1,15,3],[28,1,28,3],[17,1,17,3],[18,1,18,3],[19,1,19,3],[20,1,20,3],[21,1,21,3],[22,1,22,3],[23,1,23,3],[24,1,24,3],[25,1,25,3],[26,1,26,3],[27,1,27,3],[36,0,36,5],[37,0,37,5],[38,0,38,5],[39,0,39,5],[29,1,29,3],[30,1,30,3],[31,1,31,3],[32,1,32,3],[33,1,33,3],[34,1,34,3]]}
["DETALHAMENTO DOS ENCARGOS SOCIAIS: Kc",{"$nulls":4},"CODIGO:"]
[{"$nulls":5},"PFP-2.3"]
["NOME DA CONSULTORA:"]
[]
["PROJETO:",null,"CONTRATANTE:",null,null,{"$f":"'PFP2.2_FatorKb'!F5","v":"BASE:"}]
[{"$f":"PFP!A6","v":"Atualização do projeto executivo da Barragem de Extrema, localizada no ribeirão Extrema, no município de São João D’Aliança-GO"},null,"CODEVASF (SEDE)",null,null,{"$f":"'PFP2.2_FatorKb'!F6","v":"SINAPI/GO: 12/23"}]
["Cod","DESCRIÇÃO",null,null,"%","R$"]
["A","ENCARGOS SOCIAIS BÁSICOS",null,null,{"$f":"SUM(E9:E16)","v":0},{"$f":"ROUND(E8*SUMIF(PFP!$B$8:$B$24,\"MO3\",PFP!$K$8:$K$24),2)","v":0}]
{"$rows_left_out":33}
{"sheet":"PFP3_FatorKd","index":6,"n_rows":35,"n_cols":7,"rows_kept":35,"cut":false,"hidden":false,"merged":[[31,0,31,5],[0,0,1,4],[2,0,2,5],[5,0,5,1],[5,2,5,4],[4,2,4,4],[3,0,3,5],[7,1,7,2],[25,0,25,5],[6,1,6,2],[11,6,11,14],[12,6,12,14],[12,1,12,3],[11,1,11,3],[8,1,8,2],[9,1,9,2],[10,1,10,2],[33,0,33,5],[34,0,34,5],[16,1,16,3],[13,1,13,3],[14,1,14,3],[15,1,15,3],[21,0,21,5],[26,0,26,5],[27,0,27,5],[22,0,22,5],[23,0,23,5],[24,0,24,5],[28,0,28,5],[29,0,29,5],[32,0,32,5],[30,0,30,5]]}
["DESPESAS FISCAIS E CUSTOS DIVERSOS: Kc",{"$nulls":4},"CODIGO:"]
[{"$nulls":5},"PFP-3"]
["NOME DA CONSULTORA:"]
[]
["PROJETO:",null,"CONTRATANTE:",null,null,{"$f":"'PFP2.3_FatorKc'!F5","v":"BASE:"}]
[{"$f":"PFP!A6","v":"Atualização do projeto executivo da Barragem de Extrema, localizada no ribeirão Extrema, no município de São João D’Aliança-GO"},null,"CODEVASF (SEDE)",null,null,{"$f":"'PFP2.3_FatorKc'!F6","v":"SINAPI/GO: 12/23"}]
["Cod","DESCRIÇÃO1",null,"% preço2","% custo4","R$"]
["K4","TRIBUTOS",null,{"$f":"ROUND(D9+D10+D11,4)","v":0.124},{"$f":"ROUND(E9+E10+E11,4)","v":0.1416},{"$f":"E8*SUM(SUMIF(PFP!$B$8:$B$24,\"MO1\",PFP!$K$8:$K$24)*(1+'PFP2.1_FatorKa'!$E$35)+SUMIF(PFP!$B$8:$B$24,\"MO2\",PFP!$K$8:$K$24)*(1+'PFP2.2_FatorKb'!$E$34)+SUMIF(PFP!$B$8:$B$24,\"<>MO*\",PFP!$K$8:$K$24)+$F$13+$F$12)","v":144474.69078490912}]
{"$rows_left_out":28}
{"sheet":"CRO1_Ins-Pro","index":7,"n_rows":86,"n_cols":11,"rows_kept":86,"cut":false,"hidden":false,"merged":[[84,0,84,8],[83,0,83,10],[0,0,1,8],[35,7,35,10],[18,0,19,0],[18,1,19,1],[2,0,3,0],[2,1,3,1],[2,2,3,2],[2,3,3,3],[2,4,3,4],[2,5,3,5]]}
["INSUMOS POR ETAPA/PRODUTO",{"$nulls":9},"CÓDIGO:"]
[{"$nulls":10},"CRO-1"]
["Cod.","Categoria / Insumo","Uni","Qde","CUD","PU","FatorK","E1.RP","E2. EB","E3.PE","E4. TL"]
[{"$nulls":6},"Meses",{"$f":"'CRO2_Ins-Mes'!E5","v":1},{"$f":"'CRO2_Ins-Mes'!E11","v":2},{"$f":"'CRO2_Ins-Mes'!E21","v":4},{"$f":"'CRO2_Ins-Mes'!E23","v":1}]
[{"$f":"PFP!C8","v":"P0"},{"$f":"PFP!E8","v":"Engenheiro coordenador (P8061)"},"mês",{"$f":"SUM(H5:K5)","v":4},{"$f":"PFP!H8","v":18189.93},{"$f":"PFP!I8","v":23652.37},{"$f":"PFP!J8","v":1.3003},{"$f":"'CRO2_Ins-Mes'!E26","v":1},{"$f":"'CRO2_Ins-Mes'!E36","v":1},{"$f":"'CRO2_Ins-Mes'!E48","v":2},{"$f":"'CRO2_Ins-Mes'!E58","v":0}]
[{"$f":"PFP!C9","v":"P1"},{"$f":"PFP!E9","v":"Engenheiro sênior (P8067)"},"mês",7,{"$f":"PFP!H9","v":15877.29},{"$f":"PFP!I9","v":24514.54},{"$f":"PFP!J9","v":1.544},{"$f":"'CRO2_Ins-Mes'!E27","v":1},{"$f":"'CRO2_Ins-Mes'!E37","v":2},{"$f":"'CRO2_Ins-Mes'!E49","v":4},{"$f":"'CRO2_Ins-Mes'!E59","v":0}]
[{"$f":"PFP!C10","v":"P2"},{"$f":"PFP!E10","v":"Engenheiro pleno (P8066)"},"mês",14,{"$f":"PFP!H10","v":12629.6},{"$f":"PFP!I10","v":26770.959999999999},{"$f":"PFP!J10","v":2.1196999999999999},{"$f":"'CRO2_Ins-Mes'!E28","v":2},{"$f":"'CRO2_Ins-Mes'!E38","v":4},{"$f":"'CRO2_Ins-Mes'!E50","v":8},{"$f":"'CRO2_Ins-Mes'!E60","v":0}]
[{"$f":"PFP!C11","v":"P3"},{"$f":"PFP!E11","v":"Engenheiro júnior (P8065)"},"mês",18,{"$f":"PFP!H11","v":12002},{"$f":"PFP!I11","v":25440.639999999999},{"$f":"PFP!J11","v":2.1196999999999999},{"$f":"'CRO2_Ins-Mes'!E29","v":3},{"$f":"'CRO2_Ins-Mes'!E39","v":2},{"$f":"'CRO2_Ins-Mes'!E51","v":12},{"$f":"'CRO2_Ins-Mes'!E61","v":1}]
{"$rows_left_out":18}
{"sheet":"CRO2_Ins-Mes","index":8,"n_rows":68,"n_cols":15,"rows_kept":68,"cut":false,"hidden":false,"merged":[[91,5,91,12],[0,0,1,14]]}
["CRONOGRAMA SIMPLIFICADO"]
[]
["Cod1","Cod2","Produtos","Uni","Qde",1,2,3,4,5,6,7,8,9,10]
[1,"1.1","Revisão, Análise Crítica do Projeto Executivo e Planejamento da atualização","mês",{"$f":"SUM(F4:M4)","v":1},1]
[1,"1","Revisão, Análise Crítica do Projeto Executivo e Planejamento da atualização","mês",1,{"$f":"SUBTOTAL(4,F4:F4)","v":1},0,0,0,0,0,0,0]
[2,"2.1","Serviços Topográficos/Cartográficos","mês",2,null,1,1]
[2,"2.2","Serviços Geológicos/Geotécnicos","mês",2,null,1,1]
[2,"2.3","Estudos Hidrológicos e Hidrogeológicos","mês",2,null,1,1]
{"$rows_left_out":61}
{"sheet":"CPU VEICULO_PickUp","index":9,"n_rows":84,"n_cols":31,"rows_kept":84,"cut":false,"hidden":false,"merged":[[49,20,49,27],[1,0,1,3],[3,0,3,3],[4,0,4,2],[4,5,4,8],[5,0,5,3],[49,9,49,19],[18,21,20,30]]}
[]
["Composição de Preços de Locação de Veículos"]
[null,null,"Data de atualização:","2024-11-05",null,"CV","Média","Mediana",null,null,null,"CV","Média","Mediana",{"$nulls":8},"CV","Média","Mediana"]
["CODEVASF ",{"$nulls":4},{"$f":"_xlfn.STDEV.S(F7:I7)/AVERAGE(F7:I7)","v":0.20848860252512907},{"$f":"AVERAGE(F7:I7)","v":155883.5},{"$f":"MEDIAN(F7:I7)","v":160632},null,null,null,{"$f":"_xlfn.STDEV.S(M6:T6)/AVERAGE(M6:T6)","v":0.18675294816810684},{"$f":"AVERAGE(M6:T6)","v":46.051249999999996},{"$f":"MEDIAN(M6:T6)","v":44.870000000000005},{"$nulls":8},{"$f":"_xlfn.STDEV.S(X6:AD6)/AVERAGE(X6:AD6)","v":0.30097792292189546},{"$f":"AVERAGE(X6:AE6)","v":583.13499999999999},{"$f":"MEDIAN(X6:AE6)","v":489.9}]
["OBS:               Preço sem BDI e sem motorista                                                                   BDI=",{"$nulls":4},"Preço FIPE - Novembro/2024",{"$nulls":4},"PRODUTO ","MENOR (MÉDIA, MEDIANA)","COT. 1","COT. 2","COT. 3","COT. 4","COT. 5","COT. 6","COT. 7","COT. 8",null,"PRODUTO","MENOR","COT. 1","COT. 2","COT. 3","COT. 4","COT. 5","COT. 6","COT. 7","COT. 8"]
["Veículo tipo pick-up, cabine dupla - 2.0 16V 4x4 diesel Aut. ",{"$nulls":4},"Toro Endurance 2.0 16V 4x4 Diesel Aut.","Toro Freedom 2.0 16V 4x4 TB Diesel Aut.","Toro Volcano 2.0 16V 4x4 TB Diesel Aut."," Toro Ranch 2.0 16V 4x4 TB Diesel Aut.\n",null,"LUBRIFICANTE 5W30",{"$f":"SMALL(M4:N4,1)","v":44.870000000000005},47.39,44.9,44.84,64.8,47.59,{"$f":"172/4","v":43},40.99,34.9,null,"Pneu 225/65 R17",{"$f":"SMALL(X4:Y4,1)","v":489.9},880.11,439,431.91,698.9,{"$f":"1522.62/2","v":761.31},474.05,499.9,479.9]
[null,null,"Custo Mensal (R$):",{"$f":"D48","v":6511.1983227793426},null,115506,144205,177059,186764]
[null,null,"Custo Diária (R$):",{"$f":"D7/22","v":295.96356012633373}]
{"$rows_left_out":55}
{"sheet":"CPU VEICULO_Leve","index":10,"n_rows":85,"n_cols":33,"rows_kept":85,"cut":false,"hidden":false,"merged":[[53,10,56,20],[48,9,48,20],[48,21,48,28],[4,5,4,8],[1,0,1,3],[3,0,3,3],[4,0,4,2],[5,0,5,3]]}
[]
["Composição de Preços de Locação de Veículos"]
[null,"2023-08-23","Data de atualização:","2024-11-05",null,"CV","Média","Mediana",null,null,null,"CV","Média","Mediana",{"$nulls":9},"CV","Média","Mediana"]
["CODEVASF ",{"$nulls":4},{"$f":"_xlfn.STDEV.S(F7:I7)/AVERAGE(F7:I7)","v":0.17234947818462842},{"$f":"AVERAGE(F7:I7)","v":72238},{"$f":"MEDIAN(F7:I7)","v":74481.5},null,null,null,{"$f":"_xlfn.STDEV.S(M6:U6)/AVERAGE(M6:U6)","v":0.32662575071914779},{"$f":"AVERAGE(M6:U6)","v":32.172222222222224},{"$f":"MEDIAN(M6:U6)","v":29.54},{"$nulls":9},{"$f":"_xlfn.STDEV.S(Y6:AG6)/AVERAGE(Y6:AG6)","v":0.16874225052573363},{"$f":"AVERAGE(Y6:AG6)","v":268.39333333333332},{"$f":"MEDIAN(Y6:AG6)","v":267.32}]
["OBS:               Preço sem BDI e sem motorista                                                           BDI=",{"$nulls":4},"Preço FIPE - fevereiro/2023",{"$nulls":4},"PRODUTO - Pesquisa fev/2023","MENOR (MÉDIA, MEDIANA)","COT. 1","COT. 2","COT. 3","COT. 4","COT. 5","COT. 6","COT. 7","COT. 8","COT. 9",null,"PRODUTO - Pesquisa fev/2023","MENOR","COT. 1","COT. 2","COT. 3","COT. 4","COT. 5","COT. 6","COT. 7","COT. 8","COT. 9"]
["Veículo Leve 1.0 T. Flex 12V 5p",{"$nulls":4},"Volksvagen Gol 1.0","HB20 Platinum 1.0 TB Flex 12V Mec.","ONIX HATCH LT 1.0 12V Flex 5p Mec.","MOBI TREKKING 1.0 Flex 5p.",null,"LUBRIFICANTE 15W40",{"$f":"SMALL(M4:N4,1)","v":29.54},29,49.45,48.56,17.39,28.9,30.91,31.9,29.54,23.9,null,"Pneu 185/65 R14",{"$f":"SMALL(Y4:Z4,1)","v":267.32},267.32,279,204.55,249.9,254.36,286.35000000000002,230.31,276.12,367.63]
[null,null,"Custo Mensal (R$):",{"$f":"D48","v":3470.077641964112},null,55477,77900,84512,71063]
[null,null,"Custo Diário (R$):",{"$f":"D7/22","v":157.73080190745964}]
{"$rows_left_out":56}
{"sheet":"CPU HOSPEDAGEM","index":11,"n_rows":19,"n_cols":4,"rows_kept":19,"cut":false,"hidden":false,"merged":[[2,1,2,2]]}
[]
[null,"Engenharia Consultiva da Codevasf"]
[null,"CPU - HOSPEDAGEM EQUIPE DE CAMPO (4 PESSOAS/MÊS)",null,"Código/Referencia"]
[null,"ALUGUEL ",3074.56,"F020003334/EMBASA insumo"]
[null," Aquisição de Mobiliário",{"$f":"42.41*C16","v":169.64},"B8954/DNIT"]
[null,"Material de limpeza e diarista",{"$f":"127.39+(123*8)","v":1111.3900000000001},"10563/ORSE - E200300131/EMBASA"]
[null,"manutenção da casa alugada - Serviços Gerais/Vigia ",3001.91,"41096/SINAPI - ORSE/INSUMO"]
[null,"Energia ",180,"10555/ORSE"]
{"$rows_left_out":12}
{"sheet":"Serv Graficos","index":12,"n_rows":42,"n_cols":9,"rows_kept":42,"cut":false,"hidden":false,"merged":[[27,0,27,3],[2,0,2,4],[14,0,14,4],[19,0,19,3],[21,1,21,2],[22,0,22,4],[37,0,37,4],[38,0,38,4],[39,0,39,4],[40,0,40,4],[41,0,41,4]]}
[]
[]
["Serviços Gráficos"]
[]
["Serviço",null,"Referencia","Código","Valor",null,null,"1 Vol Impressão Rel Final"]
["Impressão colorida",null,"SETOP/COMPOSIÇÃO","CO-2019",1.8,null,"Preto",{"$f":"C17*E7","v":91.35}]
["Impressão preta",null,"SETOP/COMPOSIÇÃO","CO-2017",0.28999999999999998,null,"Colorida",{"$f":"D17*E6","v":63}]
["Encadernação até 350 fls.",null,"EMBASA/COMPOSIÇÃO","30.02.30 / 30.02.27",{"$f":"20+7.2","v":27.2},"Foi considerado a soma de 2 composições, com encadernação de 250 e 100 folhas","Encader",{"$f":"E8","v":27.2}]
{"$rows_left_out":35}
{"sheet":"Cotação Voos","index":13,"n_rows":106,"n_cols":6,"rows_kept":106,"cut":false,"hidden":false,"merged":[]}
["COTAÇÕES - IDA DIA 03/02/2025 E VOLTA DIA 07/02/2025"]
["Localidade:","São João D'Aliança - GO"]
[]
["Origem","Destino"]
["BSB ","GO","Cia 1","Cia 2","Cia 3","Média"]
[null,null,808,809,855,{"$f":"AVERAGE(C6:E6)","v":824}]
{"$rows_empty":24}
["RJ","GO","Cia 1","Cia 2","Cia 3","Média"]
{"$rows_left_out":10}
{"sheet":"MOD_DNIT_JUL_2024","index":14,"n_rows":105,"n_cols":26,"rows_kept":105,"cut":false,"hidden":false,"merged":[[0,6,0,15],[0,0,2,0],[0,1,2,1],[0,2,2,2],[0,3,1,3],[0,4,1,5],[1,6,1,7],[1,8,1,9],[1,10,1,11],[1,12,1,13],[1,14,1,15],[1,20,1,21],[0,25,1,25],[0,16,0,21],[0,22,1,23],[0,24,1,24],[1,16,1,17],[1,18,1,19]]}
["Código","Categoria","Unid.","Salário","Encargos Sociais",null,"Encargos Complementares",{"$nulls":9},"Encargos Adicionais",{"$nulls":5},"Encargos Totais",null,"Valor Total","Encargos Adic + Compl"]
[{"$nulls":6},"Alimentação",null,"EPI",null,"Ferramenta",null,"Transporte",null,"Exame Ocupacional",null,"Cesta Básica",null,"Assistência Médica",null,"Seguro de Vida"]
[null,null,null,"R$","%","R$","%","R$","%","R$","%","R$","%","R$","%","R$","%","R$","%","R$","%","R$","%","R$","R$","R$"]
["Profissionais mensalistas"]
["P8001","Advogado júnior","mês",4616.38,0.79300000000000004,3660.79,0.15959999999999999,736.74,5.4999999999999997E-3,25.51,0,0,0,0,5.9999999999999995E-4,2.95,0,0,6.4000000000000001E-2,295.48,2.2000000000000001E-3,9.98,1.0248999999999999,4731.45,9347.83,{"$f":"Y5-F5-D5","v":1070.6599999999999}]
["P8002","Advogado pleno","mês",6155.17,0.79300000000000004,4881.05,0.1197,736.74,4.1000000000000003E-3,25.51,0,0,0,0,5.0000000000000001E-4,2.95,0,0,4.8000000000000001E-2,295.48,1.6000000000000001E-3,9.98,0.96689999999999998,5951.71,12106.89,{"$f":"Y6-F6-D6","v":1070.6699999999992}]
["P8003","Advogado sênior","mês",11441.04,0.79300000000000004,9072.75,6.4399999999999999E-2,736.74,2.2000000000000001E-3,25.51,0,0,0,0,2.9999999999999997E-4,2.95,0,0,2.58E-2,295.48,8.9999999999999998E-4,9.98,0.88660000000000005,10143.41,21584.45,1070.6599999999999]
["P8007","Analista de desenvolvimento de sistemas júnior","mês",4690.87,0.79630000000000001,3735.34,0.15709999999999999,736.74,0,0,0,0,0,0,8.0000000000000004E-4,3.74,0,0,6.3E-2,295.48,2.0999999999999999E-3,9.98,1.0193000000000001,4781.28,9472.16,1045.9499999999998]
{"$rows_left_out":98}
{"sheet":"COT. VANT","index":15,"n_rows":17,"n_cols":10,"rows_kept":17,"cut":false,"hidden":true,"merged":[[1,0,1,9],[7,0,9,0],[7,1,7,5],[8,1,8,5],[9,1,9,5]]}
[]
["COTAÇÃO ORÇAMENTÁRIA DE LEVANTAMENTO PLANIALTIMÉTRICO POR MEIO DE VANT PARA ÁREA NA CIDADE DE PINDARÉ-MIRIM-MA"]
["MÊS/ANO DE REFERÊNCIA ","ÁREA DO PROJETO [ha]","EMPRESA","LOCALIDADE","WEBSITE","CONTATO","AVALIAÇÃO TÉCNICA DA PROPOSTA","PREÇO","PREÇO UNITÁRIO","RELAÇÃO CUSTO-BENEFÍCIO"]
["2022-09-01",50,"DRONES SOLUTION","SALVADOR-BA","http://www.dronessolution.com.br/","contato@dronessolution.com.br","SATISFATÓRIA",9800,{"$f":"(H4/B4)","v":196},"A"]
["2022-09-01",50,"ERG","BELO HORIZONTE-MG","http://www.ergbh.com.br/","comercial@ergbh.com.br","SATISFATÓRIA",13240.5,{"$f":"(H5/B5)","v":264.81},"B"]
["2022-09-01",50,"CEPEMAR","VITÓRIA-ES","http://www.cepemar.com.br/","comercial@cepemar.com.br","SATISFATÓRIA",63000,{"$f":"(H6/B6)","v":1260},"C"]
[]
["Observações","  1. Na cotação acima já estão iclusos: Planejamento Aerotogramétrico, Voo Aerotoforamétrico, Apoio de Campo, Aerotriangulação, Restituição, MDT, MDS, Ortofotos, Edição/Revisão e Entrega Final.",{"$nulls":4},"CV com todos valores:",{"$f":"STDEVA(H4:H6)/AVERAGE(H4:H6)","v":1.0380549324194583}]
{"$rows_left_out":9}