{"text_format":"2","workbook":"xlsx","n_sheets":19,"sheets":["PFP","PFP1.1_Topo","PFP1.2_Geo","PFP1.3_Ger","PFP1.4_Pedo","PFP2.1_FatorKa","PFP2.2_FatorKb","PFP2.3_FatorKc","PFP3_FatorKd","CRO1_Ins-Pro","CRO2_Ins-Mes","Cronograma Físico-Financeiro","MDO DNIT-jul2024","Drone","Serv Graficos","CPU-VEICULO_PickUp","CPU-VEICULO_Leve","CPU HOSPEDAGEM","COT. VANT"],"not_rendered":{"charts":0,"images":38,"macros":0,"external_links":49,"defined_names":20026,"comments":1,"pivot_tables":0},"unopened":[],"bounds":{"document_bytes":16777216,"sheet_cells":100000,"run_cost":"one","rows_first":2000,"rows_last":500,"rows_between":2000,"halvings":0,"cell_chars":16384,"cell_head_chars":4096},"cells_cut":0,"cells_raw":0,"read":"whole","date_system":"1900"}

{"sheet":"PFP","index":0,"n_rows":47,"n_cols":13,"rows_kept":47,"cut":false,"hidden":false,"merged":[[5,10,5,11],[5,6,5,9],[29,0,29,7],[29,8,29,11],[5,0,5,5],[28,0,28,7],[28,8,28,11],[0,0,1,9],[4,6,4,9],[0,10,0,11],[1,10,1,11],[4,10,4,11],[2,0,2,11],[3,0,3,11],[4,0,4,5],[46,0,46,11],[39,0,39,11],[41,0,41,11],[33,0,33,11],[40,0,40,11],[36,0,36,11],[42,0,42,11],[43,0,43,11],[44,0,44,11],[45,0,45,11],[37,0,37,11],[31,8,31,11],[31,0,31,7],[30,8,30,11],[30,0,30,7],[38,0,38,11],[32,0,32,7],[32,8,32,11],[35,0,35,11],[34,0,34,11]]}
["PROPOSTA FINANCEIRA DO PROJETO",{"$nulls":9},"CODIGO:"]
[{"$nulls":10},"PFP"]
["NOME DA CONSULTORA:"]
[]
["PROJETO:",{"$nulls":5},"CONTRATANTE:",null,null,null,"BASE:"]
["Contratação para Elaboração de Estudos Básicos, Estudos de Viabilidade Técnica, Econômica e Ambiental (EVTEA), e Consolidação do Anteprojeto de Engenharia para Atividades de Irrigação em uma área total estimada de 8.500 hectares, ao longo das margens do Riacho Pontal, situado no município de Petrolina-PE.",{"$nulls":5},"CODEVASF (SEDE)",null,null,null,"2024-10-01"]
["Base","Cod2","Cod3","Código","Categoria / Insumo","Uni","Qde","CUD","PU","FatorK","CT","PT","Encargos COMP E ADICIONAIS"]
["SICRO","MO3","P0","P8061","Engenheiro coordenador (P8061)","mês",{"$f":"'CRO1_Ins-Pro'!D5","v":3},{"$f":"VLOOKUP(D8,'MDO DNIT-jul2024'!A:Z,4,0)","v":18189.93},{"$f":"ROUND(J8*H8,2)","v":23716.03},{"$f":"'PFP2.3_FatorKc'!E35","v":1.3038000000000001},{"$f":"ROUND(G8*H8,2)","v":54569.79},{"$f":"ROUND(G8*I8,2)","v":71148.09},{"$f":"VLOOKUP(D8,'MDO DNIT-jul2024'!A:Z,26,0)","v":1069.489999999998}]
{"$rows_left_out":40}
{"sheet":"PFP1.1_Topo","index":1,"n_rows":25,"n_cols":14,"rows_kept":25,"cut":false,"hidden":false,"merged":[[3,11,3,13],[22,11,23,13],[24,11,24,12],[24,0,24,9],[0,0,1,7],[2,0,2,9],[3,0,3,9],[4,0,4,5],[4,6,4,7],[5,0,5,5],[5,6,5,7],[19,0,19,7],[20,0,20,9],[21,0,21,9],[22,0,22,9],[23,0,23,9]]}
["SERVIÇOS TOPOGRÁFICOS/CARTOGRÁFICOS",{"$nulls":8},"CODIGO:"]
[{"$nulls":9},"PFP-1.1"]
["NOME DA EMPRESA:"]
[{"$nulls":11},"MEMÓRIA DE CALCULO DO BDI DE FORNECIMENTO"]
["PROJETO:",{"$nulls":5},"CONTRATANTE:",null,null,{"$f":"PFP!K5","v":"BASE:"},null,"ITEM","DISCRIMINAÇÃO","PERC.    (%)"]
[{"$f":"PFP!A6","v":"Contratação para Elaboração de Estudos Básicos, Estudos de Viabilidade Técnica, Econômica e Ambiental (EVTEA), e Consolidação do Anteprojeto de Engenharia para Atividades de Irrigação em uma área total estimada de 8.500 hectares, ao longo das margens do Riacho Pontal, situado no município de Petrolina-PE."},{"$nulls":5},"CODEVASF (SEDE)",null,null,{"$f":"PFP!K6","v":"2024-10-01"}]
["Cod.","Base","Referência","Código","Insumos","Uni","Qde","Custo Unitário (CU)","Custo Total","Preço Total (PT)"]
["TP01","CODE","CODE","CODE","Nivelamento Geométrico dos Eixos classe IIN","km",8,615.55999999999995,{"$f":"ROUND(G8*H8,2)","v":4924.4799999999996},{"$f":"(I8*$N$25)+I8","v":5647.9852021463421},null,"1.00","Despesas Indiretas"]
{"$rows_left_out":18}
{"sheet":"PFP1.2_Geo","index":2,"n_rows":33,"n_cols":13,"rows_kept":33,"cut":false,"hidden":false,"merged":[[31,0,31,8],[32,0,32,8],[27,0,27,6],[28,0,28,8],[29,0,29,8],[30,0,30,8],[0,0,1,6],[2,0,2,8],[3,0,3,8],[4,0,4,4],[4,5,4,6],[6,10,6,12],[25,10,26,12],[27,10,27,11],[5,0,5,4],[5,5,5,6],[7,3,7,8]]}
["SERVIÇOS GEOLÓGICOS/GEOTÉCNICOS",{"$nulls":7},"CODIGO:"]
[{"$nulls":8},"PFP-1.2"]
["NOME DA EMPRESA:"]
[]
["PROJETO: ",{"$nulls":4},"CONTRATANTE:",null,null,{"$f":"PFP!K5","v":"BASE:"}]
[{"$f":"PFP!A6","v":"Contratação para Elaboração de Estudos Básicos, Estudos de Viabilidade Técnica, Econômica e Ambiental (EVTEA), e Consolidação do Anteprojeto de Engenharia para Atividades de Irrigação em uma área total estimada de 8.500 hectares, ao longo das margens do Riacho Pontal, situado no município de Petrolina-PE."},{"$nulls":4},"CODEVASF (SEDE)",null,null,{"$f":"PFP!K6","v":"2024-10-01"}]
["Cod.","Código","Referência","Insumos","Uni","Qde","Custo Unitário (CU)","Custo Total","Preço Total (PT)",null,"MEMÓRIA DE CALCULO DO BDI DE FORNECIMENTO"]
["GT 1",null,null,"Sondagem mista",{"$nulls":6},"ITEM","DISCRIMINAÇÃO","PERC.    (%)"]
{"$rows_left_out":26}
{"sheet":"PFP1.3_Ger","index":3,"n_rows":27,"n_cols":7,"rows_kept":27,"cut":false,"hidden":false,"merged":[[0,0,1,6],[21,0,21,6],[14,0,14,5],[17,0,17,6],[18,0,18,6],[19,0,19,6],[20,0,20,6],[16,0,16,5],[5,0,5,3],[5,4,5,5],[2,0,2,6],[3,0,3,6],[4,0,4,3],[4,4,4,5]]}
["RECURSOS GERAIS"]
[]
["NOME DA EMPRESA:"]
[]
["PROJETO: ",null,null,null,"CONTRATANTE:",null,{"$f":"PFP!K5","v":"BASE:"}]
[{"$f":"PFP!A6","v":"Contratação para Elaboração de Estudos Básicos, Estudos de Viabilidade Técnica, Econômica e Ambiental (EVTEA), e Consolidação do Anteprojeto de Engenharia para Atividades de Irrigação em uma área total estimada de 8.500 hectares, ao longo das margens do Riacho Pontal, situado no município de Petrolina-PE."},null,null,null,"CODEVASF (SEDE)",null,{"$f":"PFP!K6","v":"2024-10-01"}]
["Cod.","Base","Insumos","Uni","Qde","Preço Unitário (PU)","Preço Total (PT)"]
["V1","CODE","Diárias","dia",120,{"$f":"'CPU HOSPEDAGEM'!C19","v":193.12007575757576},{"$f":"E8*F8","v":23174.409090909092}]
{"$rows_left_out":20}
{"sheet":"PFP1.4_Pedo","index":4,"n_rows":23,"n_cols":14,"rows_kept":23,"cut":false,"hidden":false,"merged":[[1,11,1,13],[20,11,21,13],[22,11,22,12],[19,0,19,9],[0,0,1,7],[2,0,2,9],[3,0,3,9],[4,0,4,5],[4,6,4,7],[5,0,5,5],[5,6,5,7],[7,4,7,9],[15,0,15,7],[16,0,16,9],[17,0,17,9],[18,0,18,9]]}
["SERVIÇOS PEDOLÓGICOS",{"$nulls":8},"CODIGO:"]
[{"$nulls":11},"MEMÓRIA DE CALCULO DO BDI DE FORNECIMENTO"]
["NOME DA EMPRESA:",{"$nulls":10},"ITEM","DISCRIMINAÇÃO","PERC.    (%)"]
[]
["PROJETO:",{"$nulls":5},"CONTRATANTE:"]
[{"$nulls":6},"CODEVASF (SEDE)",{"$nulls":4},"1.00","Despesas Indiretas"]
["Cod.","Base","Código","Referência","Insumos","Uni","Qde","Custo Unitário (CU)","Custo Total","Preço Total (PT)",null,"A1","Seguro e Garantia",8.0000000000000002E-3]
["GT 1","CODE",null,null,"Sondagens",{"$nulls":6},"A2","Riscos e Imprevistos",1.15E-2]
{"$rows_left_out":16}
{"sheet":"PFP2.1_FatorKa","index":5,"n_rows":40,"n_cols":6,"rows_kept":40,"cut":false,"hidden":false,"merged":[[19,1,19,3],[20,1,20,3],[22,1,22,3],[9,1,9,3],[10,1,10,3],[11,1,11,3],[12,1,12,3],[33,1,33,3],[0,0,1,4],[2,0,2,5],[5,0,5,1],[5,2,5,4],[4,2,4,4],[3,0,3,5],[23,1,23,3],[7,1,7,3],[16,1,16,3],[8,1,8,3],[13,1,13,3],[14,1,14,3],[15,1,15,3],[17,1,17,3],[18,1,18,3],[34,1,34,3],[6,1,6,3],[39,0,39,5],[38,0,38,5],[37,0,37,5],[36,0,36,5],[21,1,21,3],[28,1,28,3],[29,1,29,3],[27,1,27,3],[24,1,24,3],[25,1,25,3],[26,1,26,3],[32,1,32,3],[30,1,30,3],[31,1,31,3]]}
["DETALHAMENTO DOS ENCARGOS SOCIAIS: Ka",{"$nulls":4},"CODIGO:"]
[{"$nulls":5},"PFP-2.1"]
["NOME DA CONSULTORA:"]
[]
["PROJETO:",null,"CONTRATANTE:",null,null,{"$f":"PFP!K5","v":"BASE:"}]
[{"$f":"PFP!A6","v":"Contratação para Elaboração de Estudos Básicos, Estudos de Viabilidade Técnica, Econômica e Ambiental (EVTEA), e Consolidação do Anteprojeto de Engenharia para Atividades de Irrigação em uma área total estimada de 8.500 hectares, ao longo das margens do Riacho Pontal, situado no município de Petrolina-PE."},null,"CODEVASF (SEDE)",null,null,"vigencia 12/2023"]
["Cod","DESCRIÇÃO",null,null,"%","R$"]
["A","ENCARGOS SOCIAIS BÁSICOS",null,null,{"$f":"ROUND(SUM(E9:E16),4)","v":0.36799999999999999},{"$f":"ROUND(E8*SUMIF(PFP!$B$8:$B$28,\"MO1\",PFP!$K$8:$K$28),2)","v":188619.01}]
{"$rows_left_out":33}
{"sheet":"PFP2.2_FatorKb","index":6,"n_rows":40,"n_cols":6,"rows_kept":40,"cut":false,"hidden":false,"merged":[[7,1,7,3],[16,1,16,3],[17,1,17,3],[8,1,8,3],[9,1,9,3],[10,1,10,3],[14,1,14,3],[15,1,15,3],[11,1,11,3],[0,0,1,4],[2,0,2,5],[3,0,3,5],[4,2,4,4],[5,0,5,1],[5,2,5,4],[6,1,6,3],[12,1,12,3],[13,1,13,3],[39,0,39,5],[36,0,36,5],[37,0,37,5],[38,0,38,5],[31,1,31,3],[32,1,32,3],[33,1,33,3],[34,1,34,3],[18,1,18,3],[30,1,30,3],[19,1,19,3],[20,1,20,3],[21,1,21,3],[27,1,27,3],[28,1,28,3],[29,1,29,3],[22,1,22,3],[23,1,23,3],[24,1,24,3],[25,1,25,3],[26,1,26,3]]}
["DETALHAMENTO DOS ENCARGOS SOCIAIS: Kb",{"$nulls":4},"CODIGO:"]
[{"$nulls":5},"PFP-2.2"]
["NOME DA CONSULTORA:"]
[]
["PROJETO:",null,"CONTRATANTE:",null,null,{"$f":"'PFP2.1_FatorKa'!F5","v":"BASE:"}]
[{"$f":"PFP!A6","v":"Contratação para Elaboração de Estudos Básicos, Estudos de Viabilidade Técnica, Econômica e Ambiental (EVTEA), e Consolidação do Anteprojeto de Engenharia para Atividades de Irrigação em uma área total estimada de 8.500 hectares, ao longo das margens do Riacho Pontal, situado no município de Petrolina-PE."},null,"CODEVASF (SEDE)",null,null,{"$f":"'PFP2.1_FatorKa'!F6","v":"vigencia 12/2023"}]
["Cod","DESCRIÇÃO",null,null,"%","R$"]
["A","ENCARGOS SOCIAIS BÁSICOS",null,null,{"$f":"ROUND(SUM(E9:E16),4)","v":0.2},{"$f":"ROUND(E8*SUMIF(PFP!$B$8:$B$28,\"MO2\",PFP!$K$8:$K$28),2)","v":26197.53}]
{"$rows_left_out":33}
{"sheet":"PFP2.3_FatorKc","index":7,"n_rows":40,"n_cols":6,"rows_kept":40,"cut":false,"hidden":false,"merged":[[36,0,36,5],[37,0,37,5],[38,0,38,5],[39,0,39,5],[29,1,29,3],[30,1,30,3],[31,1,31,3],[32,1,32,3],[33,1,33,3],[34,1,34,3],[28,1,28,3],[17,1,17,3],[18,1,18,3],[19,1,19,3],[20,1,20,3],[21,1,21,3],[22,1,22,3],[23,1,23,3],[24,1,24,3],[25,1,25,3],[26,1,26,3],[27,1,27,3],[16,1,16,3],[6,1,6,3],[7,1,7,3],[8,1,8,3],[9,1,9,3],[10,1,10,3],[11,1,11,3],[12,1,12,3],[13,1,13,3],[14,1,14,3],[15,1,15,3],[0,0,1,4],[2,0,2,5],[3,0,3,5],[4,2,4,4],[5,0,5,1],[5,2,5,4]]}
["DETALHAMENTO DOS ENCARGOS SOCIAIS: Kc",{"$nulls":4},"CODIGO:"]
[{"$nulls":5},"PFP-2.3"]
["NOME DA CONSULTORA:"]
[]
["PROJETO:",null,"CONTRATANTE:",null,null,{"$f":"'PFP2.2_FatorKb'!F5","v":"BASE:"}]
[{"$f":"PFP!A6","v":"Contratação para Elaboração de Estudos Básicos, Estudos de Viabilidade Técnica, Econômica e Ambiental (EVTEA), e Consolidação do Anteprojeto de Engenharia para Atividades de Irrigação em uma área total estimada de 8.500 hectares, ao longo das margens do Riacho Pontal, situado no município de Petrolina-PE."},null,"CODEVASF (SEDE)",null,null,{"$f":"'PFP2.2_FatorKb'!F6","v":"vigencia 12/2023"}]
["Cod","DESCRIÇÃO",null,null,"%","R$"]
["A","ENCARGOS SOCIAIS BÁSICOS",null,null,{"$f":"SUM(E9:E16)","v":0},{"$f":"ROUND(E8*SUMIF(PFP!$B$8:$B$28,\"MO3\",PFP!$K$8:$K$28),2)","v":0}]
{"$rows_left_out":33}
{"sheet":"PFP3_FatorKd","index":8,"n_rows":35,"n_cols":6,"rows_kept":35,"cut":false,"hidden":false,"merged":[[33,0,33,5],[34,0,34,5],[16,1,16,3],[13,1,13,3],[14,1,14,3],[15,1,15,3],[21,0,21,5],[26,0,26,5],[27,0,27,5],[22,0,22,5],[23,0,23,5],[24,0,24,5],[28,0,28,5],[29,0,29,5],[30,0,30,5],[31,0,31,5],[7,1,7,2],[25,0,25,5],[6,1,6,2],[0,0,1,4],[2,0,2,5],[5,0,5,1],[5,2,5,4],[4,2,4,4],[3,0,3,5],[32,0,32,5],[12,1,12,3],[11,1,11,3],[8,1,8,2],[9,1,9,2],[10,1,10,2]]}
["DESPESAS FISCAIS E CUSTOS DIVERSOS: Kc",{"$nulls":4},"CODIGO:"]
[{"$nulls":5},"PFP-3"]
["NOME DA CONSULTORA:"]
[]
["PROJETO:",null,"CONTRATANTE:",null,null,{"$f":"'PFP2.3_FatorKc'!F5","v":"BASE:"}]
[{"$f":"PFP!A6","v":"Contratação para Elaboração de Estudos Básicos, Estudos de Viabilidade Técnica, Econômica e Ambiental (EVTEA), e Consolidação do Anteprojeto de Engenharia para Atividades de Irrigação em uma área total estimada de 8.500 hectares, ao longo das margens do Riacho Pontal, situado no município de Petrolina-PE."},null,"CODEVASF (SEDE)",null,null,{"$f":"'PFP2.3_FatorKc'!F6","v":"vigencia 12/2023"}]
["Cod","DESCRIÇÃO1",null,"% preço2","% custo4","R$"]
["K4","TRIBUTOS",null,{"$f":"ROUND(D9+D10+D11,4)","v":0.124},{"$f":"ROUND(E9+E10+E11,4)","v":0.1416},{"$f":"E8*SUM(SUMIF(PFP!$B$8:$B$28,\"MO1\",PFP!$K$8:$K$28)*(1+'PFP2.1_FatorKa'!$E$34)+SUMIF(PFP!$B$8:$B$28,\"MO2\",PFP!$K$8:$K$28)*(1+'PFP2.2_FatorKb'!$E$34)+SUMIF(PFP!$B$8:$B$28,\"<>MO*\",PFP!$K$8:$K$28)+$F$13+$F$12)","v":204272.35489753203}]
{"$rows_left_out":28}
{"sheet":"CRO1_Ins-Pro","index":9,"n_rows":93,"n_cols":10,"rows_kept":93,"cut":false,"hidden":false,"merged":[[91,0,91,7],[90,0,90,9],[0,0,1,7],[42,7,42,9],[25,0,26,0],[25,1,26,1],[2,0,3,0],[2,1,3,1],[2,2,3,2],[2,3,3,3],[2,4,3,4],[2,5,3,5]]}
["INSUMOS POR ETAPA/PRODUTO",{"$nulls":8},"CÓDIGO:"]
[{"$nulls":9},"CRO-1"]
["Cod.","Categoria / Insumo","Uni","Qde","CUD","PU","FatorK","E1. EB","E2. EVTEA ","E3. APE"]
[{"$nulls":6},"Meses",{"$f":"'CRO2_Ins-Mes'!E9","v":5},{"$f":"'CRO2_Ins-Mes'!E16","v":4},{"$f":"'CRO2_Ins-Mes'!E23","v":3}]
[{"$f":"PFP!C8","v":"P0"},{"$f":"PFP!E8","v":"Engenheiro coordenador (P8061)"},"mês",{"$f":"SUM(H5:J5)","v":3},{"$f":"PFP!H8","v":18189.93},{"$f":"PFP!I8","v":23716.03},{"$f":"PFP!J8","v":1.3038000000000001},{"$f":"'CRO2_Ins-Mes'!E26","v":1.25},{"$f":"'CRO2_Ins-Mes'!E43","v":1},{"$f":"'CRO2_Ins-Mes'!E57","v":0.75}]
[{"$f":"PFP!C9","v":"P1"},{"$f":"PFP!E9","v":"Engenheiro sênior (P8067)"},"mês",8.25,{"$f":"PFP!H9","v":15877.29},{"$f":"PFP!I9","v":24562.17},{"$f":"PFP!J9","v":1.5469999999999999},{"$f":"'CRO2_Ins-Mes'!E27","v":1.25},{"$f":"'CRO2_Ins-Mes'!E44","v":4},{"$f":"'CRO2_Ins-Mes'!E58","v":3}]
[{"$f":"PFP!C10","v":"P2"},{"$f":"PFP!E10","v":"Engenheiro pleno (P8066)"},"mês",11.75,{"$f":"PFP!H10","v":12629.6},{"$f":"PFP!I10","v":27215.53},{"$f":"PFP!J10","v":2.1549},{"$f":"'CRO2_Ins-Mes'!E28","v":1.25},{"$f":"'CRO2_Ins-Mes'!E45","v":6},{"$f":"'CRO2_Ins-Mes'!E59","v":4.5}]
[{"$f":"PFP!C11","v":"P3"},{"$f":"PFP!E11","v":"Engenheiro júnior (P8065)"},"mês",18.75,{"$f":"PFP!H11","v":12002},{"$f":"PFP!I11","v":25863.11},{"$f":"PFP!J11","v":2.1549},{"$f":"'CRO2_Ins-Mes'!E29","v":1.25},{"$f":"'CRO2_Ins-Mes'!E46","v":10},{"$f":"'CRO2_Ins-Mes'!E60","v":7.5}]
{"$rows_left_out":25}
{"sheet":"CRO2_Ins-Mes","index":10,"n_rows":71,"n_cols":17,"rows_kept":71,"cut":false,"hidden":false,"merged":[[94,5,94,12],[0,0,1,16]]}
["CRONOGRAMA SIMPLIFICADO"]
[]
["Cod1","Cod2","Produtos","Uni","Qde",1,2,3,4,5,6,7,8,9,10,11,12]
[2,"2.1","Serviços Topográficos/Cartográficos","mês",{"$f":"SUM(F4:M4)","v":5},1,1,1,1,1]
[2,"2.2","Serviços Geológicos/Geotécnicos","mês",5,1,1,1,1,1]
[2,"2.3","Serviços Pedológicos","mês",5,1,1,1,1,1]
[2,"2.4","Estudos Hidrológicos e Hidrogeológicos","mês",5,1,1,1,1,1]
[2,"2.5","Avaliação Fundiária","mês",5,1,1,1,1,1]
{"$rows_left_out":64}
{"sheet":"Cronograma Físico-Financeiro","index":11,"n_rows":17,"n_cols":16,"rows_kept":17,"cut":false,"hidden":false,"merged":[[11,1,12,2],[13,2,14,2],[15,1,16,2],[0,1,1,4],[4,1,5,1],[4,2,5,2],[6,1,7,1],[6,2,7,2],[8,1,9,1],[8,2,9,2]]}
[null,"CRONOGRAMA FÍSICO-FINANCEIRO"]
[]
[]
[null,null,null,"Mês 1","Mês 2","Mês 3","Mês 4","Mês 5","Mês 6","Mês 7","Mês 8","Mês 9","Mês 10","Mês 11","Mês 12"]
[null,"Estudos Básicos (EB)",{"$f":"'CRO1_Ins-Pro'!H26","v":1363178.6159896404},{"$f":"D6*$C$5","v":272635.72319792811},272635.72319792811,272635.72319792811,272635.72319792811,272635.72319792811,0,0,0,0,0,0,0,{"$f":"SUM(D5:O5)","v":1363178.6159896406}]
[null,null,null,0.2,0.2,0.2,0.2,0.2,{"$nulls":7},1]
[null,"Estudo de Viabilidade Técnica, Econômica e Ambiental (EVTEA)",{"$f":"'CRO1_Ins-Pro'!I26","v":799425.78999999992},{"$f":"D8*$C$7","v":0},0,0,0,0,199856.44749999998,199856.44749999998,199856.44749999998,199856.44749999998,0,0,0,799425.78999999992]
[{"$nulls":8},0.25,0.25,0.25,0.25,null,null,null,1]
{"$rows_left_out":10}
{"sheet":"MDO DNIT-jul2024","index":12,"n_rows":105,"n_cols":26,"rows_kept":105,"cut":false,"hidden":false,"merged":[[0,6,0,15],[0,0,2,0],[0,1,2,1],[0,2,2,2],[0,3,1,3],[0,4,1,5],[1,6,1,7],[1,8,1,9],[1,10,1,11],[1,12,1,13],[1,14,1,15],[1,20,1,21],[0,24,1,24],[0,16,0,21],[0,22,1,23],[0,25,1,25],[1,16,1,17],[1,18,1,19]]}
["Código","Categoria","Unid.","Salário","Encargos Sociais",null,"Encargos Complementares",{"$nulls":9},"Encargos Adicionais",{"$nulls":5},"Encargos Totais",null,"Valor Total","Encargos adici + Compl "]
[{"$nulls":6},"Alimentação",null,"EPI",null,"Ferramenta",null,"Transporte",null,"Exame Ocupacional",null,"Cesta Básica",null,"Assistência Médica",null,"Seguro de Vida"]
[null,null,null,"R$","%","R$","%","R$","%","R$","%","R$","%","R$","%","R$","%","R$","%","R$","%","R$","%","R$","R$","R$"]
["Profissionais mensalistas"]
["P8001","Advogado júnior","mês",4616.38,0.79300000000000004,3660.79,0.15959999999999999,736.74,5.4999999999999997E-3,25.51,0,0,0,0,5.9999999999999995E-4,2.95,0,0,6.4000000000000001E-2,295.48,2.2000000000000001E-3,9.98,1.0248999999999999,4731.45,9347.83,{"$f":"Y5-D5-F5","v":1070.6599999999999}]
["P8002","Advogado pleno","mês",6155.17,0.79300000000000004,4881.05,0.1197,736.74,4.1000000000000003E-3,25.51,0,0,0,0,5.0000000000000001E-4,2.95,0,0,4.8000000000000001E-2,295.48,1.6000000000000001E-3,9.98,0.96689999999999998,5951.71,12106.89,{"$f":"Y6-D6-F6","v":1070.6699999999992}]
["P8003","Advogado sênior","mês",11441.04,0.79300000000000004,9072.75,6.4399999999999999E-2,736.74,2.2000000000000001E-3,25.51,0,0,0,0,2.9999999999999997E-4,2.95,0,0,2.58E-2,295.48,8.9999999999999998E-4,9.98,0.88660000000000005,10143.41,21584.45,1070.6599999999999]
["P8007","Analista de desenvolvimento de sistemas júnior","mês",4690.87,0.79630000000000001,3735.34,0.15709999999999999,736.74,0,0,0,0,0,0,8.0000000000000004E-4,3.74,0,0,6.3E-2,295.48,2.0999999999999999E-3,9.98,1.0193000000000001,4781.28,9472.16,1045.9499999999998]
{"$rows_left_out":98}
{"sheet":"Drone","index":13,"n_rows":69,"n_cols":20,"rows_kept":69,"cut":false,"hidden":false,"merged":[[14,21,14,25],[53,19,54,19],[30,12,31,12],[30,13,30,16],[30,17,30,18],[30,19,31,19]]}
[]
["Cotações data 10/2024"]
["COTAÇÃO Software p/ o drone - Agisoft Metashape "]
["Fonte: Google shopping"]
[{"$nulls":12},"Cotação 1","Cotação 2","Cotação 3","Cotação 4","Cotação 5"]
[{"$nulls":12},549,399,335]
[]
[{"$nulls":14},"CV=",{"$f":"STDEVA(M6:Q6)/AVERAGE(M6:Q6)","v":0.25684094594608659}]
{"$rows_left_out":27}
{"sheet":"Serv Graficos","index":14,"n_rows":42,"n_cols":9,"rows_kept":42,"cut":false,"hidden":false,"merged":[[27,0,27,3],[2,0,2,4],[14,0,14,4],[19,0,19,3],[21,1,21,2],[22,0,22,4],[37,0,37,4],[38,0,38,4],[39,0,39,4],[40,0,40,4],[41,0,41,4]]}
[]
[]
["Serviços Gráficos"]
[]
["Serviço",null,"Referencia","Código","Valor",null,null,"1 Vol Impressão Rel Final"]
["Impressão colorida",null,"SETOP/COMPOSIÇÃO","CO-2019",1.8,null,"Preto",{"$f":"C17*E7","v":91.35}]
["Impressão preta",null,"SETOP/COMPOSIÇÃO","CO-2017",0.28999999999999998,null,"Colorida",{"$f":"D17*E6","v":63}]
["Encadernação até 350 fls.",null,"EMBASA/COMPOSIÇÃO","30.02.30 / 30.02.27",{"$f":"20+7.2","v":27.2},"Foi considerado a soma de 2 composições, com encadernação de 250 e 100 folhas","Encader",{"$f":"E8","v":27.2}]
{"$rows_left_out":35}
{"sheet":"CPU-VEICULO_PickUp","index":15,"n_rows":61,"n_cols":33,"rows_kept":61,"cut":false,"hidden":false,"merged":[[52,19,52,26],[4,0,4,2],[6,0,6,2],[7,0,7,1],[7,4,7,7],[8,0,8,2],[52,8,52,18]]}
[]
[]
[]
[]
["Composição de Preços de Locação de Veículo tipo pick-up"]
[null,"Data de atualização:","2024-01-22",null,"CV","Média","Mediana",null,null,null,"CV","Média","Mediana",{"$nulls":8},"CV","Média","Mediana"]
["CODEVASF ",null,null,null,{"$f":"_xlfn.STDEV.S(E10:H10)/AVERAGE(E10:H10)","v":9.2667922664402616E-2},{"$f":"AVERAGE(E10:H10)","v":179935.5},{"$f":"MEDIAN(E10:H10)","v":184702},null,null,null,{"$f":"_xlfn.STDEV.S(L9:S9)/AVERAGE(L9:S9)","v":0.20952494145854728},{"$f":"AVERAGE(L9:S9)","v":31.095714285714287},{"$f":"MEDIAN(L9:S9)","v":30.16},{"$nulls":8},{"$f":"_xlfn.STDEV.S(W9:AD9)/AVERAGE(W9:AD9)","v":0.13240988535259646},{"$f":"AVERAGE(W9:AD9)","v":430.60093749999999},{"$f":"MEDIAN(W9:AD9)","v":437.31624999999997}]
["OBS:               Preço sem BDI e sem motorista                                                                   BDI=",null,null,null,"Preço FIPE ",{"$nulls":4},"PRODUTO ","MENOR (MÉDIA, MEDIANA)","COT. 1","COT. 2","COT. 3","COT. 4","COT. 5","COT. 6","COT. 7","COT. 8",null,"PRODUTO","MENOR (MÉDIA, MEDIANA)","COT. 1","COT. 2","COT. 3","COT. 4","COT. 5","COT. 6","COT. 7","COT. 8"]
{"$rows_left_out":54}
{"sheet":"CPU-VEICULO_Leve","index":16,"n_rows":85,"n_cols":33,"rows_kept":85,"cut":false,"hidden":false,"merged":[[49,21,49,28],[1,0,1,3],[3,0,3,3],[4,0,4,2],[4,5,4,8],[5,0,5,3],[49,9,49,20]]}
[]
["Composição de Preços de Locação de Veículos"]
[null,"2023-08-23","Data de atualização:","2024-01-22",null,"CV","Média","Mediana",null,null,null,"CV","Média","Mediana",{"$nulls":9},"CV","Média","Mediana"]
["CODEVASF ",{"$nulls":4},{"$f":"_xlfn.STDEV.S(F7:I7)/AVERAGE(F7:I7)","v":0.13771993420696838},{"$f":"AVERAGE(F7:I7)","v":71853.75},{"$f":"MEDIAN(F7:I7)","v":71738},null,null,null,{"$f":"_xlfn.STDEV.S(M6:U6)/AVERAGE(M6:U6)","v":0.13240272079250945},{"$f":"AVERAGE(M6:U6)","v":29.678888888888892},{"$f":"MEDIAN(M6:U6)","v":28.9},{"$nulls":9},{"$f":"_xlfn.STDEV.S(Y6:AG6)/AVERAGE(Y6:AG6)","v":0.15996868103040221},{"$f":"AVERAGE(Y6:AG6)","v":293.46277777777783},{"$f":"MEDIAN(Y6:AG6)","v":289.99}]
["OBS:               Preço sem BDI e sem motorista                                                           BDI=",{"$nulls":4},"Preço FIPE",{"$nulls":4},"PRODUTO","MENOR","COT. 1","COT. 2","COT. 3","COT. 4","COT. 5","COT. 6","COT. 7","COT. 8","COT. 9",null,"PRODUTO ","MENOR","COT. 1","COT. 2","COT. 3","COT. 4","COT. 5","COT. 6","COT. 7","COT. 8","COT. 9"]
["Veículo Leve 1.0 T. Flex 12V 5p",{"$nulls":4},"Renault Kwid Zen 1.0","Hyndai HB20 Sense 1.0 ","ONIX HATCH LT 1.0 12V Flex 5p Mec.","MOBI TREKKING 1.0 Flex 5p.",null,"LUBRIFICANTE 15W40",{"$f":"SMALL(M4:N4,1)","v":28.9},26.12,34.5,23.28,28,34.9,33.450000000000003,28.35,28.9,29.61,null,"Pneu 185/65 R14",{"$f":"SMALL(Y4:Z4,1)","v":289.99},369.9,{"$f":"1440.2/4","v":360.05},229,254.15,{"$f":"1238.72/4","v":309.68},263.2,289.99,293.23,{"$f":"1087.86/4","v":271.96499999999997}]
[null,null,"Custo Mensal (R$):",{"$f":"D48","v":3358.807213121765},null,60247,74811,83692,68665,null,null,""]
[null,null,"Custo Diário (R$):",{"$f":"D7/30","v":111.96024043739217}]
{"$rows_left_out":56}
{"sheet":"CPU HOSPEDAGEM","index":17,"n_rows":19,"n_cols":4,"rows_kept":19,"cut":false,"hidden":false,"merged":[[2,1,2,2]]}
[]
[null,"Engenharia Consultiva da Codevasf"]
[null,"CPU - HOSPEDAGEM EQUIPE DE CAMPO (4 PESSOAS/MÊS)",null,"Código/Referencia"]
[null,"ALUGUEL ",3074.56,"F020003334/EMBASA insumo"]
[null," Aquisição de Mobiliário",{"$f":"42.41*C16","v":169.64},"B8954/DNIT"]
[null,"Material de limpeza e diarista",{"$f":"125.8+(123*8)","v":1109.8},"10563/ORSE - E200300131/EMBASA"]
[null,"manutenção da casa alugada - Serviços Gerais/Vigia ",2841.56,"41096/SINAPI"]
[null,"Energia ",180,"10555/ORSE"]
{"$rows_left_out":12}
{"sheet":"COT. VANT","index":18,"n_rows":17,"n_cols":10,"rows_kept":17,"cut":false,"hidden":true,"merged":[[1,0,1,9],[7,0,9,0],[7,1,7,5],[8,1,8,5],[9,1,9,5]]}
[]
["COTAÇÃO ORÇAMENTÁRIA DE LEVANTAMENTO PLANIALTIMÉTRICO POR MEIO DE VANT PARA ÁREA NA CIDADE DE PINDARÉ-MIRIM-MA"]
["MÊS/ANO DE REFERÊNCIA ","ÁREA DO PROJETO [ha]","EMPRESA","LOCALIDADE","WEBSITE","CONTATO","AVALIAÇÃO TÉCNICA DA PROPOSTA","PREÇO","PREÇO UNITÁRIO","RELAÇÃO CUSTO-BENEFÍCIO"]
["2022-09-01",50,"DRONES SOLUTION","SALVADOR-BA","http://www.dronessolution.com.br/","contato@dronessolution.com.br","SATISFATÓRIA",9800,{"$f":"(H4/B4)","v":196},"A"]
["2022-09-01",50,"ERG","BELO HORIZONTE-MG","http://www.ergbh.com.br/","comercial@ergbh.com.br","SATISFATÓRIA",13240.5,{"$f":"(H5/B5)","v":264.81},"B"]
["2022-09-01",50,"CEPEMAR","VITÓRIA-ES","http://www.cepemar.com.br/","comercial@cepemar.com.br","SATISFATÓRIA",63000,1260,"C"]
[]
["Observações","  1. Na cotação acima já estão iclusos: Planejamento Aerotogramétrico, Voo Aerotoforamétrico, Apoio de Campo, Aerotriangulação, Restituição, MDT, MDS, Ortofotos, Edição/Revisão e Entrega Final.",{"$nulls":4},"CV com todos valores:",{"$f":"STDEVA(H4:H6)/AVERAGE(H4:H6)","v":1.0380549324194583}]
{"$rows_left_out":9}