{"text_format":"2","workbook":"xlsx","n_sheets":6,"sheets":["Planilha Orçamentária","Fator Ka","Fator Kc","Encargos Sociais","Cronograma","MDO_DNIT"],"not_rendered":{"charts":0,"images":3,"macros":0,"external_links":1,"defined_names":1381,"comments":0,"pivot_tables":0},"unopened":[],"bounds":{"document_bytes":16777216,"sheet_cells":100000,"run_cost":"one","rows_first":2000,"rows_last":500,"rows_between":2000,"halvings":0,"cell_chars":16384,"cell_head_chars":4096},"cells_cut":0,"cells_raw":0,"read":"whole","date_system":"1900"}

{"sheet":"Planilha Orçamentária","index":0,"n_rows":25,"n_cols":13,"rows_kept":25,"cut":false,"hidden":false,"merged":[[8,1,8,2],[24,1,24,3],[5,1,6,3],[5,5,5,6],[6,4,6,6],[7,1,7,2],[7,4,7,6],[0,0,0,9],[1,0,1,9],[2,0,2,9],[3,0,3,9],[4,5,4,6]]}
["Ministério da Integração e do Desenvolvimento Regional"]
["Companhia de desenvolvimento dos Vales do São Francisco e do Parnaíba"]
[]
["PLANILHA ORÇAMENTÁRIA - ORÇAMENTO NÃO DESONERADO"]
["CONTRATO:",{"$nulls":8},"Bancos de dados:"]
["PROJETO:","CADERNOS DE CARACTERIZAÇÃO GEOGRÁFICA DOS ESTADOS E DISTRITO FEDERAL NA ÁREA DE ATUAÇÃO DA CODEVASF – NA SEDE DA COMPANHIA EM BRASÍLIA - DF",{"$nulls":7},"Tabela Eng Consultiva DNIT"]
[{"$nulls":4},"Encargos sociais - Horistas:",null,null,null,{"$f":"'Encargos Sociais'!E46","v":1.1014000000000002},"2024-01-01"]
["DATA BASE:","2024-07-01",null,null,"Encargos sociais - Mensalista:",null,null,null,{"$f":"'Encargos Sociais'!F46","v":0.70040000000000002},"-"]
["ITEM","REFERÊNCIA",null,"DESCRIÇÃO","UNID.","QUANT.","CUSTO UNITÁRIO","FatorK","PREÇO UNITÁRIO ","PREÇO TOTAL","TIPO de BDI","CLASSIF","Encargos Comp e Adicionais"]
[null,"FONTE","CÓDIGO"]
[1,null,null,"Mão de Obra",{"$nulls":5},{"$f":"SUM(J12:J19)","v":1946058.0100000002},null,"ss"]
["1.1","DNIT","P8185","Coordenador Geral – jornada 40 hrs","mês",29,9831.81,{"$f":"'Fator Ka'!D35","v":2.1311548236000006},{"$f":"ROUND(H12*G12,2)","v":20953.11},{"$f":"ROUND(F12*I12,2)","v":607640.18999999994},"serv","s",{"$f":"VLOOKUP(C12,MDO_DNIT!B4:AA126,26,0)","v":1030.5}]
["1.2","DNIT","P8184","Geógrafo pleno – jornada 40 hrs","mês",28,5123.87,{"$f":"'Fator Ka'!D35","v":2.1311548236000006},10919.76,305753.28000000003,"serv","s",{"$f":"VLOOKUP(C13,MDO_DNIT!B5:AA127,26,0)","v":1030.5}]
["1.3","DNIT","P8184","Geógrafo pleno – jornada 40 hrs","mês",29,5123.87,{"$f":"'Fator Ka'!D35","v":2.1311548236000006},10919.76,316673.03999999998,"serv","s",{"$f":"VLOOKUP(C14,MDO_DNIT!B6:AA128,26,0)","v":1030.5}]
["1.4","DNIT","P8184","Analista Geo – jornada 40 hrs","mês",26,5123.87,{"$f":"'Fator Ka'!D35","v":2.1311548236000006},10919.76,283913.76,"serv","s",{"$f":"VLOOKUP(C15,MDO_DNIT!B7:AA129,26,0)","v":1030.5}]
["1.5","DNIT","P8168","Bibliotecário – jornada 40 hrs","mês",19,3170.69,{"$f":"'Fator Ka'!D35","v":2.1311548236000006},6757.23,128387.37,"serv","s",{"$f":"VLOOKUP(C16,MDO_DNIT!B8:AA130,26,0)","v":1034.2999999999997}]
["1.6","DNIT","P8135","Revisor de texto – jornada 40 hrs","mês",19,2604.7800000000002,{"$f":"'Fator Ka'!D35","v":2.1311548236000006},5551.19,105472.61,"serv","s",{"$f":"VLOOKUP(C17,MDO_DNIT!B9:AA131,26,0)","v":1068.6199999999999}]
["1.7","DNIT","P8159","Designer gráfico – jornada 40 hrs","mês",16,4761.5,{"$f":"'Fator Ka'!D35","v":2.1311548236000006},10147.49,162359.84,"serv","s",{"$f":"VLOOKUP(C18,MDO_DNIT!B10:AA132,26,0)","v":1005.8799999999992}]
["1.8*","DNIT",null,"Encargos Comp. e Adicionais","mês",29,{"$f":"AVERAGE(M12:M18)","v":1032.9714285714283},{"$f":"'Fator Kc'!E16","v":1.197009},1236.48,35857.919999999998,"serv","s"]
[]
[null,null,null,"TOTAL sem BDI e Encargos Sociais :",{"$nulls":5},{"$f":"SUMPRODUCT(F12:F19,G12:G19)","v":926277.80142857134}]
[null,null,null,"BDI e Encargos Sociais:",{"$nulls":5},{"$f":"J23-J21","v":1019780.2085714289}]
[null,null,null,"TOTAL COM BDI:",{"$nulls":5},{"$f":"SUM(J12:J19)","v":1946058.0100000002}]
[]
[null,"*Conforme instrução do sr. Gerente de Custos (AG/GCT) foi mantido o item 1.8 que utiliza como referência a planilha do DNIT, entretanto, para este item se manter funcional, foi necessária  a manutenção dos códigos de referência, embora não correspondam à formação profissional, buscou-se utilizar códigos com valores próximos ao custo unitário."]

{"sheet":"Fator Ka","index":1,"n_rows":40,"n_cols":4,"rows_kept":40,"cut":false,"hidden":false,"merged":[[30,1,30,2],[33,1,33,2],[34,1,34,2],[0,0,0,3],[4,0,4,1],[5,1,5,2],[16,1,16,2],[24,1,24,2]]}
["DETALHAMENTO DOS ENCARGOS SOCIAIS: Ka"]
["NOME DA CONSULTORA:"]
[]
["PROJETO:",null,"CONTRATATANTE:"]
["CADERNOS DE CARACTERIZAÇÃO GEOGRÁFICA DOS ESTADOS E DISTRITO FEDERAL NA ÁREA DE ATUAÇÃO DA CODEVASF – NA SEDE DA COMPANHIA EM BRASÍLIA – DF",null,"CODEVASF (SEDE)","Não Desonerado"]
["Cod.","DESCRIÇÃO",null,"%"]
["A","ENCARGOS SOCIAIS BÁSICOS",null,{"$f":"SUM(D8:D16)","v":0.37800000000000006}]
["A1","INSS",null,0.2]
["A2","SESI",null,1.4999999999999999E-2]
["A3","SENAI",null,0.01]
["A4","INCRA",null,2E-3]
["A5","SEBRAE",null,6.0000000000000001E-3]
["A6","Salário Educação",null,2.5000000000000001E-2]
["A7","Seguro Contra Acidentes de Trabalho",null,0.03]
["A8","FGTS",null,0.08]
["A9","SECONCI",null,0.01]
["B","ENCARGOS SOCIAIS QUE RECEBEM INCIDÊNCIA DE \"A\"",null,{"$f":"SUM(D18:D24)","v":0.16239999999999999}]
["B3","Auxílio Enfermidade",null,6.4000000000000003E-3]
["B4","13º Salário",null,8.3299999999999999E-2]
["B5","Licença Paternidade",null,4.0000000000000002E-4]
["B6","Faltas Justificadas",null,5.5999999999999999E-3]
["B8","Auxílio Acidente de Trabalho",null,8.0000000000000004E-4]
["B9","Férias Gozadas",null,6.5600000000000006E-2]
["B10","Salário Maternidade",null,2.9999999999999997E-4]
["C","ENCARGOS SOCIAIS QUE NÃO RECEBEM INCIDÊNCIA DE \"A\"",null,{"$f":"SUM(D26:D30)","v":9.5699999999999993E-2}]
["C1","Aviso Prévio Indenizado",null,3.2399999999999998E-2]
["C2","Aviso Prévio Trabalhado",null,8.0000000000000004E-4]
["C3","Férias Indenizadas",null,3.5900000000000001E-2]
["C4","Depósito Rescisão Sem Justa Causa",null,2.3900000000000001E-2]
["C5","Indenização Adicional",null,2.7000000000000001E-3]
{"$rows_left_out":11}
{"sheet":"Fator Kc","index":2,"n_rows":29,"n_cols":6,"rows_kept":29,"cut":false,"hidden":false,"merged":[[24,0,24,4],[25,0,25,4],[26,0,26,4],[27,0,27,4],[28,0,28,4],[19,0,19,4],[20,0,20,4],[21,0,21,4],[22,0,22,4],[23,0,23,4],[14,1,14,3],[15,1,15,3],[16,0,16,4],[17,0,17,4],[18,0,18,4],[9,1,9,2],[10,1,10,3],[11,1,11,3],[12,1,12,3],[13,1,13,3],[5,1,5,2],[5,5,7,5],[6,1,6,2],[7,1,7,2],[8,1,8,2],[0,0,0,4],[1,0,1,4],[2,0,2,4],[3,2,3,4],[4,0,4,1],[4,2,4,4]]}
["DESPESAS FISCAIS E CUSTOS DIVERSOS: Kc"]
["NOME DA CONSULTORA:"]
[]
["PROJETO:",null,"CONTRATANTE:"]
["SERVIÇOS DE APOIO À UNIDADE DE GESTÃO E SEGURANÇA DE BARRAGENS DA CODEVASF – NA SEDE DA COMPANHIA EM BRASÍLIA - DF",null,"CODEVASF (SEDE)"]
["Cod","DESCRIÇÃO1",null,"% preço2","% custo4","Recomendação TCU: Redução de 20% da alíquota do PIS e COFINS"]
["K4","TAXAS E IMPOSTOS",null,0.124,{"$f":"SUM(E8:E10)","v":0.1187}]
["K4.1","ISS",null,0.03,{"$f":"ROUND((1/(1-$D$7))*D8,4)","v":3.4200000000000001E-2}]
["K4.2","PIS3",null,1.32E-2,{"$f":"ROUND((1/(1-$D$7))*D9,4)","v":1.5100000000000001E-2},"(80% de 1,65%)"]
["K4.3","COFINS3",null,6.08E-2,{"$f":"ROUND((1/(1-$D$7))*D10,4)","v":6.9400000000000003E-2},"(80% de 7,60%)"]
["K3","REMUNERAÇÃO DA EMPRESA (LUCRO)",null,null,7.0000000000000007E-2]
["K2","CUSTOS DA ADMINISTRAÇÃO CENTRAL",null,null,{"$f":"SUM(E13:E15)","v":0.08}]
["K2.1","Custos da administração central da empresa (diretoria, pessoal técnico de apoio e pessoal administrativo não diretamente vinculado à prestação dos serviços)",null,null,0.04]
["K2.2","Outras despesas que afetam o custo de produção como treinamento, biblioteca, programa de qualidade, programa de benefícios, auditoria interna e externa",null,null,0.02]
["K2.3","Despesas fixas e variaveis com patrimônio, aluguéis, comunicação, manutenção e transporte não diretamente relacionados com o custo direto dos serviços",null,null,0.02]
["Kc","TAXA RESSARCIMENTO DE DESPESAS SOBRE CUSTOS DIVERSOS",null,null,{"$f":"(1+E11)*(1+E7)","v":1.197009}]
["Observação:"]
["1 - RELACIONAR OS CUSTOS DE ADMINISTRAÇÃO COM RESPECTIVOS PERCENTUAIS INCIDENTES NA MÃO -DE-OBRA"]
["1 - DISCRIMINAR OS TRIBUTOS QUE INCIDEM SOBRE OS CUSTOS DA PRESTAÇÃO DOS SERVIÇOS"]
["2 - K4 = INDICAR % DE CADA TRIBUTO E A SOMA DOS MESMOS"]
["3 - PIS e COFINS, Regime de Incidencia Acumulativa (0,65% e 3,00% - sem percentual de desconto) ou em Regime de Incidencia Não Acumulativa (1,65% e 7,60% - aplicável percentual de desconto) de acordo com a forma de apuração do lucro no IRPJ. APRESENTAR COMPROVANTES de aproveitamento de créditos tributários dos últimos 12 meses em caso de aplicação de \"percentual de desconto\"."]
["4 - AS DESPESAS FISCAIS (K4) INCIDEM SOBRE O TOTAL DA FATURA E NÃO SOBRE OS CUSTOS INCORRIDOS, DEVENDO SER CALCULADO O K4' AP"]
["K4' = { [ 1 / ( 1 - K4) ] - 1 } x 100"]
["K4' = { [ 1 / ( 1 - 0,124 ) ] - 1 } x 100"]
["Kc - Taxa de Ressarcimento de Despesas sobre Custos Diversos"]
["Kc = (1 + K3) x (1 + K4)"]
["K2 - Incide sobre o Custo Total (CT) da Mão de Obra (MO* = MO1 + MO2)"]
["K3 - Incide sobre o Custo Total (CT) Mão de Obra com encargos (MO1 x Ka ou MO2 x Kb), demais Custos e Custos da Administração Central (K2)"]
["K4 -  Incide sobre o Custo Total (CT) Mão de Obra com encargos (MO1 x Ka ou MO2 x Kb), demais Custos, e Custos da Administração Central (K2) e Lucro (K3)"]

{"sheet":"Encargos Sociais","index":3,"n_rows":47,"n_cols":6,"rows_kept":47,"cut":false,"hidden":false,"merged":[[46,0,46,1],[11,0,11,5],[22,0,22,5],[34,0,34,5],[41,0,41,5],[45,0,45,1],[5,1,5,2],[6,1,6,2],[7,0,7,5],[8,0,8,5],[9,0,10,0],[9,1,10,1],[9,2,9,3],[9,4,9,5],[0,0,0,5],[1,0,1,5],[2,0,2,5],[3,0,3,5],[4,1,4,2]]}
["Ministério da Integração e do Desenvolvimento Regional"]
["Companhia de Desenvolvimento dos Vales do São Francisco e do Parnaíba"]
[{"$f":"'Planilha Orçamentária'!A3:J3","v":0}]
["COMPOSIÇÃO DE ENCARGOS SOCIAIS SOBRE A MÃO DE OBRA"]
["CONTRATO:",{"$f":"'Planilha Orçamentária'!B5:D5","v":0}]
["PROJETO:",{"$f":"'Planilha Orçamentária'!B6","v":"CADERNOS DE CARACTERIZAÇÃO GEOGRÁFICA DOS ESTADOS E DISTRITO FEDERAL NA ÁREA DE ATUAÇÃO DA CODEVASF – NA SEDE DA COMPANHIA EM BRASÍLIA - DF"}]
["DATA BASE:",{"$f":"'Planilha Orçamentária'!B8:C8","v":"2024-07-01"}]
["Encargos Sociais – Distrito Federal     VIGÊNCIA A PARTIR DE  12/2023"]
["ENCARGOS SOCIAIS SOBRE A MÃO DE OBRA"]
["CÓDIGO","DESCRIÇÃO","COM DESONERAÇÃO",null,"SEM DESONERAÇÃO"]
[null,null,"HORISTA\n%","MENSALISTA\n%","HORISTA\n%","MENSALISTA\n%"]
["GRUPO A"]
["A1","INSS",0,0,0.2,0.2]
["A2","SESI",1.4999999999999999E-2,1.4999999999999999E-2,1.4999999999999999E-2,1.4999999999999999E-2]
["A3","SENAI",0.01,0.01,0.01,0.01]
["A4","INCRA",2E-3,2E-3,2E-3,2E-3]
["A5","SEBRAE",6.0000000000000001E-3,6.0000000000000001E-3,6.0000000000000001E-3,6.0000000000000001E-3]
["A6","Salário Educação",2.5000000000000001E-2,2.5000000000000001E-2,2.5000000000000001E-2,2.5000000000000001E-2]
["A7","Seguro Contra Acidentes de Trabalho",0.03,0.03,0.03,0.03]
["A8","FGTS",0.08,0.08,0.08,0.08]
["A9","SECONCI",0.01,0.01,0.01,0.01]
["A","Total",{"$f":"SUM(C13:C21)","v":0.17799999999999999},{"$f":"SUM(D13:D21)","v":0.17799999999999999},{"$f":"SUM(E13:E21)","v":0.37800000000000006},{"$f":"SUM(F13:F21)","v":0.37800000000000006}]
["GRUPO B"]
["B1","Repouso Semanal Remunerado",0.17730000000000001,"Não incide",0.17730000000000001,"Não incide"]
["B2","Feriados",3.4000000000000002E-2,"Não incide",3.4000000000000002E-2,"Não incide"]
["B3","Auxílio - Enfermidade",8.3000000000000001E-3,6.4000000000000003E-3,8.3000000000000001E-3,6.4000000000000003E-3]
["B4","13º Salário",0.1072,8.3299999999999999E-2,0.1072,8.3299999999999999E-2]
["B5","Licença Paternidade",5.9999999999999995E-4,4.0000000000000002E-4,5.9999999999999995E-4,4.0000000000000002E-4]
["B6","Faltas Justificadas",7.1000000000000004E-3,5.5999999999999999E-3,7.1000000000000004E-3,5.5999999999999999E-3]
["B7","Dias de Chuvas",1.2699999999999999E-2,"Não incide",1.2699999999999999E-2,"Não incide"]
{"$rows_left_out":18}
{"sheet":"Cronograma","index":4,"n_rows":15,"n_cols":37,"rows_kept":15,"cut":false,"hidden":false,"merged":[[9,0,10,0],[9,1,10,1],[0,0,0,35],[1,0,1,35],[2,0,2,35],[3,0,3,35],[7,0,8,0],[7,1,8,1],[7,2,8,2],[7,3,7,34],[7,35,8,35]]}
["Ministério da Integração e do Desenvolvimento Regional"]
["Companhia de Desenvolvimento dos Vales do São Francisco e do Parnaíba"]
[{"$f":"'[1]Planilha Orçamentária'!A3:I3","v":0}]
["CRONOGRAMA FÍSICO-FINANCEIRO NÃO DESONERADO"]
["CONTRATO:",{"$f":"'Planilha Orçamentária'!B5:D5","v":0}]
["PROJETO:",{"$f":"'Planilha Orçamentária'!B6","v":"CADERNOS DE CARACTERIZAÇÃO GEOGRÁFICA DOS ESTADOS E DISTRITO FEDERAL NA ÁREA DE ATUAÇÃO DA CODEVASF – NA SEDE DA COMPANHIA EM BRASÍLIA - DF"}]
["DATA BASE:",{"$f":"'Planilha Orçamentária'!B8:C8","v":"2024-07-01"}]
["ITEM","DESCRIÇÃO","TOTAL","MESES",{"$nulls":31},"TOTAL"]
[null,null,null,1,2,3,4,5,6,7,8,9,10,11,12,13,14,15,16,17,18,19,20,21,22,23,24,25,26,27,28,29,30,31,32]
[1,{"$f":"'Planilha Orçamentária'!D11","v":"Mão de Obra"},{"$f":"'Planilha Orçamentária'!J11","v":1946058.0100000002},{"$f":"$C10*D11","v":0},121628.62562500002,0,121628.62562500002,0,121628.62562500002,0,121628.62562500002,0,121628.62562500002,0,121628.62562500002,0,121628.62562500002,0,121628.62562500002,0,121628.62562500002,0,121628.62562500002,0,121628.62562500002,0,121628.62562500002,0,121628.62562500002,0,121628.62562500002,0,121628.62562500002,0,121628.62562500002,{"$f":"SUM(D10:AI10)","v":1946058.0100000007},"R$"]
[null,null,{"$f":"C10/C10","v":1},{"$f":"D14","v":0},6.25E-2,0,6.25E-2,0,6.25E-2,0,6.25E-2,0,6.25E-2,0,6.25E-2,0,6.25E-2,0,6.25E-2,0,6.25E-2,0,6.25E-2,0,6.25E-2,0,6.25E-2,0,6.25E-2,0,6.25E-2,0,6.25E-2,0,6.25E-2,{"$f":"SUM(D11:AI11)","v":1},"%"]
[null,"VALOR TOTAL:",{"$f":"SUMIF($AK$10:$AK$11,\"R$\",C$10:C$11)","v":1946058.0100000002},0,121628.62562500002,0,121628.62562500002,0,121628.62562500002,0,121628.62562500002,0,121628.62562500002,0,121628.62562500002,0,121628.62562500002,0,121628.62562500002,0,121628.62562500002,0,121628.62562500002,0,121628.62562500002,0,121628.62562500002,0,121628.62562500002,0,121628.62562500002,0,121628.62562500002,0,121628.62562500002,1946058.0100000007]
[null,"VALOR ACUMULADO:",null,{"$f":"D12","v":0},{"$f":"E12+D13","v":121628.62562500002},121628.62562500002,243257.25125000003,243257.25125000003,364885.87687500007,364885.87687500007,486514.50250000006,486514.50250000006,608143.12812500005,608143.12812500005,729771.75375000003,729771.75375000003,851400.37937500002,851400.37937500002,973029.005,973029.005,1094657.630625,1094657.630625,1216286.2562500001,1216286.2562500001,1337914.8818750002,1337914.8818750002,1459543.5075000003,1459543.5075000003,1581172.1331250004,1581172.1331250004,1702800.7587500005,1702800.7587500005,1824429.3843750006,1824429.3843750006,1946058.0100000007,{"$f":"SUMIF($AK$10:$AK$11,\"R$\",AJ$10:AJ$11)","v":1946058.0100000007}]
[null,"FÍSICO PARCIAL:",null,0,6.25E-2,0,6.25E-2,0,6.25E-2,0,6.25E-2,0,6.25E-2,0,6.25E-2,0,6.25E-2,0,6.25E-2,0,6.25E-2,0,6.25E-2,0,6.25E-2,0,6.25E-2,0,6.25E-2,0,6.25E-2,0,6.25E-2,0,6.25E-2,{"$f":"AJ12/$C$12","v":1.0000000000000002}]
[null,"AVANÇO FÍSICO:",null,{"$f":"D14","v":0},{"$f":"E14+D15","v":6.25E-2},6.25E-2,0.125,0.125,0.1875,0.1875,0.25,0.25,0.3125,0.3125,0.375,0.375,0.4375,0.4375,0.5,0.5,0.5625,0.5625,0.625,0.625,0.6875,0.6875,0.75,0.75,0.8125,0.8125,0.875,0.875,0.9375,0.9375,1,{"$f":"AI15","v":1}]

{"sheet":"MDO_DNIT","index":5,"n_rows":112,"n_cols":27,"rows_kept":112,"cut":false,"hidden":false,"merged":[[0,7,0,16],[0,17,0,22],[0,23,1,24],[0,25,1,25],[0,26,1,26],[1,7,1,8],[1,9,1,10],[1,11,1,12],[1,13,1,14],[1,15,1,16],[1,17,1,18],[1,19,1,20],[1,21,1,22],[0,1,2,1],[0,2,2,2],[0,3,2,3],[0,4,1,4],[0,5,1,6]]}
[null,"Código","Categoria","Unid.","Salário","Encargos Sociais",null,"Encargos Complementares",{"$nulls":9},"Encargos Adicionais",{"$nulls":5},"Encargos Totais",null,"Valor Total","Encargos Adicionais e Complementares"]
[{"$nulls":7},"Alimentação",null,"EPI",null,"Ferramenta",null,"Transporte",null,"Exame Ocupacional",null,"Cesta Básica",null,"Assistência Médica",null,"Seguro de Vida"]
[{"$nulls":4},"R$","%","R$","%","R$","%","R$","%","R$","%","R$","%","R$","%","R$","%","R$","%","R$","%","R$","R$","R$"]
[null,"Profissionais mensalistas",{"$nulls":24},{"$f":"Z4-G4-E4","v":0}]
[null,"P8001","Advogado júnior","mês",4530.07,0.79290000000000005,3591.89,0.1552,702.89,5.4999999999999997E-3,24.99,0,0,0,0,5.9999999999999995E-4,2.83,0,0,6.3899999999999998E-2,289.39,2.2000000000000001E-3,9.98,1.0203,4621.9799999999996,9152.0499999999993,1030.0900000000001]
[null,"P8002","Advogado pleno","mês",6040.1,0.79290000000000005,4789.1899999999996,0.1164,702.89,4.1000000000000003E-3,24.99,0,0,0,0,5.0000000000000001E-4,2.83,0,0,4.7899999999999998E-2,289.39,1.6999999999999999E-3,9.98,0.96340000000000003,5819.27,11859.37,1030.0800000000008]
[null,"P8003","Advogado sênior","mês",11150.15,0.79290000000000005,8840.9500000000007,6.3E-2,702.89,2.2000000000000001E-3,24.99,0,0,0,0,2.9999999999999997E-4,2.83,0,0,2.5999999999999999E-2,289.39,8.9999999999999998E-4,9.98,0.88529999999999998,9871.0300000000007,21021.18,1030.08]
[null,"P8007","Analista de desenvolvimento de sistemas júnior","mês",4761.5,0.79600000000000004,3790.16,0.14760000000000001,702.89,0,0,0,0,0,0,8.0000000000000004E-4,3.69,0,0,6.08E-2,289.39,2.0999999999999999E-3,9.98,1.0073000000000001,4796.1099999999997,9557.61,1005.9500000000007]
[null,"P8008","Analista de desenvolvimento de sistemas pleno","mês",5587.15,0.79600000000000004,4447.37,0.1258,702.89,0,0,0,0,0,0,6.9999999999999999E-4,3.69,0,0,5.1799999999999999E-2,289.39,1.8E-3,9.98,0.97599999999999998,5453.33,11040.48,1005.96]
[null,"P8009","Analista de desenvolvimento de sistemas sênior","mês",9769.36,0.79600000000000004,7776.41,7.1900000000000006E-2,702.89,0,0,0,0,0,0,4.0000000000000002E-4,3.69,0,0,2.9600000000000001E-2,289.39,1E-3,9.98,0.89900000000000002,8782.3700000000008,18551.73,1005.9599999999991]
[null,"P8013","Arquiteto júnior","mês",12002,0.79349999999999998,9523.59,5.8599999999999999E-2,702.89,2.0999999999999999E-3,24.99,0,0,0,0,2.0000000000000001E-4,2.66,0,0,2.41E-2,289.39,8.0000000000000004E-4,9.98,0.87929999999999997,10553.5,22555.5,1029.9099999999999]
[null,"P8014","Arquiteto pleno","mês",12275.9,0.79349999999999998,9740.92,5.7299999999999997E-2,702.89,2E-3,24.99,0,0,0,0,2.0000000000000001E-4,2.66,0,0,2.3599999999999999E-2,289.39,8.0000000000000004E-4,9.98,0.87739999999999996,10770.84,23046.73,1029.9099999999999]
[null,"P8015","Arquiteto sênior","mês",14951.37,0.79349999999999998,11863.91,4.7E-2,702.89,1.6999999999999999E-3,24.99,0,0,0,0,2.0000000000000001E-4,2.66,0,0,1.9400000000000001E-2,289.39,6.9999999999999999E-4,9.98,0.86240000000000006,12893.82,27845.18,1029.8999999999996]
[null,"P8019","Assistente social júnior","mês",3183.32,0.80200000000000005,2553.0300000000002,0.2208,702.89,7.7999999999999996E-3,24.99,0,0,8.8000000000000005E-3,28.03,1.4E-3,4.51,0,0,9.0899999999999995E-2,289.39,3.0999999999999999E-3,9.98,1.1349,3612.82,6796.14,1059.7900000000004]
[null,"P8020","Assistente social pleno","mês",4244.43,0.80200000000000005,3404.03,0.1656,702.89,5.8999999999999999E-3,24.99,0,0,0,0,1.1000000000000001E-3,4.51,0,0,6.8199999999999997E-2,289.39,2.3999999999999998E-3,9.98,1.0450999999999999,4435.79,8680.23,1031.7699999999986]
[null,"P8021","Assistente social sênior","mês",7054.37,0.80200000000000005,5657.6,9.9599999999999994E-2,702.89,3.5000000000000001E-3,24.99,0,0,0,0,5.9999999999999995E-4,4.51,0,0,4.1000000000000002E-2,289.39,1.4E-3,9.98,0.94830000000000003,6689.36,13743.73,1031.7599999999993]
[null,"P8025","Auxiliar","mês",1554.37,0.81469999999999998,1266.3399999999999,0.45219999999999999,702.89,1.9599999999999999E-2,30.42,1E-3,1.56,8.09E-2,125.77,4.0000000000000001E-3,6.15,0,0,0.1862,289.39,6.4000000000000003E-3,9.98,1.5649,2432.5100000000002,3986.88,1166.17]
[null,"P8026","Auxiliar administrativo","mês",1842.36,0.80179999999999996,1477.2,0.38150000000000001,702.89,0,0,0,0,5.8900000000000001E-2,108.49,2E-3,3.75,0,0,0.15709999999999999,289.39,5.4000000000000003E-3,9.98,1.4067000000000001,2591.71,4434.07,1114.51]
[null,"P8027","Auxiliar de laboratório","mês",1721.24,0.80389999999999995,1383.71,0.40839999999999999,702.89,1.77E-2,30.42,1.9E-3,3.21,6.7299999999999999E-2,115.76,2.3E-3,4.01,0,0,0.1681,289.39,5.7999999999999996E-3,9.98,1.4753000000000001,2539.37,4260.6099999999997,1155.6599999999996]
[null,"P8028","Auxiliar de topografia","mês",1554.37,0.80669999999999997,1253.9100000000001,0.45219999999999999,702.89,1.9599999999999999E-2,30.42,8.9999999999999998E-4,1.36,8.09E-2,125.77,2.8E-3,4.3899999999999997,0,0,0.1862,289.39,6.4000000000000003E-3,9.98,1.5557000000000001,2418.11,3972.48,1164.1999999999998]
[null,"P8032","Biólogo júnior","mês",3234.91,0.79710000000000003,2578.5500000000002,0.21729999999999999,702.89,7.7000000000000002E-3,24.99,0,0,7.7000000000000002E-3,24.94,1.1000000000000001E-3,3.67,0,0,8.9499999999999996E-2,289.39,3.0999999999999999E-3,9.98,1.1234999999999999,3634.41,6869.32,1055.8599999999997]
[null,"P8033","Biólogo pleno","mês",4313.22,0.79710000000000003,3438.07,0.16300000000000001,702.89,5.7999999999999996E-3,24.99,0,0,0,0,8.9999999999999998E-4,3.67,0,0,6.7100000000000007E-2,289.39,2.3E-3,9.98,1.0361,4468.99,8782.2099999999991,1030.9199999999992]
[null,"P8034","Biólogo sênior","mês",7635.07,0.79710000000000003,6085.92,9.2100000000000001E-2,702.89,3.3E-3,24.99,0,0,0,0,5.0000000000000001E-4,3.67,0,0,3.7900000000000003E-2,289.39,1.2999999999999999E-3,9.98,0.93210000000000004,7116.84,14751.92,1030.9300000000003]
[null,"P8038","Chefe de escritório","mês",3358.49,0.79400000000000004,2666.64,0.20930000000000001,702.89,0,0,0,0,5.1999999999999998E-3,17.52,8.9999999999999998E-4,3.01,0,0,8.6199999999999999E-2,289.39,3.0000000000000001E-3,9.98,1.0985,3689.44,7047.93,1022.8000000000011]
[null,"P8040","Contador júnior","mês",4154.33,0.79320000000000002,3295.22,0.16919999999999999,702.89,0,0,0,0,0,0,5.9999999999999995E-4,2.57,0,0,6.9699999999999998E-2,289.39,2.3999999999999998E-3,9.98,1.0350999999999999,4300.05,8454.3799999999992,1004.8299999999999]
[null,"P8041","Contador pleno","mês",5539.11,0.79320000000000002,4393.62,0.12690000000000001,702.89,0,0,0,0,0,0,5.0000000000000001E-4,2.57,0,0,5.2200000000000003E-2,289.39,1.8E-3,9.98,0.97460000000000002,5398.45,10937.56,1004.8299999999999]
[null,"P8042","Contador sênior","mês",10620.57,0.79320000000000002,8424.24,6.6199999999999995E-2,702.89,0,0,0,0,0,0,2.0000000000000001E-4,2.57,0,0,2.7199999999999998E-2,289.39,8.9999999999999998E-4,9.98,0.88780000000000003,9429.07,20049.64,1004.8299999999999]
[null,"P8044","Coordenador ambiental ","mês",18522.37,0.79579999999999995,14740.1,3.7900000000000003E-2,702.89,1.1999999999999999E-3,22.82,0,0,0,0,2.0000000000000001E-4,3.19,0,0,1.5599999999999999E-2,289.39,5.0000000000000001E-4,9.98,0.85129999999999995,15768.37,34290.74,1028.2700000000004]
[null,"P8045","Economista júnior","mês",4742.07,0.78610000000000002,3727.74,0.1482,702.89,0,0,0,0,0,0,4.0000000000000002E-4,1.82,0,0,6.0999999999999999E-2,289.39,2.0999999999999999E-3,9.98,0.99780000000000002,4731.83,9473.9,1004.0900000000001]
[null,"P8046","Economista pleno","mês",6322.76,0.78610000000000002,4970.32,0.11119999999999999,702.89,0,0,0,0,0,0,2.9999999999999997E-4,1.82,0,0,4.58E-2,289.39,1.6000000000000001E-3,9.98,0.94489999999999996,5974.41,12297.17,1004.0900000000001]
{"$rows_left_out":82}