{"text_format":"2","workbook":"xlsx","n_sheets":15,"sheets":["Planilha Resumo ","PFP","PFP2.1_FatorKa","PFP2.2_FatorKb","PFP2.3_FatorKc","PFP3_FatorKd","CRO1_Ins-Pro","CRO2_Ins-Mes","Cronograma","CPU HOSPEDAGEM","CPU-VEICULO_PickUp","Cotação Voos","PFS-X -Equipamentos","MDO_DNIT","COT. VANT"],"not_rendered":{"charts":0,"images":27,"macros":0,"external_links":51,"defined_names":15245,"comments":4,"pivot_tables":0},"unopened":[],"bounds":{"document_bytes":16777216,"sheet_cells":100000,"run_cost":"one","rows_first":2000,"rows_last":500,"rows_between":2000,"halvings":0,"cell_chars":16384,"cell_head_chars":4096},"cells_cut":0,"cells_raw":0,"read":"whole","date_system":"1900"}

{"sheet":"Planilha Resumo ","index":0,"n_rows":42,"n_cols":10,"rows_kept":42,"cut":false,"hidden":false,"merged":[[12,0,12,3]]}
[null,null,null,"Data base : Out/2024"]
[null,null,null,"Período de referência:"]
[null,null,null,"SINAPI Jun/2024"]
[null,null,null,"ORSE Jul/2024"]
[null,null,null,"SICRO Jul/2024"]
[null,null,null,"EMBASA Jul/2024"]
[]
["Itens","Serviços","Unidade","Quantidade","Preço Unitário (R$)","Preço (R$)",null,"Hectares","10% Hectares","Hectares"]
["Item 1 - DF, GO, MT e TO","Serviços de apoio à fiscalização. Veiculo Pick-up Cab.dupla 2.8 4x4 Diesel. Engenheiro,Técnico e Auxiliar","Semana",96,{"$f":"F9/D9","v":16581.013125000001},{"$f":"'CRO1_Ins-Pro'!H22","v":1591777.26},{"$f":"F9*0.1","v":159177.72600000002},30000,{"$f":"H9*0.1","v":3000},500]
["Item 2 - MG e BA","Serviços de apoio à fiscalização. Veiculo Pick-up Cab.dupla 2.8 4x4 Diesel. Engenheiro,Técnico e Auxiliar","Semana",96,{"$f":"F10/D10","v":16581.013125000001},{"$f":"'CRO1_Ins-Pro'!I22","v":1591777.26},{"$f":"F10*0.1","v":159177.72600000002},45000,{"$f":"H10*0.1","v":4500},500]
{"$rows_left_out":33}
{"sheet":"PFP","index":1,"n_rows":45,"n_cols":27,"rows_kept":45,"cut":false,"hidden":false,"merged":[[27,9,27,12],[27,1,27,8],[26,9,26,12],[26,1,26,8],[34,1,34,12],[28,1,28,8],[28,9,28,12],[31,1,31,12],[30,1,30,12],[42,1,42,12],[35,1,35,12],[37,1,37,12],[29,1,29,12],[36,1,36,12],[32,1,32,12],[38,1,38,12],[39,1,39,12],[40,1,40,12],[41,1,41,12],[33,1,33,12],[0,1,1,10],[4,7,4,10],[0,11,0,12],[1,11,1,12],[4,11,4,12],[2,1,2,12],[3,1,3,12],[4,1,4,6],[4,23,4,26],[5,23,5,26],[5,11,5,12],[5,7,5,10],[25,1,25,8],[25,9,25,12],[5,1,5,6],[24,1,24,8],[24,9,24,12]]}
[null,"PROPOSTA FINANCEIRA DO PROJETO",{"$nulls":9},"CODIGO:"]
[{"$nulls":11},"PFP"]
[null,"NOME DA CONSULTORA:"]
[]
[null,"PROJETO:",{"$nulls":5},"CONTRATANTE:",null,null,null,"BASE:",{"$nulls":11},"Memória de Cálculo Equipe Técnica"]
[null,"Apoio à fiscalização e supervisão técnica dos serviços de revitalização na SEDE",{"$nulls":5},"CODEVASF (SEDE)",null,null,null,"2024-10-01",{"$nulls":11},"Atividades e Prazos"]
[null,"Base","Cod2","Cod3","Código","Categoria / Insumo","Uni","Qde","CUD","PU","FatorK","CT","PT","Encargos COMP E ADICIONAIS","SOCIAIS","TOTAIS",null,"Encargos Comp e Adicionais",{"$nulls":5},"Profissional","Quantidade","Prazo Mês","Lotação"]
[{"$nulls":6},"mês",{"$f":"'CRO1_Ins-Pro'!D5","v":0},0,{"$f":"ROUND(K8*I8,2)","v":0},0,{"$f":"ROUND(H8*I8,2)","v":0},{"$f":"ROUND(H8*J8,2)","v":0},{"$f":"P8-O8","v":1026.8900000000012},13451.98,14478.87,null,{"$f":"VLOOKUP(E8,MDO_DNIT!$A:$Z,26,0)","v":{"$error":"#N/A"}},{"$nulls":5},"Profissional","Quantidade","Prazo Mês","Lotação"]
[{"$nulls":6},"mês",{"$f":"'CRO1_Ins-Pro'!D6","v":0},0,0,0,0,0,1030.1900000000005,11533.74,12563.93,null,{"$f":"VLOOKUP(E9,MDO_DNIT!$A:$Z,26,0)","v":{"$error":"#N/A"}},{"$nulls":5},"Eng. Coordenador",1,12,"Escritório Goiânia"]
[null,"SICRO","MO1","P2","P8066","Engenheiro pleno (P8066)","mês",{"$f":"'CRO1_Ins-Pro'!D7","v":24},{"$f":"VLOOKUP(E10,MDO_DNIT!$A:$Z,4,0)","v":12629.6},{"$f":"ROUND(K10*I10,2)","v":26889.68},{"$f":"'PFP2.1_FatorKa'!$E$36","v":2.1291000000000002},{"$f":"ROUND(H10*I10,2)","v":303110.40000000002},{"$f":"ROUND(H10*J10,2)","v":645352.31999999995},1030.1899999999987,8980.3700000000008,10010.56,null,{"$f":"VLOOKUP(E10,MDO_DNIT!$A:$Z,26,0)","v":1071.7099999999991},{"$nulls":5},"Engenheiro pleno (P8066)",1,24,"Coordenador Geral "]
{"$rows_left_out":36}
{"sheet":"PFP2.1_FatorKa","index":2,"n_rows":41,"n_cols":6,"rows_kept":41,"cut":false,"hidden":false,"merged":[[35,1,35,3],[6,1,6,3],[40,0,40,5],[39,0,39,5],[38,0,38,5],[37,0,37,5],[22,1,22,3],[29,1,29,3],[30,1,30,3],[28,1,28,3],[25,1,25,3],[26,1,26,3],[27,1,27,3],[33,1,33,3],[31,1,31,3],[32,1,32,3],[34,1,34,3],[0,0,1,4],[2,0,2,5],[5,0,5,1],[5,2,5,4],[4,2,4,4],[3,0,3,5],[24,1,24,3],[7,1,7,3],[17,1,17,3],[8,1,8,3],[13,1,13,3],[14,1,14,3],[15,1,15,3],[18,1,18,3],[19,1,19,3],[20,1,20,3],[21,1,21,3],[23,1,23,3],[9,1,9,3],[10,1,10,3],[11,1,11,3],[12,1,12,3]]}
["DETALHAMENTO DOS ENCARGOS SOCIAIS: Ka",{"$nulls":4},"CODIGO:"]
[{"$nulls":5},"PFP-2.1"]
["NOME DA CONSULTORA:"]
[]
["PROJETO:",null,"CONTRATANTE:",null,null,{"$f":"PFP!L5","v":"BASE:"}]
[{"$f":"PFP!B6","v":"Apoio à fiscalização e supervisão técnica dos serviços de revitalização na SEDE"},null,"CODEVASF (SEDE)",null,null,"SINAPI/DF  Jun/2024"]
["Cod","DESCRIÇÃO",null,null,"%","R$"]
["A","ENCARGOS SOCIAIS BÁSICOS",null,null,{"$f":"ROUND(SUM(E9:E17),4)","v":0.378},{"$f":"ROUND(E8*SUMIF(PFP!$C$8:$C$24,\"MO1\",PFP!$L$8:$L$24),2)","v":730270.78}]
["A1","INSS",null,null,0.2,{"$f":"ROUND(E9*SUMIF(PFP!$C$8:$C$24,\"MO1\",PFP!$L$8:$L$24),2)","v":386386.66}]
["A2","SESI",null,null,1.4999999999999999E-2,{"$f":"ROUND(E10*SUMIF(PFP!$C$8:$C$24,\"MO1\",PFP!$L$8:$L$24),2)","v":28979}]
{"$rows_left_out":32}
{"sheet":"PFP2.2_FatorKb","index":3,"n_rows":40,"n_cols":6,"rows_kept":40,"cut":false,"hidden":false,"merged":[[27,1,27,3],[28,1,28,3],[29,1,29,3],[22,1,22,3],[23,1,23,3],[24,1,24,3],[25,1,25,3],[26,1,26,3],[6,1,6,3],[12,1,12,3],[13,1,13,3],[39,0,39,5],[36,0,36,5],[37,0,37,5],[38,0,38,5],[31,1,31,3],[32,1,32,3],[33,1,33,3],[34,1,34,3],[18,1,18,3],[30,1,30,3],[19,1,19,3],[20,1,20,3],[21,1,21,3],[0,0,1,4],[2,0,2,5],[3,0,3,5],[4,2,4,4],[5,0,5,1],[5,2,5,4],[7,1,7,3],[16,1,16,3],[17,1,17,3],[8,1,8,3],[9,1,9,3],[10,1,10,3],[14,1,14,3],[15,1,15,3],[11,1,11,3]]}
["DETALHAMENTO DOS ENCARGOS SOCIAIS: Kb",{"$nulls":4},"CODIGO:"]
[{"$nulls":5},"PFP-2.2"]
["NOME DA CONSULTORA:"]
[]
["PROJETO:",null,"CONTRATANTE:",null,null,{"$f":"'PFP2.1_FatorKa'!F5","v":"BASE:"}]
[{"$f":"PFP!B6","v":"Apoio à fiscalização e supervisão técnica dos serviços de revitalização na SEDE"},null,"CODEVASF (SEDE)",null,null,{"$f":"'PFP2.1_FatorKa'!F6","v":"SINAPI/DF  Jun/2024"}]
["Cod","DESCRIÇÃO",null,null,"%","R$"]
["A","ENCARGOS SOCIAIS BÁSICOS",null,null,{"$f":"ROUND(SUM(E9:E16),4)","v":0.2},{"$f":"ROUND(E8*SUMIF(PFP!$C$8:$C$24,\"MO2\",PFP!$L$8:$L$24),2)","v":0}]
["A1","INSS",null,null,0.2,{"$f":"ROUND(E9*SUMIF(PFP!$C$8:$C$24,\"MO2\",PFP!$L$8:$L$24),2)","v":0}]
["A2","SESI",null,null,0,{"$f":"ROUND(E10*SUMIF(PFP!$C$8:$C$24,\"MO2\",PFP!$L$8:$L$24),2)","v":0}]
{"$rows_left_out":31}
{"sheet":"PFP2.3_FatorKc","index":4,"n_rows":40,"n_cols":6,"rows_kept":40,"cut":false,"hidden":false,"merged":[[0,0,1,4],[2,0,2,5],[3,0,3,5],[4,2,4,4],[5,0,5,1],[5,2,5,4],[16,1,16,3],[6,1,6,3],[7,1,7,3],[8,1,8,3],[9,1,9,3],[10,1,10,3],[11,1,11,3],[12,1,12,3],[13,1,13,3],[14,1,14,3],[15,1,15,3],[28,1,28,3],[17,1,17,3],[18,1,18,3],[19,1,19,3],[20,1,20,3],[21,1,21,3],[22,1,22,3],[23,1,23,3],[24,1,24,3],[25,1,25,3],[26,1,26,3],[27,1,27,3],[36,0,36,5],[37,0,37,5],[38,0,38,5],[39,0,39,5],[29,1,29,3],[30,1,30,3],[31,1,31,3],[32,1,32,3],[33,1,33,3],[34,1,34,3]]}
["DETALHAMENTO DOS ENCARGOS SOCIAIS: Kc",{"$nulls":4},"CODIGO:"]
[{"$nulls":5},"PFP-2.3"]
["NOME DA CONSULTORA:"]
[]
["PROJETO:",null,"CONTRATANTE:",null,null,{"$f":"'PFP2.2_FatorKb'!F5","v":"BASE:"}]
[{"$f":"PFP!B6","v":"Apoio à fiscalização e supervisão técnica dos serviços de revitalização na SEDE"},null,"CODEVASF (SEDE)",null,null,{"$f":"'PFP2.2_FatorKb'!F6","v":"SINAPI/DF  Jun/2024"}]
["Cod","DESCRIÇÃO",null,null,"%","R$"]
["A","ENCARGOS SOCIAIS BÁSICOS",null,null,{"$f":"SUM(E9:E16)","v":0},{"$f":"ROUND(E8*SUMIF(PFP!$C$8:$C$24,\"MO3\",PFP!$L$8:$L$24),2)","v":0}]
["A1","INSS",null,null,0,{"$f":"ROUND(E8*SUMIF(PFP!$C$8:$C$24,\"MO3\",PFP!$L$8:$L$24),2)","v":0}]
["A2","SESI",null,null,0,{"$f":"ROUND(E9*SUMIF(PFP!$C$8:$C$24,\"MO3\",PFP!$L$8:$L$24),2)","v":0}]
{"$rows_left_out":31}
{"sheet":"PFP3_FatorKd","index":5,"n_rows":35,"n_cols":6,"rows_kept":35,"cut":false,"hidden":false,"merged":[[32,0,32,5],[12,1,12,3],[11,1,11,3],[8,1,8,2],[9,1,9,2],[10,1,10,2],[7,1,7,2],[25,0,25,5],[6,1,6,2],[0,0,1,4],[2,0,2,5],[5,0,5,1],[5,2,5,4],[4,2,4,4],[3,0,3,5],[33,0,33,5],[34,0,34,5],[16,1,16,3],[13,1,13,3],[14,1,14,3],[15,1,15,3],[21,0,21,5],[26,0,26,5],[27,0,27,5],[22,0,22,5],[23,0,23,5],[24,0,24,5],[28,0,28,5],[29,0,29,5],[30,0,30,5],[31,0,31,5]]}
["DESPESAS FISCAIS E CUSTOS DIVERSOS: Kc",{"$nulls":4},"CODIGO:"]
[{"$nulls":5},"PFP-3"]
["NOME DA CONSULTORA:"]
[]
["PROJETO:",null,"CONTRATANTE:",null,null,{"$f":"'PFP2.3_FatorKc'!F5","v":"BASE:"}]
[{"$f":"PFP!B6","v":"Apoio à fiscalização e supervisão técnica dos serviços de revitalização na SEDE"},null,"CODEVASF (SEDE)",null,null,{"$f":"'PFP2.3_FatorKc'!F6","v":"SINAPI/DF  Jun/2024"}]
["Cod","DESCRIÇÃO1",null,"% preço2","% custo4","R$"]
["K4","TRIBUTOS",null,{"$f":"ROUND(D9+D10+D11,4)","v":0.104},{"$f":"ROUND(E9+E10+E11,4)","v":0.11609999999999999},{"$f":"E8*SUM(SUMIF(PFP!$C$8:$C$24,\"MO1\",PFP!$L$8:$L$24)*(1+'PFP2.1_FatorKa'!$E$35)+SUMIF(PFP!$C$8:$C$24,\"MO2\",PFP!$L$8:$L$24)*(1+'PFP2.2_FatorKb'!$E$34)+SUMIF(PFP!$C$8:$C$24,\"<>MO*\",PFP!$L$8:$L$24)+$F$13+$F$12)","v":662321.44182253024}]
["K4.1","ISS",null,0.03,{"$f":"ROUND((1/(1-$D$8))*D9,4)","v":3.3500000000000002E-2},{"$f":"E9*SUM(SUMIF(PFP!$C$8:$C$24,\"MO1\",PFP!$L$8:$L$24)*(1+'PFP2.1_FatorKa'!$E$35)+SUMIF(PFP!$C$8:$C$24,\"MO2\",PFP!$L$8:$L$24)*(1+'PFP2.2_FatorKb'!$E$34)+SUMIF(PFP!$C$8:$C$24,\"<>MO*\",PFP!$L$8:$L$24)+$F$13+$F$12)","v":191109.11542682827}]
["K4.2","PIS3 - aliquota efetiva aplicavel percentual-desconto",null,{"$f":"ROUND(1.65%*0.8,4)","v":1.32E-2},{"$f":"ROUND((1/(1-$D$8))*D10,4)","v":1.47E-2},{"$f":"E10*SUM(SUMIF(PFP!$C$8:$C$24,\"MO1\",PFP!$L$8:$L$24)*(1+'PFP2.1_FatorKa'!$E$35)+SUMIF(PFP!$C$8:$C$24,\"MO2\",PFP!$L$8:$L$24)*(1+'PFP2.2_FatorKb'!$E$34)+SUMIF(PFP!$C$8:$C$24,\"<>MO*\",PFP!$L$8:$L$24)+$F$13+$F$12)","v":83859.820799235094}]
{"$rows_left_out":26}
{"sheet":"CRO1_Ins-Pro","index":6,"n_rows":89,"n_cols":12,"rows_kept":89,"cut":false,"hidden":false,"merged":[[87,0,87,7],[86,0,86,8],[21,0,22,0],[21,1,22,1],[2,0,3,0],[2,1,3,1],[2,2,3,2],[2,3,3,3],[2,4,3,4],[2,5,3,5],[2,7,2,10],[2,6,3,6]]}
["INSUMOS POR ETAPA/PRODUTO",{"$nulls":9},"CÓDIGO:"]
[{"$nulls":10},"CRO-1"]
["Cod.","Categoria / Insumo","Uni","Qde","CUD","PU","FatorK","Apoio à fiscalização "]
[{"$nulls":7},"Item 1","Item  2","Item  3","Item  4"]
[{"$f":"PFP!D8","v":0},null,"mês",{"$f":"SUM(H5:K5)","v":0},{"$f":"PFP!I8","v":0},{"$f":"PFP!J8","v":0},{"$f":"PFP!K8","v":0}]
[{"$f":"PFP!D9","v":0},null,"mês",0,{"$f":"PFP!I9","v":0},{"$f":"PFP!J9","v":0},{"$f":"PFP!K9","v":0}]
[{"$f":"PFP!D10","v":"P2"},{"$f":"PFP!F10","v":"Engenheiro pleno (P8066)"},"mês",24,{"$f":"PFP!I10","v":12629.6},{"$f":"PFP!J10","v":26889.68},{"$f":"PFP!K10","v":2.1291000000000002},{"$f":"'CRO2_Ins-Mes'!E7","v":6},{"$f":"'CRO2_Ins-Mes'!E24","v":6},{"$f":"'CRO2_Ins-Mes'!E40","v":6},{"$f":"'CRO2_Ins-Mes'!E56","v":6}]
[{"$f":"PFP!D11","v":"P3"},{"$f":"PFP!F11","v":"Engenheiro júnior (P8065)"},"mês",{"$f":"SUM(H8:K8)","v":96},{"$f":"PFP!I11","v":12002},{"$f":"PFP!J11","v":25553.46},{"$f":"PFP!K11","v":2.1291000000000002},{"$f":"'CRO2_Ins-Mes'!E8","v":24},{"$f":"'CRO2_Ins-Mes'!E25","v":24},{"$f":"'CRO2_Ins-Mes'!E41","v":24},{"$f":"'CRO2_Ins-Mes'!E57","v":24}]
[{"$f":"PFP!D12","v":"T1"},{"$f":"PFP!F12","v":"Técnico ambiental/geoprocessamento (P8143)"},"mês",{"$f":"SUM(H9:K9)","v":96},{"$f":"PFP!I12","v":2911.08},{"$f":"PFP!J12","v":6197.98},{"$f":"PFP!K12","v":2.1291000000000002},{"$f":"'CRO2_Ins-Mes'!E9","v":24},{"$f":"'CRO2_Ins-Mes'!E26","v":24},{"$f":"'CRO2_Ins-Mes'!E42","v":24},{"$f":"'CRO2_Ins-Mes'!E58","v":24}]
[{"$f":"PFP!D13","v":"T3"},{"$f":"PFP!F13","v":"Auxiliar de topografia/Auxiliar (P8028)"},"mês",96,{"$f":"PFP!I13","v":1583.76},{"$f":"PFP!J13","v":3371.98},{"$f":"PFP!K13","v":2.1291000000000002},{"$f":"'CRO2_Ins-Mes'!E10","v":24},{"$f":"'CRO2_Ins-Mes'!E27","v":24},{"$f":"'CRO2_Ins-Mes'!E43","v":24},{"$f":"'CRO2_Ins-Mes'!E59","v":24}]
{"$rows_left_out":19}
{"sheet":"CRO2_Ins-Mes","index":7,"n_rows":68,"n_cols":29,"rows_kept":68,"cut":false,"hidden":false,"merged":[[0,0,0,28],[1,5,1,28]]}
["CRONOGRAMA SIMPLIFICADO"]
[{"$nulls":5},"Relatórios Mensais de Andamento"]
["Cod1","Cod2","Produtos","Uni","Qde",1,2,3,4,5,6,7,8,9,10,11,12,13,14,15,16,17,18,19,20,21,22,23,24]
[null,null,"Relatórios Parcial ",{"$f":"PFP!G10","v":"mês"},{"$f":"SUM(F4:AC4)","v":96},4,4,4,4,4,4,4,4,4,4,4,4,4,4,4,4,4,4,4,4,4,4,4,4]
[null,null,"Relatórios  Final ",{"$f":"PFP!G11","v":"mês"},{"$f":"SUM(F5:AC5)","v":8},{"$nulls":11},4,{"$nulls":11},4]
["Cod1","Cod2","Insumos","Uni","Qde",1,2,3,4,5,6,7,8,9,10,11,12,13,14,15,16,17,18,19,20,21,22,23,24]
[1,{"$f":"PFP!D10","v":"P2"},{"$f":"PFP!F10","v":"Engenheiro pleno (P8066)"},{"$f":"PFP!G10","v":"mês"},{"$f":"SUM(F7:AC7)","v":6},0.25,0.25,0.25,0.25,0.25,0.25,0.25,0.25,0.25,0.25,0.25,0.25,0.25,0.25,0.25,0.25,0.25,0.25,0.25,0.25,0.25,0.25,0.25,0.25]
[1,{"$f":"PFP!D11","v":"P3"},{"$f":"PFP!F11","v":"Engenheiro júnior (P8065)"},{"$f":"PFP!G11","v":"mês"},24,1,1,1,1,1,1,1,1,1,1,1,1,1,1,1,1,1,1,1,1,1,1,1,1]
[1,{"$f":"PFP!D12","v":"T1"},{"$f":"PFP!F12","v":"Técnico ambiental/geoprocessamento (P8143)"},{"$f":"PFP!G12","v":"mês"},24,1,1,1,1,1,1,1,1,1,1,1,1,1,1,1,1,1,1,1,1,1,1,1,1]
[1,{"$f":"PFP!D13","v":"T3"},{"$f":"PFP!F13","v":"Auxiliar de topografia/Auxiliar (P8028)"},{"$f":"PFP!G13","v":"mês"},24,1,1,1,1,1,1,1,1,1,1,1,1,1,1,1,1,1,1,1,1,1,1,1,1]
{"$rows_left_out":59}
{"sheet":"Cronograma","index":8,"n_rows":40,"n_cols":26,"rows_kept":40,"cut":false,"hidden":false,"merged":[[16,0,16,10],[17,0,17,10],[6,0,7,0],[6,1,7,1],[6,2,6,25],[12,0,12,6],[14,0,14,10],[15,0,15,10],[5,0,5,1],[0,0,1,25],[2,0,2,25],[4,0,4,1],[4,11,4,17],[4,24,4,25]]}
["Cronograma Físico Financeiro"]
[]
["NOME DA CONSULTORA:"]
[]
["PROJETO:",{"$nulls":10},"OBJETO:",{"$nulls":12},"EDITAL:"]
["Revitalização",{"$nulls":10},{"$f":"PFP!B6","v":"Apoio à fiscalização e supervisão técnica dos serviços de revitalização na SEDE"}]
[null,"Total","Relatórios Mensais de Andamento"]
[null,null,1,2,3,4,5,6,7,8,9,10,11,12,13,14,15,16,17,18,19,20,21,22,23,24]
["Físico",100,{"$f":"$B$9/24","v":4.166666666666667},{"$f":"$B$9/24","v":4.166666666666667},4.166666666666667,4.166666666666667,4.166666666666667,4.166666666666667,4.166666666666667,4.166666666666667,4.166666666666667,4.166666666666667,4.166666666666667,4.166666666666667,4.166666666666667,4.166666666666667,4.166666666666667,4.166666666666667,4.166666666666667,4.166666666666667,4.166666666666667,4.166666666666667,4.166666666666667,4.166666666666667,4.166666666666667,4.166666666666667]
["Financeiro (R$)",{"$f":"SUM(C10:Z10)","v":6367109.04},{"$f":"'Planilha Resumo '!$F$13/24","v":265296.21000000002},{"$f":"'Planilha Resumo '!$F$13/24","v":265296.21000000002},{"$f":"'Planilha Resumo '!$F$13/24","v":265296.21000000002},{"$f":"'Planilha Resumo '!$F$13/24","v":265296.21000000002},{"$f":"'Planilha Resumo '!$F$13/24","v":265296.21000000002},{"$f":"'Planilha Resumo '!$F$13/24","v":265296.21000000002},{"$f":"'Planilha Resumo '!$F$13/24","v":265296.21000000002},{"$f":"'Planilha Resumo '!$F$13/24","v":265296.21000000002},{"$f":"'Planilha Resumo '!$F$13/24","v":265296.21000000002},{"$f":"'Planilha Resumo '!$F$13/24","v":265296.21000000002},{"$f":"'Planilha Resumo '!$F$13/24","v":265296.21000000002},{"$f":"'Planilha Resumo '!$F$13/24","v":265296.21000000002},{"$f":"'Planilha Resumo '!$F$13/24","v":265296.21000000002},{"$f":"'Planilha Resumo '!$F$13/24","v":265296.21000000002},{"$f":"'Planilha Resumo '!$F$13/24","v":265296.21000000002},{"$f":"'Planilha Resumo '!$F$13/24","v":265296.21000000002},{"$f":"'Planilha Resumo '!$F$13/24","v":265296.21000000002},{"$f":"'Planilha Resumo '!$F$13/24","v":265296.21000000002},{"$f":"'Planilha Resumo '!$F$13/24","v":265296.21000000002},{"$f":"'Planilha Resumo '!$F$13/24","v":265296.21000000002},{"$f":"'Planilha Resumo '!$F$13/24","v":265296.21000000002},{"$f":"'Planilha Resumo '!$F$13/24","v":265296.21000000002},{"$f":"'Planilha Resumo '!$F$13/24","v":265296.21000000002},{"$f":"'Planilha Resumo '!$F$13/24","v":265296.21000000002}]
{"$rows_left_out":9}
{"sheet":"CPU HOSPEDAGEM","index":9,"n_rows":19,"n_cols":5,"rows_kept":19,"cut":false,"hidden":false,"merged":[[2,1,2,2]]}
[{"$nulls":4},"BASE:"]
[null,"Engenharia Consultiva da Codevasf"]
[null,"CPU - HOSPEDAGEM EQUIPE DE CAMPO (3 PESSOAS/MÊS)",null,"Código/Referencia"]
[null,"ALUGUEL ",3074.56,"F020003334/EMBASA","Jul/EMBASA"]
[null," Aquisição de Mobiliário",{"$f":"43.89*C16","v":131.67000000000002},"B8954/DNIT"]
[null,"Material de limpeza e diarista",{"$f":"126.93+(123*8)","v":1110.93},"10563/ORSE - E200300131/EMBASA","Jul/EMBASA"]
[null,"manutenção da casa alugada - Serviços Gerais/Vigia ",2706.8,"41096/SINAPI","Ago/SINAPI"]
[null,"Energia ",180,"10555/ORSE"]
[null,"Água",394.99,"10554/ORSE"]
[null,"telefone/Internet",{"$f":"154.99+89","v":243.99},"10557/10558/ORSE"]
{"$rows_left_out":10}
{"sheet":"CPU-VEICULO_PickUp","index":10,"n_rows":61,"n_cols":33,"rows_kept":61,"cut":false,"hidden":false,"merged":[[52,19,52,26],[4,0,4,2],[6,0,6,2],[7,0,7,1],[7,4,7,7],[8,0,8,2],[52,8,52,18]]}
[]
[]
[]
[]
["Composição de Preços de Locação de Veículo tipo pick-up"]
[null,"Data de atualização:","2024-01-22",null,"CV","Média","Mediana",null,null,null,"CV","Média","Mediana",{"$nulls":8},"CV","Média","Mediana"]
["CODEVASF ",null,null,null,{"$f":"_xlfn.STDEV.S(E10:H10)/AVERAGE(E10:H10)","v":9.2667922664402616E-2},{"$f":"AVERAGE(E10:H10)","v":179935.5},{"$f":"MEDIAN(E10:H10)","v":184702},null,null,null,{"$f":"_xlfn.STDEV.S(L9:S9)/AVERAGE(L9:S9)","v":0.20952494145854728},{"$f":"AVERAGE(L9:S9)","v":31.095714285714287},{"$f":"MEDIAN(L9:S9)","v":30.16},{"$nulls":8},{"$f":"_xlfn.STDEV.S(W9:AD9)/AVERAGE(W9:AD9)","v":0.13240988535259646},{"$f":"AVERAGE(W9:AD9)","v":430.60093749999999},{"$f":"MEDIAN(W9:AD9)","v":437.31624999999997}]
["OBS:               Preço sem BDI e sem motorista                                                                   BDI=",null,null,null,"Preço FIPE ",{"$nulls":4},"PRODUTO ","MENOR (MÉDIA, MEDIANA)","COT. 1","COT. 2","COT. 3","COT. 4","COT. 5","COT. 6","COT. 7","COT. 8",null,"PRODUTO","MENOR (MÉDIA, MEDIANA)","COT. 1","COT. 2","COT. 3","COT. 4","COT. 5","COT. 6","COT. 7","COT. 8"]
["Veículo tipo pick-up, cabine dupla - 2.0 16V 4x4 diesel Aut.",null,null,null,"Toro Ultra 2.0 16V 4x4 TB Diesel Aut.","Toro Freedom 2.0 16V 4x4 TB Diesel Aut.","Toro Volcano 2.0 16V 4x4 TB Diesel Aut."," Toro Ranch 2.0 16V 4x4 TB Diesel Aut.\n",null,"LUBRIFICANTE 5W30",{"$f":"SMALL(L7:M7,1)","v":30.16},32.270000000000003,28.9,30.16,37.700000000000003,39.99,20.25,28.4,null,null,"Pneu 225/65 R17",{"$f":"SMALL(W7:X7,1)","v":430.60093749999999},{"$f":"1661.85/4","v":415.46249999999998},{"$f":"1940.9/4","v":485.22500000000002},399.88,330.46,479.6,386.23,459.17,488.78]
[null,"Custo Mensal (R$):",{"$f":"C51","v":7163.7901683616183},null,193030,157308,177450,191954]
{"$rows_left_out":52}
{"sheet":"Cotação Voos","index":11,"n_rows":104,"n_cols":5,"rows_kept":104,"cut":false,"hidden":false,"merged":[]}
["COTAÇÕES - IDA DIA 07/04/2024 E VOLTA DIA 11/04/2024"]
[]
["BSB - PALMAS","Cia 1","Cia 2","Cia 3","Média"]
[null,760,760,1308,{"$f":"AVERAGE(B4:D4)","v":942.66666666666663}]
{"$rows_empty":24}
["BSB - Macapá","Cia 1","Cia 2","Cia 3","Média"]
[null,1306,1591,1882,{"$f":"AVERAGE(B30:D30)","v":1593}]
{"$rows_empty":24}
["BSB - Montes Claros","Cia 1","Cia 2","Cia 3","Média"]
[null,856,927,1354,{"$f":"AVERAGE(B56:D56)","v":1045.6666666666667}]
{"$rows_left_out":6}
{"sheet":"PFS-X -Equipamentos","index":12,"n_rows":58,"n_cols":17,"rows_kept":58,"cut":false,"hidden":false,"merged":[[46,15,48,15],[0,0,0,5],[46,6,48,6],[46,12,48,12],[46,13,48,13],[46,14,48,14],[27,0,27,1],[21,0,21,1],[33,0,33,1],[39,0,39,1]]}
["COMPOSIÇÃO DO CUSTO MENSAL - EQUIPAMENTOS DE INFORMÁTICA: NOTEBOOK,DRONE , RTK, RTK"]
[]
["A – DEPRECIAÇÃO MENSAL DOS EQUIPAMENTOS"]
["A.1 Preço de aquisição (Cotação)",{"$nulls":4},{"$f":"SUM(B26,B32,B38,B44)","v":63709.66}]
["A.2 Tempo previsto de vida útil (meses)",{"$nulls":4},48]
["A.3 Previsão de recup. na venda do bem usado (%)",{"$nulls":4},0.5]
["A.4 CUSTO MENSAL   "]
[{"$nulls":5},{"$f":"(F4-(F6*F4))/F5","v":663.64229166666667}]
[]
["B – JUROS PELO CAPITAL EMPREGADO"]
{"$rows_left_out":49}
{"sheet":"MDO_DNIT","index":13,"n_rows":113,"n_cols":27,"rows_kept":113,"cut":false,"hidden":false,"merged":[[1,20,1,21],[0,25,1,25],[0,16,0,21],[0,22,1,23],[0,24,1,24],[1,16,1,17],[1,18,1,19],[0,6,0,15],[0,0,2,0],[0,1,2,1],[0,2,2,2],[0,3,1,3],[0,4,1,5],[1,6,1,7],[1,8,1,9],[1,10,1,11],[1,12,1,13],[1,14,1,15]]}
["Código","Categoria","Unid.","Salário","Encargos Sociais",null,"Encargos Complementares",{"$nulls":9},"Encargos Adicionais",{"$nulls":5},"Encargos Totais",null,"Valor Total","Encargos Adicionais e Complementares","BASE:"]
[{"$nulls":6},"Alimentação",null,"EPI",null,"Ferramenta",null,"Transporte",null,"Exame Ocupacional",null,"Cesta Básica",null,"Assistência Médica",null,"Seguro de Vida",{"$nulls":5},"SINAPI/DF  Set/2024"]
[null,null,null,"R$","%","R$","%","R$","%","R$","%","R$","%","R$","%","R$","%","R$","%","R$","%","R$","%","R$","R$","R$"]
["Profissionais mensalistas"]
["P8001","Advogado júnior","mês",4616.38,0.79300000000000004,3660.79,0.15959999999999999,736.74,5.4999999999999997E-3,25.51,0,0,0,0,5.9999999999999995E-4,2.95,0,0,6.4000000000000001E-2,295.48,2.2000000000000001E-3,9.98,1.0248999999999999,4731.45,9347.83,{"$f":"Y5-F5-D5","v":1070.6599999999999}]
["P8002","Advogado pleno","mês",6155.17,0.79300000000000004,4881.05,0.1197,736.74,4.1000000000000003E-3,25.51,0,0,0,0,5.0000000000000001E-4,2.95,0,0,4.8000000000000001E-2,295.48,1.6000000000000001E-3,9.98,0.96689999999999998,5951.71,12106.89,{"$f":"Y6-F6-D6","v":1070.6699999999992}]
["P8003","Advogado sênior","mês",11441.04,0.79300000000000004,9072.75,6.4399999999999999E-2,736.74,2.2000000000000001E-3,25.51,0,0,0,0,2.9999999999999997E-4,2.95,0,0,2.58E-2,295.48,8.9999999999999998E-4,9.98,0.88660000000000005,10143.41,21584.45,1070.6599999999999]
["P8007","Analista de desenvolvimento de sistemas júnior","mês",4690.87,0.79630000000000001,3735.34,0.15709999999999999,736.74,0,0,0,0,0,0,8.0000000000000004E-4,3.74,0,0,6.3E-2,295.48,2.0999999999999999E-3,9.98,1.0193000000000001,4781.28,9472.16,1045.9499999999998]
["P8008","Analista de desenvolvimento de sistemas pleno","mês",5657.08,0.79630000000000001,4504.74,0.13020000000000001,736.74,0,0,0,0,0,0,6.9999999999999999E-4,3.74,0,0,5.2200000000000003E-2,295.48,1.8E-3,9.98,0.98119999999999996,5550.68,11207.76,1045.9400000000005]
["P8009","Analista de desenvolvimento de sistemas sênior","mês",9897.56,0.79630000000000001,7881.43,7.4399999999999994E-2,736.74,0,0,0,0,0,0,4.0000000000000002E-4,3.74,0,0,2.9899999999999999E-2,295.48,1E-3,9.98,0.90200000000000002,8927.3700000000008,18824.919999999998,1045.9299999999985]
{"$rows_left_out":104}
{"sheet":"COT. VANT","index":14,"n_rows":17,"n_cols":10,"rows_kept":17,"cut":false,"hidden":true,"merged":[[1,0,1,9],[7,0,9,0],[7,1,7,5],[8,1,8,5],[9,1,9,5]]}
[]
["COTAÇÃO ORÇAMENTÁRIA DE LEVANTAMENTO PLANIALTIMÉTRICO POR MEIO DE VANT PARA ÁREA NA CIDADE DE PINDARÉ-MIRIM-MA"]
["MÊS/ANO DE REFERÊNCIA ","ÁREA DO PROJETO [ha]","EMPRESA","LOCALIDADE","WEBSITE","CONTATO","AVALIAÇÃO TÉCNICA DA PROPOSTA","PREÇO","PREÇO UNITÁRIO","RELAÇÃO CUSTO-BENEFÍCIO"]
["2022-09-01",50,"DRONES SOLUTION","SALVADOR-BA","http://www.dronessolution.com.br/","contato@dronessolution.com.br","SATISFATÓRIA",9800,{"$f":"(H4/B4)","v":196},"A"]
["2022-09-01",50,"ERG","BELO HORIZONTE-MG","http://www.ergbh.com.br/","comercial@ergbh.com.br","SATISFATÓRIA",13240.5,{"$f":"(H5/B5)","v":264.81},"B"]
["2022-09-01",50,"CEPEMAR","VITÓRIA-ES","http://www.cepemar.com.br/","comercial@cepemar.com.br","SATISFATÓRIA",63000,{"$f":"(H6/B6)","v":1260},"C"]
[]
["Observações","  1. Na cotação acima já estão iclusos: Planejamento Aerotogramétrico, Voo Aerotoforamétrico, Apoio de Campo, Aerotriangulação, Restituição, MDT, MDS, Ortofotos, Edição/Revisão e Entrega Final.",{"$nulls":4},"CV com todos valores:",{"$f":"STDEVA(H4:H6)/AVERAGE(H4:H6)","v":1.0380549324194583}]
[null,"  2. INCONCLUSIVA: não apresentou o orçamento de forma detalhada.",{"$nulls":4},"CV tirando o maior valor:",{"$f":"STDEVA(H4:H5)/AVERAGE(H4:H5)","v":0.21117604918923782}]
[null,"  3. SATISFATÓRIA: apresentou, no mínimo, os requisitos básicos de um orçamento.",{"$nulls":4},"Média tirando o maior valor:",{"$f":"AVERAGE(H4:H5)","v":11520.25},"Valor para a área de 65ha"]
{"$rows_left_out":7}